{"text_format":"3","workbook":"xlsx","n_sheets":10,"sheets":["Accueil","Notice","Renseignements","Programmation","Période","Bulletin2","Bulletin","Formules","Appréciations","Socle"],"not_rendered":{"images":1,"macros":1,"defined_names":108},"read":"whole","date_system":"1900"}

{"sheet":"Accueil","index":0,"n_rows":22,"n_cols":2,"rows_kept":22,"merged":[[2,1,2,11],[3,1,3,11],[4,1,4,11],[5,1,5,11],[7,1,7,11],[9,1,9,11],[11,1,11,11],[13,1,13,11],[21,1,21,11]]}
[]
[]
[null,"PROGRAMMATION, EVALUATION DES COMPETENCES DU"]
[null,"CYCLE 2"]
[null,"Nécessite d'accepter les macros *"]
[null,"NOTICE D'UTLISATION"]
[]
[null,"  -1                             Saisir les renseignements"]
[]
[null,"   -2                            Etablir la programmation des compétences par période"]
[]
[null,"  - 3                            Saisie des appréciations par période"]
[]
[null,"   -4                            Edition du socle commun"]
[]
[null,"* Vous pouvez avoir besoin de modifier votre niveau de sécurité s'il est trop élevé, cochez faible (ce logiciel est sans danger)"]
[]
[]
[]
[]
[]
[null,"Le livret cycle 2 version 4 by Eric Di Donfrancesco sont mis à disposition selon les termes de la licence Creative Commons Paternité - Pas d'Utilisation Commerciale - Partage des Conditions Initiales à l'Identique 3.0 Unported."]

{"sheet":"Notice","index":1,"n_rows":40,"n_cols":2,"rows_kept":40}
[null,"NOTICE"]
[]
[null,"Principes de bases  :  \nCette version du livret permet de  modifier à votre guise les compétences, en rajouter, les récrire, les préciser selon la période évaluée. \nLes feuilles d'évaluation (périodes) et les feuilles bulletins ne sont créées qu'au fur et à mesure des besoins. "]
[]
[null,"Les versions :  \nCette version fonctionne sous PC avec  excel 2010 et plus. Si vous utilisez une version plus ancienne téléchargez la version XLS (excel 97 2000) du livret. Les conversions sont sources d'erreurs.  Les versions trop anciennes d'excel (95) risquent de mal fonctionner.  Il est recommandé d'éviter de passer d'une version à l'autre, ou de mac à PC avec le même livret."]
[null,"Si vous utilisez mac excel "]
[null,"Renseignements :     onglet renseignement"]
[null,"Renseigner dans les cadres blancs les données de l’école et de la classe, puis ceux des élèves (nom et prénom).\nVous pouvez modifier le type de notes ou créer les vôtres en cochant l'option. "]
[null,"Puis aller à la page programmation pour établir votre programmation des compétences abordées par période."]
[]
[null,"Les compétences: onglet programmation"]
[null,"Dans l'onglet \"programmation\" vous avez les compétences du BO. Vous pouvez les modifier de plusieurs façons:\n- En les réécrivant dans la cellule\n- En ajoutant des lignes pour mettre de nouvelles compétences.\nPour ajouter des lignes : il faut sélectionner une cellule numérotée de la première colonne  (sauf les bleues qui correspondent aux titres) et cliquer sur le bouton \"ajouter \". Vous pouvez en ajouter autant de fois que vous voulez. Idem pour suprimer.\nUne fois que vous avez fini vos modifications, cliquez sur le bouton \"valider les modifications\" sinon elles ne seront pas prises en compte dans la génération des périodes."]
[]
[null,"Programmation :  onglet programmation"]
[null,"Sélectionner votre niveau de classe en cliquant sur le bouton CP, CE1  pour filtrer les compétences. Vous pouvez aussi choisir de les afficher toutes, en cliquant sur le bouton \"tout cycle\". \nSi vous avez crée des nouvelles compétences vous pouvez les affecter à un niveau en ajoutant un 1 dans la colonnes correspondantes"]
[null,"Remarque : si vous avez un double-niveau et que vous voulez n'utiliser qu'un bulletin,  utiliser le bouton tout cycle pour voir apparaître l’ensemble des compétences du cycle . "]
[null,"Cocher par une croix (x) les compétences que vous allez aborder dans chaque période. Colonnes P1 P2 …"]
[]
[null,"Évaluation des compétences de chaque élève par période :"]
[null,"Une fois les compétences à évaluer programmées dans les périodes, vous allez créer la grille d'évaluation de la période qui vous intéresse en cliquant sur les boutons P1, P2.. en haut des colonnes concernées. Vous pouvez évaluer chacun de vos élèves dans un tableau collectif (4 degrés d’évaluation et NE – Non Évalué-).\nSi vous modifiez de nouveau la programmation, elle sera prise en compte dans vos feuilles périodes. Par contre une fois une période créée vous ne pouvez plus ajouter ou enlever des compétences sur cette dernière."]
[]
[null,"La feuille d'évaluation:  (onglets P1, P2, P3, P4, P5) "]
[null,"Elles se nomment P1, P2, P3, P4 ou P5 Quand vous l'ouvrez, cliquez sur le bouton \"mise à jour de la feuille\" pour filtrer les colonnes vides et actualiser les compétences programmées. Vous pouvez ensuite mettre les notes . \nPour supprimer une feuille période il faut passer par les macros: en cliquant sur le bouton Effacer. La boite de dialogue apparaitra et vous choisirez la période à supprimer. "]
[]
[null,"Saisie des appréciations par période :"]
[null,"Pour chaque enfant, vous noterez dans un tableau collectif l’appréciation littérale concernant la période. Vous pouvez aussi noter les jours d’absences. La cellule s'adaptera à la longueur de votre texte."]
[]
[null,"Bulletin : onglets B1, B2, B3, B4, B5, BT1, BT2, BT3 Bilan  "]
[null,"Une fois les évaluations terminées vous devez générer le bulletin correspondant ( B1 pour P1)  utiliser le bouton Bulletin présent dans les feuilles périodes.  Après avoir choisi l’enfant dans la liste déroulante et la période, vous pourrez cliquer sur le bouton imprimer, ou imprimez en passant par le menu. Vous pouvez aussi générer des bulletins PDF. Si vous cliquez sur \"imprimer tout\" toutes les feuilles sortiront mais pas en recto verso.\nLes bulletins trimestriels : BT1, BT2  fusionnent deux périodes P1 et P2 pour le premier trimestre et P2 P3 pour le deuxième. Le trimestre 3  BT3 reprend la période 5\nLe bilan annuel : si vous générez cette feuille, toutes les compétences évaluées sur le nombre de période que vous aurez choisi se reporteront sur cette feuille. si une compétence a été évaluée plusieurs fois; c'est la dernière note qui l'emporte (vous pouvez toujours modifier manuellement cela). Attention la génération de cette feuille prend un certain temps de calcul"]
[]
[null,"Édition du socle commun : onglet socle"]
[null,"En fin d’année de cycle, il est possible d’éditer le livret du socle commun pour chaque élève."]
[null,"Si la moyenne des compétences nécessaires à l’obtention de celle du socle est supérieure à 70 % alors la compétence est notée acquise. \nLe socle se réfère au bilan annuel, il vous demande donc de créer cette page si vous ne l'avez pas fait pour valider le socle."]
[null,"Les compétences qui sont liées au socle sont codées dans une case jaune (à gauche) Il est recommandé de ne pas les effacer ou les transformer."]
[null,"Pour valider les compétences du socle, un bouton est prévu qui fixera une date de validation à chaque fois que vous l’utiliserez. La date de la compétence validée ne changera plus. Vous pouvez aussi valider manuellement en mettant vous-même une date dans la case du tableau à gauche"]
[]
[null,"Pour l’enseignant des tableaux statistiques peuvent être utiles :"]
[null,"Sur chaque période vous pouvez voir les pourcentages d'acquisition pour chaque compétences."]
[null,"bilan élèves: C'est un bulletin qui reprend les compétences sur toute l'année, il se réfère à la feuille \"Année\" le même sous forme synoptique regroupant l’ensemble des élèves de la classe."]
[null,"Sur la feuille \"Année\" vous avez, comme sur les autres périodes, un bilan des compétences qui montre, pour la classe, les compétences réussies, à renforcer, en cours d’acquisition ou non acquises par période ou sur l'année."]

{"sheet":"Renseignements","index":2,"n_rows":49,"n_cols":16,"rows_kept":49,"merged":[[1,2,1,6],[2,2,2,3],[2,4,2,6],[3,2,3,3],[3,4,3,6],[4,2,4,3],[4,4,4,6],[5,2,5,3],[5,4,5,6],[6,2,6,3],[6,4,6,6],[7,2,7,3],[7,4,7,6],[8,2,8,3],[8,4,8,6],[9,2,9,3],[9,4,9,6],[10,2,10,3],[10,4,10,6],[13,2,13,4],[18,7,18,11]]}
[]
[null,null,"RENSEIGNEMENTS"]
[null,null,"Académie"]
[null,null,"Circonscription "]
[null,null,"Ville"]
[null,null,"Ecole",null,"Léonard de Vinci"]
[null,null,"Adresse"]
[null,null,"Cycle",null,3]
[null,null,"Classe",null,"CM1"]
[null,null,"Enseignant",null,"M. DURANT"]
[null,null,"Année",null,"2013  2014"]
[]
[]
[null,null,"LISTE",{"$nulls":4},"CHOIX DU TYPE DE NOTATION"]
[null,null,"Prénom","Nom","Né le"]
[null,1,"Marc","Aurèle","1999-11-12",{"$nulls":10},{"$f":"CONCATENATE(C16,\"  \",D16)","v":"Marc  Aurèle"}]
[null,2,"Jérôme","Lenoir","1998-07-04",{"$nulls":10},{"$f":"CONCATENATE(C17,\"  \",D17)","v":"Jérôme  Lenoir"}]
[null,3,"Fabien","Léglise","1999-10-05",{"$nulls":10},"Fabien  Léglise"]
[null,4,"Aicha","Samarahoui","1999-12-03",null,null,"NOTATION LIBRE",{"$nulls":7},"Aicha  Samarahoui"]
[null,5,"Karim","Maha","2000-03-30",{"$nulls":7},"NE",null,null,"Karim  Maha"]
[null,6,{"$nulls":13},"  "]
[null,7,{"$nulls":13},"  "]
[null,8,{"$nulls":13},"  "]
[null,9,{"$nulls":13},"  "]
[null,10,{"$nulls":13},"  "]
[null,11,{"$nulls":13},"  "]
[null,12,{"$nulls":13},"  "]
[null,13,{"$nulls":13},"  "]
[null,14,{"$nulls":13},"  "]
[null,15,{"$nulls":13},"  "]
[null,16,{"$nulls":13},"  "]
[null,17,{"$nulls":13},"  "]
[null,18,{"$nulls":13},"  "]
[null,19,{"$nulls":13},"  "]
[null,20,{"$nulls":13},"  "]
[null,21,{"$nulls":13},"  "]
[null,22,{"$nulls":13},"  "]
[null,23,{"$nulls":13},"  "]
[null,24,{"$nulls":13},"  "]
[null,25,{"$nulls":13},"  "]
[null,26,{"$nulls":13},"  "]
[null,27,{"$nulls":13},"  "]
[null,28,{"$nulls":13},"  "]
[null,29,{"$nulls":13},"  "]
[null,30,{"$nulls":13},"  "]
[null,31,{"$nulls":13},"  "]
[null,32,{"$nulls":13},"  "]
[null,33,{"$nulls":13},"  "]
[null,null,{"$f":"COUNTIF(C16:C48,\"*\")","v":5}]

{"sheet":"Programmation","index":3,"n_rows":222,"n_cols":21,"rows_kept":222,"merged":[[0,0,1,1],[0,2,3,2],[0,8,2,16],[0,18,2,18]]}
["Ajout, suppression de lignes :\nSelectionner une cellule de la colonne A  (sauf les bleues) et cliquer sur un bouton",null,"Si vous modifiez cette feuille, (ajouts de lignes, récriture des compétences) : Vous devez valider cette modification",{"$nulls":5},"1)  Choisir les compétences à  travailler par période en mettant une croix (x) dans les cases P1, P2…\n\n2) Cliquer sur un bouton pour générer la grille d'évaluation de la période voulue.",{"$nulls":9},"Fusionne toutes les notes de l'année"]
[]
[{"$nulls":20},"socle"]
[{"$nulls":8},"P1",null,"P2",null,"P3",null,"P4",null,"P5",{"$nulls":3},185]
[5,null,"LANGAGE ORAL",1,1,1,1,null,"x",null,"x",{"$nulls":7},{"$f":"IF(COUNTIF(I5:Q5,\"X\"),\"X\",\"\")","v":"X"}]
[6,"LO1","S’exprimer de façon correcte : prononcer les sons et les mots avec exactitude, respecter l’organisation de la phrase, formuler correctement des questions.",1,1,1,null,null,"X",null,"X",{"$nulls":7},"X"]
[7,"LO2","Rapporter clairement un événement ou une information très simple : exprimer les relations de causalité, les circonstances temporelles et spatiales, utiliser de manière adéquate les temps verbaux (présent, futur, imparfait, passé composé).",1,1,null,1,null,"x",null,"x",{"$nulls":7},"X"]
[8,"LO3","Manifester sa compréhension d’un récit ou d’un texte documentaire lu par un tiers en répondant à des questions le concernant : reformuler le contenu d’un paragraphe ou d’un texte, identifier les personnages principaux d’un récit. ",1,1,1,1,{"$nulls":3},"x",{"$nulls":7},"X"]
[9,"LO4","Raconter une histoire déjà entendue en s’appuyant sur des illustrations.",1,1,null,1,null,"x",null,"x",{"$nulls":7},"X"]
[10,"LO5","Décrire des images (illustrations, photographies…). ",1,1,null,1,null,"x",null,"x",{"$nulls":7},"X"]
[11,"LO4","Raconter une histoire déjà entendue en s’appuyant sur des illustrations.",1,1,null,1,null,"x",{"$nulls":9},"X"]
[12,"LO6","Reformuler une consigne.",1,1,1,1,null,"x",{"$nulls":9},"X"]
[13,"LO7","Prendre part à des échanges verbaux tout en sachant écouter les autres ; poser des questions.",1,1,null,1,{"$nulls":11},""]
[14,"LO8","Réciter des comptines ou de courts poèmes (une dizaine) en ménageant des respirations, et sans commettre d’erreur (sans oubli ou substitution).  ",1,1,1,1,{"$nulls":11},""]
[15,".LO9","Faire un récit structuré (relations causales, circonstances temporelles et spatiales précises) et compréhensible pour un tiers ignorant des faits rapportés ou de l’histoire racontée.",1,null,1,1,{"$nulls":11},"",null,1]
[16,".LO10","S’exprimer avec précision pour se faire comprendre dans les activités scolaires.",1,null,1,1,{"$nulls":11},"",null,1]
[17,".LO11","Présenter à la classe un travail individuel ou collectif.",1,null,1,1,{"$nulls":11},"",null,1]
[18,".LO12","Participer à un échange : questionner, apporter des réponses, écouter et donner un point de vue en respectant les règles de la communication.",1,null,1,1,{"$nulls":11},"",null,1]
[19,".LO13","Réciter des textes en prose ou des poèmes (une dizaine), en les interprétant par l’intonation",1,null,1,1,null,"x",null,"x",{"$nulls":7},"X",null,1]
[20,"","LECTURE",1,1,1,1,null,{"$f":"IF(COUNTIF(I21:I25,\"x\")>0,\"x\",0)","v":"x"},null,{"$f":"IF(COUNTIF(K21:K25,\"x\")>0,\"x\",0)","v":"x"},null,{"$f":"IF(COUNTIF(M21:M25,\"x\")>0,\"x\",0)","v":0},null,{"$f":"IF(COUNTIF(O21:O25,\"x\")>0,\"x\",0)","v":0},null,{"$f":"IF(COUNTIF(Q21:Q25,\"x\")>0,\"x\",0)","v":0},null,"X"]
[21,"LE1","Connaître le nom des lettres et l’ordre alphabétique.",1,1,1,1,null,"x",null,"x",{"$nulls":7},"X"]
[22,"LE2","Distinguer entre la lettre et le son qu’elle transcrit ; connaître les correspondances entre les lettres et les sons dans les graphies simples (ex. f ; o) et complexes (ex. ph ; au, eau).",1,1,1,1,null,"x",null,"x",{"$nulls":7},"X"]
[23,"LE3","Savoir qu'une syllabe est composée d'une ou plusieurs graphies, qu'un mot est composé d'une ou plusieurs syllabes ; être capable de repérer ces éléments (graphies, syllabes) dans un mot.",1,1,1,1,null,"x",{"$nulls":9},"X"]
[24,"LE4","Connaître les correspondances entre minuscules et majuscules d’imprimerie, minuscules et majuscules cursives.",1,1,1,1,null,"x",{"$nulls":9},"X"]
[25,"LE5","Lire aisément les mots étudiés. ",1,1,1,1,null,"x",{"$nulls":9},"X"]
[26,"LE6","Déchiffrer des mots réguliers inconnus.",1,1,1,1,{"$nulls":11},""]
[27,"LE7","Lire aisément les mots les plus fréquemment rencontrés (dits mots-outils).",1,1,1,1,{"$nulls":3},"X",{"$nulls":7},"X"]
[28,".LE8","Lire à haute voix un texte court dont les mots ont été étudiés, en articulant correctement et en respectant la ponctuation.",1,1,1,1,{"$nulls":3},"X",{"$nulls":7},"X",null,1]
[29,"LE9","Connaître et utiliser le vocabulaire spécifique de la lecture d’un texte : le livre, la couverture, la page, la ligne ; l’auteur, le titre ; le texte, la phrase, le mot ; le début, la fin, le personnage, l’histoire.",1,1,1,1,{"$nulls":11},""]
[30,"LE10","Dire de qui ou de quoi parle le texte lu ; trouver dans le texte ou son illustration la réponse à des questions concernant le texte lu ; reformuler son sens.",1,1,null,1,{"$nulls":11},""]
[31,"LE11","Ecouter lire des œuvres intégrales, notamment de littérature de jeunesse.",1,1,null,1,{"$nulls":11},""]
[32,".LE12","Lire silencieusement un texte en déchiffrant les mots inconnus et manifester sa compréhension dans un résumé, une reformulation, des réponses à des questions.",1,null,1,1,{"$nulls":11},"",null,1]
[33,"LE13","Lire silencieusement un énoncé, une consigne, et comprendre ce qui est attendu.",1,null,1,1,{"$nulls":11},""]
[34,"LE14","Participer à une lecture dialoguée : articulation correcte, fluidité, respect de la ponctuation, intonation appropriée.",1,null,1,1,{"$nulls":11},""]
[35,".LE15","Ecouter et lire des œuvres intégrales courtes ou de larges extraits d’œuvres plus longues.",1,null,1,1,{"$nulls":11},"",null,1]
[36,".LE16","Identifier les personnages, les événements et les circonstances temporelles et spatiales d’un récit qu’on a lu.",1,null,1,1,{"$nulls":11},"",null,1]
[37,".LE17","Comparer un texte nouvellement entendu ou lu avec un ou des textes connus (thèmes, personnages, événements, fin).",1,null,1,1,{"$nulls":11},"",null,1]
[38,"LE18","Lire ou écouter lire des œuvres intégrales, notamment de littérature de jeunesse et rendre compte de sa lecture.",1,null,null,1,{"$nulls":11},""]
[39,"","ECRITURE",1,null,1,1,null,{"$f":"IF(COUNTIF(I40:I42,\"x\")>0,\"x\",0)","v":0},null,{"$f":"IF(COUNTIF(K40:K42,\"x\")>0,\"x\",0)","v":0},null,{"$f":"IF(COUNTIF(M40:M42,\"x\")>0,\"x\",0)","v":0},null,{"$f":"IF(COUNTIF(O40:O42,\"x\")>0,\"x\",0)","v":0},null,{"$f":"IF(COUNTIF(Q40:Q42,\"x\")>0,\"x\",0)","v":0},null,""]
[40,"EC1","Copier un texte très court dans une écriture cursive lisible, sur des lignes, non lettre à lettre mais mot par mot (en prenant appui sur les syllabes qui le composent), en respectant les liaisons entre les lettres, les accents, les espaces entre les mots, les signes de ponctuation, les majuscules.",1,1,1,1,{"$nulls":11},""]
[41,"EC2","Écrire sans erreur, sous la dictée, des syllabes, des mots et de courtes phrases dont les graphies ont été étudiées.",1,1,null,1,{"$nulls":11},""]
[42,"EC3","Choisir et écrire de manière autonome des mots simples en respectant les correspondances entre lettres et sons.",1,1,null,1,{"$nulls":11},""]
[43,"EC4","Concevoir et écrire collectivement avec l’aide du maître une phrase simple cohérente, puis plusieurs. ",1,1,null,1,{"$nulls":11},""]
[44,"EC5","Comparer sa production écrite à un modèle et rectifier ses erreurs.",1,1,null,1,{"$nulls":11},""]
[45,"EC6","Produire un travail écrit soigné ; maîtriser son attitude et son geste pour écrire avec aisance ; prendre soin des outils du travail scolaire. ",1,1,null,1,{"$nulls":11},""]
[46,".EC7"," Copier un court texte (par mots entiers ou groupes de mots) en respectant l’orthographe, la ponctuation, les majuscules et en soignant la présentation.",1,1,null,1,{"$nulls":11},"",null,1]
[47,".EC8","En particulier, copier avec soin, en respectant la mise en page, un texte en prose ou poème appris en récitation ; réaliser un dessin pour l’illustrer.",1,null,1,1,{"$nulls":11},"",null,1]
[48,"EC9","Écrire sans erreur, sous la dictée, des phrases ou un court texte (5 lignes), préparés ou non, en utilisant ses connaissances orthographiques et grammaticales, ",1,null,1,1,{"$nulls":11},""]
[49,".EC10","Concevoir et écrire de manière autonome une phrase simple cohérente, puis plusieurs, puis un texte narratif ou explicatif de 5 à 10 lignes.",1,null,1,1,{"$nulls":11},"",null,1]
[50,".EC11","Rédiger différents types de textes d’au moins deux paragraphes en veillant à leur cohérence  , en évitant les répétitions, et en respectant les contraintes syntaxiques et orthographiques ainsi que la ponctuation.",1,null,1,1,{"$nulls":11},"",null,1]
[51,".EC12","Ecrire un texte de type poétique en obéissant à une ou plusieurs consignes précises.",1,null,1,1,{"$nulls":11},"",null,1]
[52,"","VOCABULAIRE",1,null,1,1,null,{"$f":"IF(COUNTIF(I53:I61,\"x\")>0,\"x\",0)","v":0},null,{"$f":"IF(COUNTIF(K53:K61,\"x\")>0,\"x\",0)","v":0},null,{"$f":"IF(COUNTIF(M53:M61,\"x\")>0,\"x\",0)","v":0},null,{"$f":"IF(COUNTIF(O53:O61,\"x\")>0,\"x\",0)","v":0},null,{"$f":"IF(COUNTIF(Q53:Q61,\"x\")>0,\"x\",0)","v":0},null,""]
[53,".VO1","Utiliser des mots précis pour s’exprimer",1,1,1,1,{"$nulls":11},"",null,1]
[54,"VO2","Commencer à classer les noms par catégories sémantiques larges (noms de personnes, noms d’animaux, noms de choses) ou plus étroites et se référant au monde concret (ex. : noms de fruits).",1,1,1,1,{"$nulls":11},""]
[55,"VO3","Trouver un ou des noms appartenant à une catégorie donnée (ex. un nom d’arbre, un nom de commerçant). ",1,1,1,1,{"$nulls":11},""]
[56,"VO4","Trouver un mot de sens opposé pour un adjectif qualificatif ou un verbe d’action. ",1,1,1,1,{"$nulls":11},""]
[57,"VO5","Ranger des mots par ordre alphabétique.",1,1,null,1,{"$nulls":11},""]
[58,".VO6","Donner des synonymes (par exemple pour reformuler le sens d’un texte ou pour améliorer une expression orale ou écrite).",1,1,1,1,{"$nulls":11},"",null,1]
[59,".VO7","Trouver un mot de sens opposé pour un adjectif qualificatif, un verbe d’action ou pour un nom  ",1,null,1,1,{"$nulls":11},"",null,1]
[60,".VO8","Regrouper des mots par familles ; trouver un ou des mots d’une famille donnée.",1,null,1,1,{"$nulls":11},"",null,1]
[61,".VO9","Commencer à utiliser l’ordre alphabétique pour vérifier dans un dictionnaire l’écriture d’un mot ou en chercher le sens.",1,null,1,1,{"$nulls":11},"",null,1]
[62,""," GRAMMAIRE",1,null,1,1,null,{"$f":"IF(COUNTIF(I63:I87,\"x\")>0,\"x\",0)","v":0},null,{"$f":"IF(COUNTIF(K63:K87,\"x\")>0,\"x\",0)","v":0},null,{"$f":"IF(COUNTIF(M63:M87,\"x\")>0,\"x\",0)","v":0},null,{"$f":"IF(COUNTIF(O63:O87,\"x\")>0,\"x\",0)","v":0},null,{"$f":"IF(COUNTIF(Q63:Q87,\"x\")>0,\"x\",0)","v":0},null,""]
[63,"","La phrase",1,1,1,1,null,{"$f":"IF(COUNTIF(I64:I65,\"x\")>0,\"x\",0)","v":0},null,{"$f":"IF(COUNTIF(K64:K65,\"x\")>0,\"x\",0)","v":0},null,{"$f":"IF(COUNTIF(M64:M65,\"x\")>0,\"x\",0)","v":0},null,{"$f":"IF(COUNTIF(O64:O65,\"x\")>0,\"x\",0)","v":0},null,{"$f":"IF(COUNTIF(Q64:Q65,\"x\")>0,\"x\",0)","v":0},null,""]
[64,"GR1","identifier les phrases d’un texte en s’appuyant sur la ponctuation (point et majuscule). ",1,1,1,1,{"$nulls":11},""]
[65,"GR2","approche des formes et types de phrase : savoir transposer oralement une phrase affirmative en phrase négative ou interrogative.",1,1,1,1,{"$nulls":11},""]
[66,"","Les classes de mots",1,null,1,1,null,{"$f":"IF(COUNTIF(I67:I74,\"x\")>0,\"x\",0)","v":0},null,{"$f":"IF(COUNTIF(K67:K74,\"x\")>0,\"x\",0)","v":0},null,{"$f":"IF(COUNTIF(M67:M74,\"x\")>0,\"x\",0)","v":0},null,{"$f":"IF(COUNTIF(O67:O74,\"x\")>0,\"x\",0)","v":0},null,{"$f":"IF(COUNTIF(Q67:Q74,\"x\")>0,\"x\",0)","v":0},null,""]
[67,"GR3","reconnaître les noms et les verbes et les distinguer des autres mots ",1,1,1,1,{"$nulls":11},{"$f":"IF(COUNTIF(I67:Q67,\"X\"),\"X\",\"\")","v":""}]
[68,"GR4","distinguer le nom et l’article qui le précède ; identifier l’article ",1,1,null,1,{"$nulls":11},""]
[69,"GR5","approche du pronom : savoir utiliser oralement les pronoms personnels sujets.",1,1,null,1,{"$nulls":11},""]
[70,".GR6","- distinguer selon leur nature : les verbes, les noms, les articles, les pronoms personnels (formes sujet), les adjectifs qualificatifs ;",1,1,null,1,{"$nulls":11},"",null,1]
[71,"GR7","- le nom : distinguer nom propre et nom commun ;",1,null,1,1,{"$nulls":11},""]
[72,"GR8","- l’article : commencer à repérer les articles élidés (l’) et contractés (du, au, aux) ;",1,null,1,1,{"$nulls":11},""]
[73,"GR9","- manipuler d’autres déterminants ;",1,null,1,1,{"$nulls":11},""]
[74,"GR10","- approche de l’adverbe : modifier le sens d’un verbe en ajoutant un adverbe.",1,null,1,1,{"$nulls":11},""]
[75,"","Les fonctions",1,null,1,1,null,{"$f":"IF(COUNTIF(I76:I77,\"x\")>0,\"x\",0)","v":0},null,{"$f":"IF(COUNTIF(K76:K77,\"x\")>0,\"x\",0)","v":0},null,{"$f":"IF(COUNTIF(M76:M77,\"x\")>0,\"x\",0)","v":0},null,{"$f":"IF(COUNTIF(O76:O77,\"x\")>0,\"x\",0)","v":0},null,{"$f":"IF(COUNTIF(Q76:Q77,\"x\")>0,\"x\",0)","v":0},null,""]
[76,".GR11","dans la phrase simple où l’ordre syntaxique régulier sujet-verbe est respecté, identifier le verbe et son sujet (sous la forme d’un nom propre, d’un pronom, ou d’un groupe nominal) ;",1,null,1,1,{"$nulls":11},"",null,1]
[77,"GR12","approche de la notion de circonstance : savoir répondre oralement aux questions où ?, quand ?, pourquoi ?, comment ? ",1,null,1,1,{"$nulls":11},""]
[78,"","Les genres et nombres",1,null,1,1,null,{"$f":"IF(COUNTIF(I79:I81,\"x\")>0,\"x\",0)","v":0},null,{"$f":"IF(COUNTIF(K79:K81,\"x\")>0,\"x\",0)","v":0},null,{"$f":"IF(COUNTIF(M79:M81,\"x\")>0,\"x\",0)","v":0},null,{"$f":"IF(COUNTIF(O79:O81,\"x\")>0,\"x\",0)","v":0},null,{"$f":"IF(COUNTIF(Q79:Q81,\"x\")>0,\"x\",0)","v":0},null,""]
[79,"GR13","repérer et justifier des marques du genre et du nombre : les du pluriel des noms, le e du féminin de l’adjectif, les terminaisons –nt des verbes du 1er groupe au présent de l’indicatif. ",1,1,1,1,{"$nulls":11},""]
[80,"GR14","connaître et appliquer les notions de masculin/féminin, singulier/pluriel ;",1,1,null,1,{"$nulls":11},""]
[81,"GR15","connaître et appliquer la règle de l’accord du verbe avec son sujet, et, dans le groupe nominal, la règle de l’accord entre le déterminant et le nom qu’il détermine, entre l’adjectif qualificatif et le nom qu’il qualifie.",1,null,1,1,{"$nulls":11},""]
[82,"","Le verbe",1,null,1,1,null,{"$f":"IF(COUNTIF(I83:I87,\"x\")>0,\"x\",0)","v":0},null,{"$f":"IF(COUNTIF(K83:K87,\"x\")>0,\"x\",0)","v":0},null,{"$f":"IF(COUNTIF(M83:M87,\"x\")>0,\"x\",0)","v":0},null,{"$f":"IF(COUNTIF(O83:O87,\"x\")>0,\"x\",0)","v":0},null,{"$f":"IF(COUNTIF(Q83:Q87,\"x\")>0,\"x\",0)","v":0},null,""]
[83,"GR16","utiliser à l’oral, le présent, le futur et le passé composé.",1,1,1,1,{"$nulls":11},""]
[84,".GR17","comprendre la correspondance entre les temps verbaux (passé, présent,   futur) et les notions d’action déjà faite, action en train de se faire, action non encore faite.",1,1,null,1,{"$nulls":11},"",null,1]
[85,".GR18","identifier le présent, futur, imparfait et passé composé de l’indicatif des verbes étudiés ; trouver leur infinitif ; ",1,null,1,1,{"$nulls":11},"",null,1]
[86,".GR19","conjuguer les verbes du premier groupe, être et avoir, au présent, au futur, au passé composé de l’indicatif ;",1,null,1,1,{"$nulls":11},"",null,1]
[87,"GR20","conjuguer les verbes faire, aller, dire, venir  au présent de l’indicatif..",1,null,1,1,{"$nulls":11},""]
[88,"","ORTHOGRAPHE",1,null,1,1,null,{"$f":"IF(COUNTIF(I89:I102,\"x\")>0,\"x\",0)","v":0},null,{"$f":"IF(COUNTIF(K89:K102,\"x\")>0,\"x\",0)","v":0},null,{"$f":"IF(COUNTIF(M89:M102,\"x\")>0,\"x\",0)","v":0},null,{"$f":"IF(COUNTIF(O89:O102,\"x\")>0,\"x\",0)","v":0},null,{"$f":"IF(COUNTIF(Q89:Q102,\"x\")>0,\"x\",0)","v":0},null,""]
[89,"OR1","Écrire sans erreur des mots appris.",1,1,1,1,{"$nulls":11},""]
[90,"OR2","Ecrire sans erreur de manière autonome des mots simples en respectant les correspondances entre lettres et sons.",1,1,null,1,{"$nulls":11},""]
[91,"OR3","Recopier sans erreur un texte court (2 à 5 lignes).",1,1,null,1,{"$nulls":11},""]
[92,"OR4","Commencer à utiliser de manière autonome les marques du genre et du nombre (pluriel du nom, féminin de l’adjectif, terminaison –nt des verbes du 1er groupe).",1,1,null,1,{"$nulls":11},""]
[93,"OR5","Commencer à utiliser correctement la majuscule (débuts de phrase, noms propres de personne). ",1,1,null,1,{"$nulls":11},""]
[94,".OR6","Écrire sans erreur, sous la dictée, des phrases ou un court texte (5 lignes), préparés ou non, en utilisant ses connaissances lexicales, orthographiques et grammaticales. ",1,1,1,1,{"$nulls":11},"",null,1]
[95,"OR7","Dans les productions dictées et autonomes :",1,null,1,1,{"$nulls":11},""]
[96,".OR8","respecter les correspondances entre lettres et sons,",1,null,1,1,{"$nulls":11},"",null,1]
[97,".OR9","en particulier, respecter les règles relatives à la valeur des lettres en fonction des voyelles placées à proximité (c/ç, c/qu, g/gu/ge, s/ss),",1,null,1,1,{"$nulls":11},"",null,1]
[98,"OR10","orthographier sans erreur les mots invariables les plus fréquemment rencontrés ainsi que les mots-outils appris au CP, ",1,null,1,1,{"$nulls":11},""]
[99,".OR11","marquer l’accord entre le sujet et le verbe dans les phrases où l’ordre sujet-verbe est respecté,",1,null,1,1,{"$nulls":11},"",null,1]
[100,".OR12","dans le groupe nominal simple, marquer l’accord de l’adjectif qualificatif avec le nom qu’il qualifie,",1,null,1,1,{"$nulls":11},"",null,1]
[101,".OR13","orthographier sans erreur les formes conjuguées apprises,",1,null,1,1,{"$nulls":11},"",null,1]
[102,"OR14","utiliser à bon escient le point, la majuscule, ainsi que la virgule dans le cas de l’énumération.",1,null,1,1,{"$nulls":11},""]
[103,""," NOMBRE ET CALCUL",1,null,1,1,null,{"$f":"IF(COUNTIF(I104:I130,\"x\")>0,\"x\",0)","v":0},null,{"$f":"IF(COUNTIF(K104:K130,\"x\")>0,\"x\",0)","v":0},null,{"$f":"IF(COUNTIF(M104:M130,\"x\")>0,\"x\",0)","v":0},null,{"$f":"IF(COUNTIF(O104:O130,\"x\")>0,\"x\",0)","v":0},null,{"$f":"IF(COUNTIF(Q104:Q130,\"x\")>0,\"x\",0)","v":0},null,""]
[104,"NB1","Connaître (savoir écrire et nommer) les nombres entiers naturels inférieurs à 100.",1,1,1,1,{"$nulls":11},""]
[105,"NB2","Produire et reconnaître les décompositions additives des nombres inférieurs à 20 (« table d’addition »).",1,1,null,1,{"$nulls":11},""]
[106,"NB3","Comparer, ranger, encadrer ces nombres.",1,1,null,1,{"$nulls":11},""]
[107,"NB4","Écrire une suite de nombres dans l’ordre croissant ou décroissant.",1,1,null,1,{"$nulls":11},""]
[108,"NB5","Connaître les doubles des nombres inférieurs à 10 et les moitiés des nombres pairs inférieurs à 20.",1,1,null,1,{"$nulls":11},""]
[109,"NB6","Connaître la table de multiplication par 2.",1,1,null,1,{"$nulls":11},""]
[110,"NB7","Calculer mentalement des sommes et des différences.",1,1,null,1,{"$nulls":11},""]
[111,"NB8","Calculer en ligne des sommes, des différences, des opérations à trous.",1,1,null,1,{"$nulls":11},""]
[112,"NB9","Connaître et utiliser les techniques opératoires de l’addition et commencer à utliser celles de la soustraction (sur les nombres inférieurs à 100).",1,1,null,1,{"$nulls":11},""]
[113,"NB10","Résoudre des problèmes simples à une opération. ",1,1,null,1,{"$nulls":11},""]
[114,".NB11","Connaître (savoir écrire et nommer) les nombres entiers naturels inférieurs à 1 000.",1,1,null,1,{"$nulls":11},"",null,1]
[115,".NB12","Repérer et placer ces nombres sur une droite graduée, les comparer, les ranger, les encadrer.",1,null,1,1,{"$nulls":11},"",null,1]
[116,"NB13","Écrire ou dire des suites de nombres de 10 en 10, de 100 en 100, etc.",1,null,1,1,{"$nulls":11},""]
[117,"NB14","Connaître les doubles et moitiés de nombres d’usage courant.",1,null,1,1,{"$nulls":11},""]
[118,".NB15","Mémoriser les tables de multiplication par 2, 3, 4 et 5.",1,null,1,1,{"$nulls":11},"",null,1]
[119,".NB16","Connaître et utiliser des procédures de calcul mental pour calculer des sommes, des différences et des produits.",1,null,1,1,{"$nulls":11},"",null,1]
[120,".NB17","Calculer en ligne des suites d’opérations.",1,null,1,1,{"$nulls":11},"",null,1]
[121,".NB18","Connaître et utiliser les techniques opératoires de l’addition et de la soustraction (sur les nombres inférieurs à 1 000).",1,null,1,1,{"$nulls":11},"",null,1]
[122,".NB19","Connaître une technique opératoire de la multiplication et l’utiliser pour effectuer des multiplications par un nombre à un chiffre.",1,null,1,1,{"$nulls":11},"",null,1]
[123,".NB20","Diviser par 2 ou 5 des nombres inférieurs à 100 (quotient exact entier).",1,null,1,1,{"$nulls":11},"",null,1]
[124,".NB21","Résoudre des problèmes relevant de l’addition, de la soustraction et de la multiplication.",1,null,1,1,{"$nulls":11},"",null,1]
[125,"NB22","Approcher la division de deux nombres entiers à partir d’un problème de partage ou de groupements.",1,null,1,1,{"$nulls":11},""]
[126,".NB23","Utiliser les fonctions de base de la calculatrice. ",1,null,1,1,{"$nulls":11},"",null,1]
[127,"","Problèmes ",1,null,1,1,null,{"$f":"IF(COUNTIF(I128:I130,\"x\")>0,\"x\",0)","v":0},null,{"$f":"IF(COUNTIF(K128:K130,\"x\")>0,\"x\",0)","v":0},null,{"$f":"IF(COUNTIF(M128:M130,\"x\")>0,\"x\",0)","v":0},null,{"$f":"IF(COUNTIF(O128:O130,\"x\")>0,\"x\",0)","v":0},null,{"$f":"IF(COUNTIF(Q128:Q130,\"x\")>0,\"x\",0)","v":0},null,""]
[128,"PB1",null,1,1,1,1,{"$nulls":11},""]
[129,"PB2",null,1,1,1,1,{"$nulls":11},""]
[130,"PB3",null,1,1,null,1,{"$nulls":11},""]
[131,null,"GEOMETRIE",1,1,null,1,null,{"$f":"IF(COUNTIF(I132:I143,\"x\")>0,\"x\",0)","v":0},null,{"$f":"IF(COUNTIF(K132:K143,\"x\")>0,\"x\",0)","v":0},null,{"$f":"IF(COUNTIF(M132:M143,\"x\")>0,\"x\",0)","v":0},null,{"$f":"IF(COUNTIF(O132:O143,\"x\")>0,\"x\",0)","v":0},null,{"$f":"IF(COUNTIF(Q132:Q143,\"x\")>0,\"x\",0)","v":0},null,{"$f":"IF(COUNTIF(I131:Q131,\"X\"),\"X\",\"\")","v":""}]
[132,".GE1","Situer un objet et utiliser le vocabulaire permettant de définir des positions (devant, derrière, à gauche de, à droite de…).",1,1,null,1,{"$nulls":11},"",null,1]
[133,"GE2","Reconnaître et nommer un carré, un rectangle, un triangle.",1,1,null,1,{"$nulls":11},""]
[134,"GE3","Reproduire des figures géométriques simples à l’aide d’instruments ou de techniques : règle, quadrillage, papier calque.",1,1,null,1,{"$nulls":11},""]
[135,"GE4","Reconnaître et nommer le cube et le pavé droit.",1,1,null,1,{"$nulls":11},""]
[136,"GE5","S’initier au vocabulaire géométrique.",1,1,null,1,{"$nulls":11},""]
[137,".GE6","Décrire, reproduire, tracer un carré,  un rectangle, un triangle rectangle.",1,1,null,1,{"$nulls":11},"",null,1]
[138,".GE7","Utiliser des instruments pour réaliser des tracés : règle, équerre ou gabarit de l’angle droit.",1,null,1,1,{"$nulls":11},"",null,1]
[139,".GE8","Percevoir et reconnaître quelques relations et propriétés géométriques : alignement, angle droit, axe de symétrie, égalité de longueurs.",1,null,1,1,{"$nulls":11},"",null,1]
[140,".GE9","Repérer des cases, des nœuds d’un quadrillage.",1,null,1,1,{"$nulls":11},"",null,1]
[141,".GE10","Connaître et utiliser un vocabulaire géométrique élémentaire approprié.",1,null,1,1,{"$nulls":11},"",null,1]
[142,".GE11"," Reconnaître, décrire, nommer quelques solides  droits : cube, pavé..",1,null,1,1,{"$nulls":11},"",null,1]
[143,".GE12"," Résoudre des problèmes géométriques",1,null,1,1,{"$nulls":11},"",null,1]
[144,""," GRANDEURS ET MESURE",1,null,1,1,null,{"$f":"IF(COUNTIF(I145:I153,\"x\")>0,\"x\",0)","v":0},null,{"$f":"IF(COUNTIF(K145:K153,\"x\")>0,\"x\",0)","v":0},null,{"$f":"IF(COUNTIF(M145:M153,\"x\")>0,\"x\",0)","v":0},null,{"$f":"IF(COUNTIF(O145:O153,\"x\")>0,\"x\",0)","v":0},null,{"$f":"IF(COUNTIF(Q145:Q153,\"x\")>0,\"x\",0)","v":0},null,""]
[145,"GM1","Repérer des évènements de la journée en utilisant les heures et les demi heures.",1,1,1,1,{"$nulls":11},""]
[146,"GM2","Comparer et classer des objets selon leur longueur et leur masse.",1,1,null,1,{"$nulls":11},""]
[147,"GM3","Utiliser la règle graduée pour tracer des segments, comparer des longueurs ",1,1,null,1,{"$nulls":11},""]
[148,"GM4","Connaître et utiliser l’euro.",1,1,null,1,{"$nulls":11},""]
[149,"GM5","Résoudre des problèmes de vie courante.",1,1,1,1,{"$nulls":11},""]
[150,".GM6"," Utiliser un calendrier pour comparer des durées.",1,1,null,1,{"$nulls":11},"",null,1]
[151,".GM7","Connaître la relation entre heure et minute, mètre et centimètre, kilomètre et mètre, kilogramme et gramme, euro et centimes d’euro.",1,1,null,1,{"$nulls":11},"",null,1]
[152,".GM8","Mesurer des segments, des distances.",1,1,null,1,{"$nulls":11},"",null,1]
[153,".GM9","Résoudre des problèmes de longueur et de masse.",1,null,1,1,{"$nulls":11},"",null,1]
[154,null," ORGANISATION ET GESTION DES DONNEES",1,null,1,1,null,{"$f":"IF(COUNTIF(I155:I157,\"x\")>0,\"x\",0)","v":0},null,{"$f":"IF(COUNTIF(K155:K157,\"x\")>0,\"x\",0)","v":0},null,{"$f":"IF(COUNTIF(M155:M157,\"x\")>0,\"x\",0)","v":0},null,{"$f":"IF(COUNTIF(O155:O157,\"x\")>0,\"x\",0)","v":0},null,{"$f":"IF(COUNTIF(Q155:Q157,\"x\")>0,\"x\",0)","v":0},null,""]
[155,"OG1","Lire ou compléter un tableau dans des situations concrètes simples.",1,1,1,1,{"$nulls":11},""]
[156,".OG2","Utiliser un tableau, un graphique.",1,1,1,1,{"$nulls":11},"",null,1]
[157,".OG3","Organiser les informations d’un énoncé",1,null,1,1,{"$nulls":11},"",null,1]
[158,null,"DECOUVERTE DU MONDE",1,null,1,1,null,{"$f":"IF(COUNTIF(I159:I173,\"x\")>0,\"x\",0)","v":0},null,{"$f":"IF(COUNTIF(K159:K173,\"x\")>0,\"x\",0)","v":0},null,{"$f":"IF(COUNTIF(M159:M173,\"x\")>0,\"x\",0)","v":0},null,{"$f":"IF(COUNTIF(O159:O173,\"x\")>0,\"x\",0)","v":0},null,{"$f":"IF(COUNTIF(Q159:Q173,\"x\")>0,\"x\",0)","v":0},null,""]
[159,null,"Se répérer dans l'espace et le temps",1,1,1,1,null,{"$f":"IF(COUNTIF(I160:I164,\"x\")>0,\"x\",0)","v":0},null,{"$f":"IF(COUNTIF(K160:K164,\"x\")>0,\"x\",0)","v":0},null,{"$f":"IF(COUNTIF(M160:M164,\"x\")>0,\"x\",0)","v":0},null,{"$f":"IF(COUNTIF(O160:O164,\"x\")>0,\"x\",0)","v":0},null,{"$f":"IF(COUNTIF(Q160:Q164,\"x\")>0,\"x\",0)","v":0},null,""]
[160,"DM1","Elaborer des représentations simples de l’espace familier : la classe, l’école, le quartier, le village, la ville. ",1,1,1,1,{"$nulls":11},""]
[161,"DM2","Comparer ces milieux familiers avec d’autres milieux et espaces plus lointains. Ils découvrent des formes usuelles de représentation de l’espace (photographies, cartes, mappemondes, planisphères, globe).",1,1,1,1,{"$nulls":11},""]
[162,"DM3","Découvrir des formes usuelles de représentation de l’espace (photographies, cartes, mappemondes, planisphères, globe).",1,1,1,1,{"$nulls":11},""]
[163,"DM4","Repérer l’alternance jour-nuit, les semaines, les mois, les saisons. ",1,1,1,1,{"$nulls":11},""]
[164,"DM5","Utiliser des outils de repérage et de mesure du temps : le calendrier, l’horloge.",1,1,1,1,{"$nulls":11},""]
[165,null,"Découvrir le monde du vivant, de la matière et des objets ",1,1,1,1,null,{"$f":"IF(COUNTIF(I166:I169,\"x\")>0,\"x\",0)","v":0},null,{"$f":"IF(COUNTIF(K166:K169,\"x\")>0,\"x\",0)","v":0},null,{"$f":"IF(COUNTIF(M166:M169,\"x\")>0,\"x\",0)","v":0},null,{"$f":"IF(COUNTIF(O166:O169,\"x\")>0,\"x\",0)","v":0},null,{"$f":"IF(COUNTIF(Q166:Q169,\"x\")>0,\"x\",0)","v":0},null,""]
[166,"DM7","Repérer des caractéristiques du vivant : naissance, croissance et reproduction ; nutrition et régimes alimentaires des animaux.",1,1,1,1,{"$nulls":11},""]
[167,"DM8","Apprendre quelques règles d’hygiène et de sécurité personnelles et collectives.",1,1,1,1,{"$nulls":11},""]
[168,"DM9","Comprendre les interactions entre les êtres vivants et leur environnement ",1,1,1,1,{"$nulls":11},""]
[169,"DM10","Respecter l’environnement.",1,1,1,1,{"$nulls":11},""]
[170,"DM11","Distinguer les solides et les liquides.",1,1,1,1,{"$nulls":11},""]
[171,"DM12","Percevoir les changements d’états de la matière.",1,1,1,1,{"$nulls":11},""]
[172,"DM13","Réaliser des maquettes élémentaires",1,1,1,1,{"$nulls":11},""]
[173,"DM14","Réaliser des circuits électriques simples pour comprendre le fonctionnement d’un appareil. ",1,1,1,1,{"$nulls":11},""]
[174,null,"PRATIQUES ARTISTIQUES ET HISTOIRE DE L'ART",1,1,1,1,null,{"$f":"IF(COUNTIF(I175:I189,\"x\")>0,\"x\",0)","v":0},null,{"$f":"IF(COUNTIF(K175:K189,\"x\")>0,\"x\",0)","v":0},null,{"$f":"IF(COUNTIF(M175:M189,\"x\")>0,\"x\",0)","v":0},null,{"$f":"IF(COUNTIF(O175:O189,\"x\")>0,\"x\",0)","v":0},null,{"$f":"IF(COUNTIF(Q175:Q189,\"x\")>0,\"x\",0)","v":0},null,""]
[175,null,"Arts visuels",1,1,1,1,null,{"$f":"IF(COUNTIF(I176:I178,\"x\")>0,\"x\",0)","v":0},null,{"$f":"IF(COUNTIF(K176:K178,\"x\")>0,\"x\",0)","v":0},null,{"$f":"IF(COUNTIF(M176:M178,\"x\")>0,\"x\",0)","v":0},null,{"$f":"IF(COUNTIF(O176:O178,\"x\")>0,\"x\",0)","v":0},null,{"$f":"IF(COUNTIF(Q176:Q178,\"x\")>0,\"x\",0)","v":0},null,""]
[176,"PA1","Utiliser des techniques traditionnelles : peinture, dessin",1,1,1,1,{"$nulls":11},""]
[177,"PA2","Utiliser des techniques contemporaines : phto numérique, cinéma, vidéo, infographie",1,1,1,1,{"$nulls":11},""]
[178,"PA3","Utiliser des procédures simples mais combinées : recouvrement, tracés, montage",1,1,1,1,{"$nulls":11},""]
[179,"PA4","Savoir travailler autant en surface qu’en volume.",1,1,1,1,{"$nulls":11},""]
[180,"PA5","Savoir utiliser des instruments, des gestes techniques, des médiums et des supports variés.",1,1,1,1,{"$nulls":11},""]
[181,"PA6","Exprimer ce que l’on perçoit.",1,1,1,1,{"$nulls":11},""]
[182,"PA7","Imaginer et évoquer un projet ou une réalisation en utilisant un vocabulaire approprié",1,1,1,1,{"$nulls":11},""]
[183,null,"Éducation musicale",1,1,1,1,null,{"$f":"IF(COUNTIF(I184:I189,\"x\")>0,\"x\",0)","v":0},null,{"$f":"IF(COUNTIF(K184:K189,\"x\")>0,\"x\",0)","v":0},null,{"$f":"IF(COUNTIF(M184:M189,\"x\")>0,\"x\",0)","v":0},null,{"$f":"IF(COUNTIF(O184:O189,\"x\")>0,\"x\",0)","v":0},null,{"$f":"IF(COUNTIF(Q184:Q189,\"x\")>0,\"x\",0)","v":0},null,""]
[184,"PA8","Apprendre une dizaine de comptines ou chansons.",1,1,1,1,{"$nulls":11},""]
[185,"PA9","Ecouter des extraits d’oeuvres diverses.",1,1,1,1,{"$nulls":11},""]
[186,"PA10","chanter en portant attention à la justesse tonale, à l’exactitude rythmique, à la puissance de la voix, à la respiration et à l’articulation ",1,1,1,1,{"$nulls":11},""]
[187,"PA11","Apprendre à respecter les exigences d’une expression musicale collective.",1,1,1,1,{"$nulls":11},""]
[188,"PA12","Repérer des éléments musicaux caractéristiques très simples, concernant les thèmes mélodiques, les rythmes et le tempo, les intensités, les timbres",1,1,1,1,{"$nulls":11},""]
[189,"PA13","commencent à reconnaître les grandes familles d’instruments.",1,1,1,1,{"$nulls":11},""]
[190,null,"LVE",1,1,1,1,null,{"$f":"IF(COUNTIF(I191:I191,\"x\")>0,\"x\",0)","v":0},null,{"$f":"IF(COUNTIF(K191:K191,\"x\")>0,\"x\",0)","v":0},null,{"$f":"IF(COUNTIF(M191:M191,\"x\")>0,\"x\",0)","v":0},null,{"$f":"IF(COUNTIF(O191:O191,\"x\")>0,\"x\",0)","v":0},null,{"$f":"IF(COUNTIF(Q191:Q191,\"x\")>0,\"x\",0)","v":0},null,""]
[191,"LVE1"," comprendre et utiliser des énoncés simples de la vie quotidienne.",1,1,1,1,{"$nulls":11},""]
[192,null,"EDUCATION PHYSIQUE ET SPORTIVE",1,1,1,1,null,{"$f":"IF(COUNTIF(I193:I207,\"x\")>0,\"x\",0)","v":0},null,{"$f":"IF(COUNTIF(K193:K207,\"x\")>0,\"x\",0)","v":0},null,{"$f":"IF(COUNTIF(M193:M207,\"x\")>0,\"x\",0)","v":0},null,{"$f":"IF(COUNTIF(O193:O207,\"x\")>0,\"x\",0)","v":0},null,{"$f":"IF(COUNTIF(Q193:Q207,\"x\")>0,\"x\",0)","v":0},null,""]
[193,null,"Réaliser une performance mesurée (en distance, en temps)",1,1,1,1,null,{"$f":"IF(COUNTIF(I194:I195,\"x\")>0,\"x\",0)","v":0},null,{"$f":"IF(COUNTIF(K194:K195,\"x\")>0,\"x\",0)","v":0},null,{"$f":"IF(COUNTIF(M194:M195,\"x\")>0,\"x\",0)","v":0},null,{"$f":"IF(COUNTIF(O194:O195,\"x\")>0,\"x\",0)","v":0},null,{"$f":"IF(COUNTIF(Q194:Q195,\"x\")>0,\"x\",0)","v":0},null,""]
[194,".EPS1","Activités athlétiques : courir vite, longtemps, en franchissant des obstacles, sauter loin et haut, lancer loin.",1,1,1,1,{"$nulls":11},"",null,1]
[195,".EPS2","Natation : se déplacer sur une quinzaine de mètres.",1,1,1,1,{"$nulls":11},{"$f":"IF(COUNTIF(I195:Q195,\"X\"),\"X\",\"\")","v":""},null,1]
[196,null,"Adapter ses déplacements à différents types d’environnement",1,1,1,1,null,{"$f":"IF(COUNTIF(I197:I200,\"x\")>0,\"x\",0)","v":0},null,{"$f":"IF(COUNTIF(K197:K200,\"x\")>0,\"x\",0)","v":0},null,{"$f":"IF(COUNTIF(M197:M200,\"x\")>0,\"x\",0)","v":0},null,{"$f":"IF(COUNTIF(O197:O200,\"x\")>0,\"x\",0)","v":0},null,{"$f":"IF(COUNTIF(Q197:Q200,\"x\")>0,\"x\",0)","v":0},null,""]
[197,".EPS3","Activités d’escalade : grimper jusqu’à 3 m et redescendre (mur équipé).",1,1,1,1,{"$nulls":11},"",null,1]
[198,".EPS4","Activités aquatiques et nautiques : s’immerger, se déplacer sous l’eau, se laisser flotter.",1,1,1,1,{"$nulls":11},"",null,1]
[199,".EPS5","Activités de roule et glisse : réaliser un parcours simple en roller ou en vélo.",1,1,1,1,{"$nulls":11},"",null,1]
[200,".EPS6","Activités d’orientation : retrouver quelques balises dans un milieu connu.",1,1,1,1,{"$nulls":11},"",null,1]
[201,null,"Coopérer ou s’opposer individuellement et collectivement",1,1,1,1,null,{"$f":"IF(COUNTIF(I202:I204,\"x\")>0,\"x\",0)","v":0},null,{"$f":"IF(COUNTIF(K202:K204,\"x\")>0,\"x\",0)","v":0},null,{"$f":"IF(COUNTIF(M202:M204,\"x\")>0,\"x\",0)","v":0},null,{"$f":"IF(COUNTIF(O202:O204,\"x\")>0,\"x\",0)","v":0},null,{"$f":"IF(COUNTIF(Q202:Q204,\"x\")>0,\"x\",0)","v":0},null,""]
[202,"EPS7","Jeux de lutte : agir sur son adversaire pour l’immobiliser.",1,1,1,1,{"$nulls":11},""]
[203,"EPS8","Jeux de raquettes : faire quelques échanges.",1,1,1,1,{"$nulls":11},""]
[204,".EPS9","Jeux traditionnels et jeux collectifs avec ou sans ballon : coopérer avec ses partenaires pour affronter collectivement des adversaires, en respectant des règles, en assurant des rôles différents (attaquant, défenseur, arbitre).",1,1,1,1,{"$nulls":11},"",null,1]
[205,null,"Concevoir et réaliser des actions à visées expressive, artistique, esthétique",1,1,1,1,null,{"$f":"IF(COUNTIF(I206:I207,\"x\")>0,\"x\",0)","v":0},null,{"$f":"IF(COUNTIF(K206:K207,\"x\")>0,\"x\",0)","v":0},null,{"$f":"IF(COUNTIF(M206:M207,\"x\")>0,\"x\",0)","v":0},null,{"$f":"IF(COUNTIF(O206:O207,\"x\")>0,\"x\",0)","v":0},null,{"$f":"IF(COUNTIF(Q206:Q207,\"x\")>0,\"x\",0)","v":0},null,""]
[206,"EPS10","Danse : exprimer corporellement des personnages, des images, des sentiments pour communiquer des émotions en réalisant une petite chorégraphie (3 à 5 éléments), sur des supports sonores divers.",1,1,1,1,{"$nulls":11},""]
[207,"EPS11"," Activités gymniques : réaliser un enchaînement de 2 ou 3 actions “acrobatiques” sur des engins variés (barres, plinths, poutres, gros tapis).",1,1,1,1,{"$nulls":11},""]
[208,null,"LES COMPETENCES SOCIALES ET CIVIQUES",1,1,1,1,null,{"$f":"IF(COUNTIF(I209:I215,\"x\")>0,\"x\",0)","v":0},null,{"$f":"IF(COUNTIF(K209:K215,\"x\")>0,\"x\",0)","v":0},null,{"$f":"IF(COUNTIF(M209:M215,\"x\")>0,\"x\",0)","v":0},null,{"$f":"IF(COUNTIF(O209:O215,\"x\")>0,\"x\",0)","v":0},null,{"$f":"IF(COUNTIF(Q209:Q215,\"x\")>0,\"x\",0)","v":0},null,""]
[209,"B2I","commencer à s’approprier un environnement numérique.",1,1,1,1,{"$nulls":11},""]
[210,".SC1","reconnaître les emblèmes et les symboles de la République française ",1,1,1,1,{"$nulls":11},"",null,1]
[211,".SC2","respecter les autres et les règles de la vie collective ",1,1,1,1,{"$nulls":11},"",null,1]
[212,"SC3","pratiquer un jeu ou un sport collectif en en respectant les règles ",1,1,1,1,{"$nulls":11},""]
[213,".SC4"," appliquer les codes de la politesse dans ses relations avec ses camarades, avec les adultes à l’école et hors de l’école, avec le maître au sein de la classe",1,1,1,1,{"$nulls":11},"",null,1]
[214,".SC5","participer en classe à un échange verbal en respectant les règles de la communication ",1,1,1,1,{"$nulls":11},"",null,1]
[215,"SC6","appeler les secours ; aller chercher de l’aide auprès d’un adulte.",1,1,1,1,{"$nulls":11},""]
[216,null,"L'AUTONOMIE ET L'INITIATIVE",1,1,1,1,null,{"$f":"IF(COUNTIF(I217:I222,\"x\")>0,\"x\",0)","v":0},null,{"$f":"IF(COUNTIF(K217:K222,\"x\")>0,\"x\",0)","v":0},null,{"$f":"IF(COUNTIF(M217:M222,\"x\")>0,\"x\",0)","v":0},null,{"$f":"IF(COUNTIF(O217:O222,\"x\")>0,\"x\",0)","v":0},null,{"$f":"IF(COUNTIF(Q217:Q222,\"x\")>0,\"x\",0)","v":0},null,""]
[217,"AI1","écouter pour comprendre, interroger, répéter, réaliser un travail ou une activité ",1,1,1,1,{"$nulls":11},""]
[218,"AI2","échanger, questionner, justifier un point de vue ",1,1,1,1,{"$nulls":11},""]
[219,"AI3","travailler en groupe, s’engager dans un projet ",1,1,1,1,{"$nulls":11},""]
[220,"AI4","maîtriser quelques conduites motrices comme courir, sauter, lancer ",1,1,1,1,{"$nulls":11},""]
[221,"AI5","se représenter son environnement proche, s’y repérer, s’y déplacer de façon adaptée ",1,1,1,1,{"$nulls":11},""]
[222,"AI6","appliquer des règles élémentaires d’hygiène.",1,1,1,1,{"$nulls":11},""]

{"sheet":"Période","index":4,"n_rows":222,"n_cols":48,"rows_kept":222,"hidden":true}
[{"$nulls":3},1,2,3,4,5,6,7,8,9,10,11,12,13,14,15,16,17,18,19,20,21,22,23,24,25,26,27,28,29,30,31,32,33,{"$nulls":10},"A",{"$f":"Renseignements!C49","v":5}]
[{"$nulls":46},"B"]
[{"$nulls":3},{"$f":"IF(ISBLANK(INDEX(nom,noligne,1)),\"\",(INDEX(prenom,noligne,1))&\" \" &(INDEX(nom,noligne,1)))","v":"Marc Aurèle"},"Jérôme Lenoir","Fabien Léglise","Aicha Samarahoui","Karim Maha","","","","","","","","","","","","","","","","","","","","","","","","","","","","",{"$nulls":10},"C"]
[null,{"$f":"Programmation!#REF!","v":{"$error":"#REF!"}},{"$nulls":44},"D"]
[null,null,"LANGAGE ORAL",{"$f":"COUNTA(D6:D19)*10","v":0},0,{"$f":"COUNTA(F6:F19)*10","v":0},{"$f":"COUNTA(G6:G19)*10","v":0},0,0,0,0,0,0,0,0,0,0,0,0,0,0,0,0,0,0,0,0,0,0,0,0,0,0,0,0,0,{"$nulls":3},{"$f":"COUNTIF($D7:$AL7,$AU$1)/$AV$1","v":{"v":0,"d":"0%"}},{"$f":"COUNTIF($D7:$AL7,$AU$2)/$AV$1","v":{"v":0,"d":"0%"}},{"$f":"COUNTIF($D7:$AL7,$AU$3)/$AV$1","v":{"v":0,"d":"0%"}},{"$f":"COUNTIF($D7:$AL7,$AU$4)/$AV$1","v":{"v":0,"d":"0%"}},{"$f":"COUNTIF(D7:$AL7,\"NE\")/$AV$1","v":{"v":0,"d":"0%"}},{"$f":"AN7+(AO7*0.66)+(AP7*0.33)","v":{"v":0,"d":"0%"}}]
[null,"LO1","S’exprimer de façon correcte : prononcer les sons et les mots avec exactitude, respecter l’organisation de la phrase, formuler correctement des questions.",{"$nulls":36},{"$f":"COUNTIF($D8:$AL8,$AU$1)/$AV$1","v":{"v":0,"d":"0%"}},{"$f":"COUNTIF($D8:$AL8,$AU$2)/$AV$1","v":{"v":0,"d":"0%"}},{"$f":"COUNTIF($D8:$AL8,$AU$3)/$AV$1","v":{"v":0,"d":"0%"}},{"$f":"COUNTIF($D8:$AL8,$AU$4)/$AV$1","v":{"v":0,"d":"0%"}},{"$f":"COUNTIF(D8:$AL8,\"NE\")/$AV$1","v":{"v":0,"d":"0%"}},{"$f":"AN8+(AO8*0.66)+(AP8*0.33)","v":{"v":0,"d":"0%"}}]
[null,"LO2","Rapporter clairement un événement ou une information très simple : exprimer les relations de causalité, les circonstances temporelles et spatiales, utiliser de manière adéquate les temps verbaux (présent, futur, imparfait, passé composé).",{"$nulls":36},{"$f":"COUNTIF($D9:$AL9,$AU$1)/$AV$1","v":{"v":0,"d":"0%"}},{"$f":"COUNTIF($D9:$AL9,$AU$2)/$AV$1","v":{"v":0,"d":"0%"}},{"$f":"COUNTIF($D9:$AL9,$AU$3)/$AV$1","v":{"v":0,"d":"0%"}},{"$f":"COUNTIF($D9:$AL9,$AU$4)/$AV$1","v":{"v":0,"d":"0%"}},{"$f":"COUNTIF(D9:$AL9,\"NE\")/$AV$1","v":{"v":0,"d":"0%"}},{"$f":"AN9+(AO9*0.66)+(AP9*0.33)","v":{"v":0,"d":"0%"}}]
[null,"LO3","Manifester sa compréhension d’un récit ou d’un texte documentaire lu par un tiers en répondant à des questions le concernant : reformuler le contenu d’un paragraphe ou d’un texte, identifier les personnages principaux d’un récit. ",{"$nulls":36},{"$f":"COUNTIF($D10:$AL10,$AU$1)/$AV$1","v":{"v":0,"d":"0%"}},{"$f":"COUNTIF($D10:$AL10,$AU$2)/$AV$1","v":{"v":0,"d":"0%"}},{"$f":"COUNTIF($D10:$AL10,$AU$3)/$AV$1","v":{"v":0,"d":"0%"}},{"$f":"COUNTIF($D10:$AL10,$AU$4)/$AV$1","v":{"v":0,"d":"0%"}},{"$f":"COUNTIF(D10:$AL10,\"NE\")/$AV$1","v":{"v":0,"d":"0%"}},{"$f":"AN10+(AO10*0.66)+(AP10*0.33)","v":{"v":0,"d":"0%"}}]
[null,"LO4","Raconter une histoire déjà entendue en s’appuyant sur des illustrations.",{"$nulls":36},{"$f":"COUNTIF($D11:$AL11,$AU$1)/$AV$1","v":{"v":0,"d":"0%"}},{"$f":"COUNTIF($D11:$AL11,$AU$2)/$AV$1","v":{"v":0,"d":"0%"}},{"$f":"COUNTIF($D11:$AL11,$AU$3)/$AV$1","v":{"v":0,"d":"0%"}},{"$f":"COUNTIF($D11:$AL11,$AU$4)/$AV$1","v":{"v":0,"d":"0%"}},{"$f":"COUNTIF(D11:$AL11,\"NE\")/$AV$1","v":{"v":0,"d":"0%"}},{"$f":"AN11+(AO11*0.66)+(AP11*0.33)","v":{"v":0,"d":"0%"}}]
[null,"LO5","Décrire des images (illustrations, photographies…). ",{"$nulls":36},{"$f":"COUNTIF($D12:$AL12,$AU$1)/$AV$1","v":{"v":0,"d":"0%"}},{"$f":"COUNTIF($D12:$AL12,$AU$2)/$AV$1","v":{"v":0,"d":"0%"}},{"$f":"COUNTIF($D12:$AL12,$AU$3)/$AV$1","v":{"v":0,"d":"0%"}},{"$f":"COUNTIF($D12:$AL12,$AU$4)/$AV$1","v":{"v":0,"d":"0%"}},{"$f":"COUNTIF(D12:$AL12,\"NE\")/$AV$1","v":{"v":0,"d":"0%"}},{"$f":"AN12+(AO12*0.66)+(AP12*0.33)","v":{"v":0,"d":"0%"}}]
[null,"LO4","Raconter une histoire déjà entendue en s’appuyant sur des illustrations.",{"$nulls":36},{"$f":"COUNTIF($D13:$AL13,$AU$1)/$AV$1","v":{"v":0,"d":"0%"}},{"$f":"COUNTIF($D13:$AL13,$AU$2)/$AV$1","v":{"v":0,"d":"0%"}},{"$f":"COUNTIF($D13:$AL13,$AU$3)/$AV$1","v":{"v":0,"d":"0%"}},{"$f":"COUNTIF($D13:$AL13,$AU$4)/$AV$1","v":{"v":0,"d":"0%"}},{"$f":"COUNTIF(D13:$AL13,\"NE\")/$AV$1","v":{"v":0,"d":"0%"}},{"$f":"AN13+(AO13*0.66)+(AP13*0.33)","v":{"v":0,"d":"0%"}}]
[null,"LO6","Reformuler une consigne.",{"$nulls":36},{"$f":"COUNTIF($D14:$AL14,$AU$1)/$AV$1","v":{"v":0,"d":"0%"}},{"$f":"COUNTIF($D14:$AL14,$AU$2)/$AV$1","v":{"v":0,"d":"0%"}},{"$f":"COUNTIF($D14:$AL14,$AU$3)/$AV$1","v":{"v":0,"d":"0%"}},{"$f":"COUNTIF($D14:$AL14,$AU$4)/$AV$1","v":{"v":0,"d":"0%"}},{"$f":"COUNTIF(D14:$AL14,\"NE\")/$AV$1","v":{"v":0,"d":"0%"}},{"$f":"AN14+(AO14*0.66)+(AP14*0.33)","v":{"v":0,"d":"0%"}}]
[null,"LO7","Prendre part à des échanges verbaux tout en sachant écouter les autres ; poser des questions.",{"$nulls":36},{"$f":"COUNTIF($D15:$AL15,$AU$1)/$AV$1","v":{"v":0,"d":"0%"}},{"$f":"COUNTIF($D15:$AL15,$AU$2)/$AV$1","v":{"v":0,"d":"0%"}},{"$f":"COUNTIF($D15:$AL15,$AU$3)/$AV$1","v":{"v":0,"d":"0%"}},{"$f":"COUNTIF($D15:$AL15,$AU$4)/$AV$1","v":{"v":0,"d":"0%"}},{"$f":"COUNTIF(D15:$AL15,\"NE\")/$AV$1","v":{"v":0,"d":"0%"}},{"$f":"AN15+(AO15*0.66)+(AP15*0.33)","v":{"v":0,"d":"0%"}}]
[null,"LO8","Réciter des comptines ou de courts poèmes (une dizaine) en ménageant des respirations, et sans commettre d’erreur (sans oubli ou substitution).  ",{"$nulls":36},{"$f":"COUNTIF($D16:$AL16,$AU$1)/$AV$1","v":{"v":0,"d":"0%"}},{"$f":"COUNTIF($D16:$AL16,$AU$2)/$AV$1","v":{"v":0,"d":"0%"}},{"$f":"COUNTIF($D16:$AL16,$AU$3)/$AV$1","v":{"v":0,"d":"0%"}},{"$f":"COUNTIF($D16:$AL16,$AU$4)/$AV$1","v":{"v":0,"d":"0%"}},{"$f":"COUNTIF(D16:$AL16,\"NE\")/$AV$1","v":{"v":0,"d":"0%"}},{"$f":"AN16+(AO16*0.66)+(AP16*0.33)","v":{"v":0,"d":"0%"}}]
[null,".LO9","Faire un récit structuré (relations causales, circonstances temporelles et spatiales précises) et compréhensible pour un tiers ignorant des faits rapportés ou de l’histoire racontée.",{"$nulls":36},{"$f":"COUNTIF($D17:$AL17,$AU$1)/$AV$1","v":{"v":0,"d":"0%"}},{"$f":"COUNTIF($D17:$AL17,$AU$2)/$AV$1","v":{"v":0,"d":"0%"}},{"$f":"COUNTIF($D17:$AL17,$AU$3)/$AV$1","v":{"v":0,"d":"0%"}},{"$f":"COUNTIF($D17:$AL17,$AU$4)/$AV$1","v":{"v":0,"d":"0%"}},{"$f":"COUNTIF(D17:$AL17,\"NE\")/$AV$1","v":{"v":0,"d":"0%"}},{"$f":"AN17+(AO17*0.66)+(AP17*0.33)","v":{"v":0,"d":"0%"}}]
[null,".LO10","S’exprimer avec précision pour se faire comprendre dans les activités scolaires.",{"$nulls":36},{"$f":"COUNTIF($D18:$AL18,$AU$1)/$AV$1","v":{"v":0,"d":"0%"}},{"$f":"COUNTIF($D18:$AL18,$AU$2)/$AV$1","v":{"v":0,"d":"0%"}},{"$f":"COUNTIF($D18:$AL18,$AU$3)/$AV$1","v":{"v":0,"d":"0%"}},{"$f":"COUNTIF($D18:$AL18,$AU$4)/$AV$1","v":{"v":0,"d":"0%"}},{"$f":"COUNTIF(D18:$AL18,\"NE\")/$AV$1","v":{"v":0,"d":"0%"}},{"$f":"AN18+(AO18*0.66)+(AP18*0.33)","v":{"v":0,"d":"0%"}}]
[null,".LO11","Présenter à la classe un travail individuel ou collectif.",{"$nulls":36},{"$f":"COUNTIF($D19:$AL19,$AU$1)/$AV$1","v":{"v":0,"d":"0%"}},{"$f":"COUNTIF($D19:$AL19,$AU$2)/$AV$1","v":{"v":0,"d":"0%"}},{"$f":"COUNTIF($D19:$AL19,$AU$3)/$AV$1","v":{"v":0,"d":"0%"}},{"$f":"COUNTIF($D19:$AL19,$AU$4)/$AV$1","v":{"v":0,"d":"0%"}},{"$f":"COUNTIF(D19:$AL19,\"NE\")/$AV$1","v":{"v":0,"d":"0%"}},{"$f":"AN19+(AO19*0.66)+(AP19*0.33)","v":{"v":0,"d":"0%"}}]
[null,".LO12","Participer à un échange : questionner, apporter des réponses, écouter et donner un point de vue en respectant les règles de la communication.",{"$nulls":36},{"$f":"COUNTIF($D20:$AL20,$AU$1)/$AV$1","v":{"v":0,"d":"0%"}},{"$f":"COUNTIF($D20:$AL20,$AU$2)/$AV$1","v":{"v":0,"d":"0%"}},{"$f":"COUNTIF($D20:$AL20,$AU$3)/$AV$1","v":{"v":0,"d":"0%"}},{"$f":"COUNTIF($D20:$AL20,$AU$4)/$AV$1","v":{"v":0,"d":"0%"}},{"$f":"COUNTIF(D20:$AL20,\"NE\")/$AV$1","v":{"v":0,"d":"0%"}},{"$f":"AN20+(AO20*0.66)+(AP20*0.33)","v":{"v":0,"d":"0%"}}]
[null,".LO13","Réciter des textes en prose ou des poèmes (une dizaine), en les interprétant par l’intonation",{"$nulls":36},{"$f":"COUNTIF($D21:$AL21,$AU$1)/$AV$1","v":{"v":0,"d":"0%"}},{"$f":"COUNTIF($D21:$AL21,$AU$2)/$AV$1","v":{"v":0,"d":"0%"}},{"$f":"COUNTIF($D21:$AL21,$AU$3)/$AV$1","v":{"v":0,"d":"0%"}},{"$f":"COUNTIF($D21:$AL21,$AU$4)/$AV$1","v":{"v":0,"d":"0%"}},{"$f":"COUNTIF(D21:$AL21,\"NE\")/$AV$1","v":{"v":0,"d":"0%"}},{"$f":"AN21+(AO21*0.66)+(AP21*0.33)","v":{"v":0,"d":"0%"}}]
[null,"","LECTURE",{"$f":"COUNTA(D21:D38)*10","v":0},{"$f":"COUNTA(E21:E38)*10","v":0},0,0,0,0,0,0,0,0,0,0,0,0,0,0,0,0,0,0,0,0,0,0,0,0,0,0,0,0,0,0,0,{"$nulls":3},{"$f":"COUNTIF($D22:$AL22,$AU$1)/$AV$1","v":{"v":0,"d":"0%"}},{"$f":"COUNTIF($D22:$AL22,$AU$2)/$AV$1","v":{"v":0,"d":"0%"}},{"$f":"COUNTIF($D22:$AL22,$AU$3)/$AV$1","v":{"v":0,"d":"0%"}},{"$f":"COUNTIF($D22:$AL22,$AU$4)/$AV$1","v":{"v":0,"d":"0%"}},{"$f":"COUNTIF(D22:$AL22,\"NE\")/$AV$1","v":{"v":0,"d":"0%"}},{"$f":"AN22+(AO22*0.66)+(AP22*0.33)","v":{"v":0,"d":"0%"}}]
[null,"LE1","Connaître le nom des lettres et l’ordre alphabétique.",{"$nulls":36},{"$f":"COUNTIF($D23:$AL23,$AU$1)/$AV$1","v":{"v":0,"d":"0%"}},{"$f":"COUNTIF($D23:$AL23,$AU$2)/$AV$1","v":{"v":0,"d":"0%"}},{"$f":"COUNTIF($D23:$AL23,$AU$3)/$AV$1","v":{"v":0,"d":"0%"}},{"$f":"COUNTIF($D23:$AL23,$AU$4)/$AV$1","v":{"v":0,"d":"0%"}},{"$f":"COUNTIF(D23:$AL23,\"NE\")/$AV$1","v":{"v":0,"d":"0%"}},{"$f":"AN23+(AO23*0.66)+(AP23*0.33)","v":{"v":0,"d":"0%"}}]
[null,"LE2","Distinguer entre la lettre et le son qu’elle transcrit ; connaître les correspondances entre les lettres et les sons dans les graphies simples (ex. f ; o) et complexes (ex. ph ; au, eau).",{"$nulls":36},{"$f":"COUNTIF($D24:$AL24,$AU$1)/$AV$1","v":{"v":0,"d":"0%"}},{"$f":"COUNTIF($D24:$AL24,$AU$2)/$AV$1","v":{"v":0,"d":"0%"}},{"$f":"COUNTIF($D24:$AL24,$AU$3)/$AV$1","v":{"v":0,"d":"0%"}},{"$f":"COUNTIF($D24:$AL24,$AU$4)/$AV$1","v":{"v":0,"d":"0%"}},{"$f":"COUNTIF(D24:$AL24,\"NE\")/$AV$1","v":{"v":0,"d":"0%"}},{"$f":"AN24+(AO24*0.66)+(AP24*0.33)","v":{"v":0,"d":"0%"}}]
[null,"LE3","Savoir qu'une syllabe est composée d'une ou plusieurs graphies, qu'un mot est composé d'une ou plusieurs syllabes ; être capable de repérer ces éléments (graphies, syllabes) dans un mot.",{"$nulls":36},{"$f":"COUNTIF($D25:$AL25,$AU$1)/$AV$1","v":{"v":0,"d":"0%"}},{"$f":"COUNTIF($D25:$AL25,$AU$2)/$AV$1","v":{"v":0,"d":"0%"}},{"$f":"COUNTIF($D25:$AL25,$AU$3)/$AV$1","v":{"v":0,"d":"0%"}},{"$f":"COUNTIF($D25:$AL25,$AU$4)/$AV$1","v":{"v":0,"d":"0%"}},{"$f":"COUNTIF(D25:$AL25,\"NE\")/$AV$1","v":{"v":0,"d":"0%"}},{"$f":"AN25+(AO25*0.66)+(AP25*0.33)","v":{"v":0,"d":"0%"}}]
[null,"LE4","Connaître les correspondances entre minuscules et majuscules d’imprimerie, minuscules et majuscules cursives.",{"$nulls":36},{"$f":"COUNTIF($D26:$AL26,$AU$1)/$AV$1","v":{"v":0,"d":"0%"}},{"$f":"COUNTIF($D26:$AL26,$AU$2)/$AV$1","v":{"v":0,"d":"0%"}},{"$f":"COUNTIF($D26:$AL26,$AU$3)/$AV$1","v":{"v":0,"d":"0%"}},{"$f":"COUNTIF($D26:$AL26,$AU$4)/$AV$1","v":{"v":0,"d":"0%"}},{"$f":"COUNTIF(D26:$AL26,\"NE\")/$AV$1","v":{"v":0,"d":"0%"}},{"$f":"AN26+(AO26*0.66)+(AP26*0.33)","v":{"v":0,"d":"0%"}}]
[null,"LE5","Lire aisément les mots étudiés. ",{"$nulls":36},{"$f":"COUNTIF($D27:$AL27,$AU$1)/$AV$1","v":{"v":0,"d":"0%"}},{"$f":"COUNTIF($D27:$AL27,$AU$2)/$AV$1","v":{"v":0,"d":"0%"}},{"$f":"COUNTIF($D27:$AL27,$AU$3)/$AV$1","v":{"v":0,"d":"0%"}},{"$f":"COUNTIF($D27:$AL27,$AU$4)/$AV$1","v":{"v":0,"d":"0%"}},{"$f":"COUNTIF(D27:$AL27,\"NE\")/$AV$1","v":{"v":0,"d":"0%"}},{"$f":"AN27+(AO27*0.66)+(AP27*0.33)","v":{"v":0,"d":"0%"}}]
[null,"LE6","Déchiffrer des mots réguliers inconnus.",{"$nulls":36},{"$f":"COUNTIF($D28:$AL28,$AU$1)/$AV$1","v":{"v":0,"d":"0%"}},{"$f":"COUNTIF($D28:$AL28,$AU$2)/$AV$1","v":{"v":0,"d":"0%"}},{"$f":"COUNTIF($D28:$AL28,$AU$3)/$AV$1","v":{"v":0,"d":"0%"}},{"$f":"COUNTIF($D28:$AL28,$AU$4)/$AV$1","v":{"v":0,"d":"0%"}},{"$f":"COUNTIF(D28:$AL28,\"NE\")/$AV$1","v":{"v":0,"d":"0%"}},{"$f":"AN28+(AO28*0.66)+(AP28*0.33)","v":{"v":0,"d":"0%"}}]
[null,"LE7","Lire aisément les mots les plus fréquemment rencontrés (dits mots-outils).",{"$nulls":36},{"$f":"COUNTIF($D29:$AL29,$AU$1)/$AV$1","v":{"v":0,"d":"0%"}},{"$f":"COUNTIF($D29:$AL29,$AU$2)/$AV$1","v":{"v":0,"d":"0%"}},{"$f":"COUNTIF($D29:$AL29,$AU$3)/$AV$1","v":{"v":0,"d":"0%"}},{"$f":"COUNTIF($D29:$AL29,$AU$4)/$AV$1","v":{"v":0,"d":"0%"}},{"$f":"COUNTIF(D29:$AL29,\"NE\")/$AV$1","v":{"v":0,"d":"0%"}},{"$f":"AN29+(AO29*0.66)+(AP29*0.33)","v":{"v":0,"d":"0%"}}]
[null,".LE8","Lire à haute voix un texte court dont les mots ont été étudiés, en articulant correctement et en respectant la ponctuation.",{"$nulls":36},{"$f":"COUNTIF($D30:$AL30,$AU$1)/$AV$1","v":{"v":0,"d":"0%"}},{"$f":"COUNTIF($D30:$AL30,$AU$2)/$AV$1","v":{"v":0,"d":"0%"}},{"$f":"COUNTIF($D30:$AL30,$AU$3)/$AV$1","v":{"v":0,"d":"0%"}},{"$f":"COUNTIF($D30:$AL30,$AU$4)/$AV$1","v":{"v":0,"d":"0%"}},{"$f":"COUNTIF(D30:$AL30,\"NE\")/$AV$1","v":{"v":0,"d":"0%"}},{"$f":"AN30+(AO30*0.66)+(AP30*0.33)","v":{"v":0,"d":"0%"}}]
[null,"LE9","Connaître et utiliser le vocabulaire spécifique de la lecture d’un texte : le livre, la couverture, la page, la ligne ; l’auteur, le titre ; le texte, la phrase, le mot ; le début, la fin, le personnage, l’histoire.",{"$nulls":36},{"$f":"COUNTIF($D31:$AL31,$AU$1)/$AV$1","v":{"v":0,"d":"0%"}},{"$f":"COUNTIF($D31:$AL31,$AU$2)/$AV$1","v":{"v":0,"d":"0%"}},{"$f":"COUNTIF($D31:$AL31,$AU$3)/$AV$1","v":{"v":0,"d":"0%"}},{"$f":"COUNTIF($D31:$AL31,$AU$4)/$AV$1","v":{"v":0,"d":"0%"}},{"$f":"COUNTIF(D31:$AL31,\"NE\")/$AV$1","v":{"v":0,"d":"0%"}},{"$f":"AN31+(AO31*0.66)+(AP31*0.33)","v":{"v":0,"d":"0%"}}]
[null,"LE10","Dire de qui ou de quoi parle le texte lu ; trouver dans le texte ou son illustration la réponse à des questions concernant le texte lu ; reformuler son sens.",{"$nulls":36},{"$f":"COUNTIF($D32:$AL32,$AU$1)/$AV$1","v":{"v":0,"d":"0%"}},{"$f":"COUNTIF($D32:$AL32,$AU$2)/$AV$1","v":{"v":0,"d":"0%"}},{"$f":"COUNTIF($D32:$AL32,$AU$3)/$AV$1","v":{"v":0,"d":"0%"}},{"$f":"COUNTIF($D32:$AL32,$AU$4)/$AV$1","v":{"v":0,"d":"0%"}},{"$f":"COUNTIF(D32:$AL32,\"NE\")/$AV$1","v":{"v":0,"d":"0%"}},{"$f":"AN32+(AO32*0.66)+(AP32*0.33)","v":{"v":0,"d":"0%"}}]
[null,"LE11","Ecouter lire des œuvres intégrales, notamment de littérature de jeunesse.",{"$nulls":36},{"$f":"COUNTIF($D33:$AL33,$AU$1)/$AV$1","v":{"v":0,"d":"0%"}},{"$f":"COUNTIF($D33:$AL33,$AU$2)/$AV$1","v":{"v":0,"d":"0%"}},{"$f":"COUNTIF($D33:$AL33,$AU$3)/$AV$1","v":{"v":0,"d":"0%"}},{"$f":"COUNTIF($D33:$AL33,$AU$4)/$AV$1","v":{"v":0,"d":"0%"}},{"$f":"COUNTIF(D33:$AL33,\"NE\")/$AV$1","v":{"v":0,"d":"0%"}},{"$f":"AN33+(AO33*0.66)+(AP33*0.33)","v":{"v":0,"d":"0%"}}]
[null,".LE12","Lire silencieusement un texte en déchiffrant les mots inconnus et manifester sa compréhension dans un résumé, une reformulation, des réponses à des questions.",{"$nulls":36},{"$f":"COUNTIF($D34:$AL34,$AU$1)/$AV$1","v":{"v":0,"d":"0%"}},{"$f":"COUNTIF($D34:$AL34,$AU$2)/$AV$1","v":{"v":0,"d":"0%"}},{"$f":"COUNTIF($D34:$AL34,$AU$3)/$AV$1","v":{"v":0,"d":"0%"}},{"$f":"COUNTIF($D34:$AL34,$AU$4)/$AV$1","v":{"v":0,"d":"0%"}},{"$f":"COUNTIF(D34:$AL34,\"NE\")/$AV$1","v":{"v":0,"d":"0%"}},{"$f":"AN34+(AO34*0.66)+(AP34*0.33)","v":{"v":0,"d":"0%"}}]
[null,"LE13","Lire silencieusement un énoncé, une consigne, et comprendre ce qui est attendu.",{"$nulls":36},{"$f":"COUNTIF($D35:$AL35,$AU$1)/$AV$1","v":{"v":0,"d":"0%"}},{"$f":"COUNTIF($D35:$AL35,$AU$2)/$AV$1","v":{"v":0,"d":"0%"}},{"$f":"COUNTIF($D35:$AL35,$AU$3)/$AV$1","v":{"v":0,"d":"0%"}},{"$f":"COUNTIF($D35:$AL35,$AU$4)/$AV$1","v":{"v":0,"d":"0%"}},{"$f":"COUNTIF(D35:$AL35,\"NE\")/$AV$1","v":{"v":0,"d":"0%"}},{"$f":"AN35+(AO35*0.66)+(AP35*0.33)","v":{"v":0,"d":"0%"}}]
[null,"LE14","Participer à une lecture dialoguée : articulation correcte, fluidité, respect de la ponctuation, intonation appropriée.",{"$nulls":36},{"$f":"COUNTIF($D36:$AL36,$AU$1)/$AV$1","v":{"v":0,"d":"0%"}},{"$f":"COUNTIF($D36:$AL36,$AU$2)/$AV$1","v":{"v":0,"d":"0%"}},{"$f":"COUNTIF($D36:$AL36,$AU$3)/$AV$1","v":{"v":0,"d":"0%"}},{"$f":"COUNTIF($D36:$AL36,$AU$4)/$AV$1","v":{"v":0,"d":"0%"}},{"$f":"COUNTIF(D36:$AL36,\"NE\")/$AV$1","v":{"v":0,"d":"0%"}},{"$f":"AN36+(AO36*0.66)+(AP36*0.33)","v":{"v":0,"d":"0%"}}]
[null,".LE15","Ecouter et lire des œuvres intégrales courtes ou de larges extraits d’œuvres plus longues.",{"$nulls":36},{"$f":"COUNTIF($D37:$AL37,$AU$1)/$AV$1","v":{"v":0,"d":"0%"}},{"$f":"COUNTIF($D37:$AL37,$AU$2)/$AV$1","v":{"v":0,"d":"0%"}},{"$f":"COUNTIF($D37:$AL37,$AU$3)/$AV$1","v":{"v":0,"d":"0%"}},{"$f":"COUNTIF($D37:$AL37,$AU$4)/$AV$1","v":{"v":0,"d":"0%"}},{"$f":"COUNTIF(D37:$AL37,\"NE\")/$AV$1","v":{"v":0,"d":"0%"}},{"$f":"AN37+(AO37*0.66)+(AP37*0.33)","v":{"v":0,"d":"0%"}}]
[null,".LE16","Identifier les personnages, les événements et les circonstances temporelles et spatiales d’un récit qu’on a lu.",{"$nulls":36},{"$f":"COUNTIF($D38:$AL38,$AU$1)/$AV$1","v":{"v":0,"d":"0%"}},{"$f":"COUNTIF($D38:$AL38,$AU$2)/$AV$1","v":{"v":0,"d":"0%"}},{"$f":"COUNTIF($D38:$AL38,$AU$3)/$AV$1","v":{"v":0,"d":"0%"}},{"$f":"COUNTIF($D38:$AL38,$AU$4)/$AV$1","v":{"v":0,"d":"0%"}},{"$f":"COUNTIF(D38:$AL38,\"NE\")/$AV$1","v":{"v":0,"d":"0%"}},{"$f":"AN38+(AO38*0.66)+(AP38*0.33)","v":{"v":0,"d":"0%"}}]
[null,".LE17","Comparer un texte nouvellement entendu ou lu avec un ou des textes connus (thèmes, personnages, événements, fin).",{"$nulls":36},{"$f":"COUNTIF($D39:$AL39,$AU$1)/$AV$1","v":{"v":0,"d":"0%"}},{"$f":"COUNTIF($D39:$AL39,$AU$2)/$AV$1","v":{"v":0,"d":"0%"}},{"$f":"COUNTIF($D39:$AL39,$AU$3)/$AV$1","v":{"v":0,"d":"0%"}},{"$f":"COUNTIF($D39:$AL39,$AU$4)/$AV$1","v":{"v":0,"d":"0%"}},{"$f":"COUNTIF(D39:$AL39,\"NE\")/$AV$1","v":{"v":0,"d":"0%"}},{"$f":"AN39+(AO39*0.66)+(AP39*0.33)","v":{"v":0,"d":"0%"}}]
[null,"LE18","Lire ou écouter lire des œuvres intégrales, notamment de littérature de jeunesse et rendre compte de sa lecture.",{"$nulls":36},{"$f":"COUNTIF($D40:$AL40,$AU$1)/$AV$1","v":{"v":0,"d":"0%"}},{"$f":"COUNTIF($D40:$AL40,$AU$2)/$AV$1","v":{"v":0,"d":"0%"}},{"$f":"COUNTIF($D40:$AL40,$AU$3)/$AV$1","v":{"v":0,"d":"0%"}},{"$f":"COUNTIF($D40:$AL40,$AU$4)/$AV$1","v":{"v":0,"d":"0%"}},{"$f":"COUNTIF(D40:$AL40,\"NE\")/$AV$1","v":{"v":0,"d":"0%"}},{"$f":"AN40+(AO40*0.66)+(AP40*0.33)","v":{"v":0,"d":"0%"}}]
[null,"","ECRITURE",{"$f":"COUNTA(D40:D51)*10","v":0},{"$f":"COUNTA(E40:E51)*10","v":0},0,0,0,0,0,0,0,0,0,0,0,0,0,0,0,0,0,0,0,0,0,0,0,0,0,0,0,0,0,0,0,{"$nulls":3},{"$f":"COUNTIF($D41:$AL41,$AU$1)/$AV$1","v":{"v":0,"d":"0%"}},{"$f":"COUNTIF($D41:$AL41,$AU$2)/$AV$1","v":{"v":0,"d":"0%"}},{"$f":"COUNTIF($D41:$AL41,$AU$3)/$AV$1","v":{"v":0,"d":"0%"}},{"$f":"COUNTIF($D41:$AL41,$AU$4)/$AV$1","v":{"v":0,"d":"0%"}},{"$f":"COUNTIF(D41:$AL41,\"NE\")/$AV$1","v":{"v":0,"d":"0%"}},{"$f":"AN41+(AO41*0.66)+(AP41*0.33)","v":{"v":0,"d":"0%"}}]
[null,"EC1","Copier un texte très court dans une écriture cursive lisible, sur des lignes, non lettre à lettre mais mot par mot (en prenant appui sur les syllabes qui le composent), en respectant les liaisons entre les lettres, les accents, les espaces entre les mots, les signes de ponctuation, les majuscules.",{"$nulls":36},{"$f":"COUNTIF($D42:$AL42,$AU$1)/$AV$1","v":{"v":0,"d":"0%"}},{"$f":"COUNTIF($D42:$AL42,$AU$2)/$AV$1","v":{"v":0,"d":"0%"}},{"$f":"COUNTIF($D42:$AL42,$AU$3)/$AV$1","v":{"v":0,"d":"0%"}},{"$f":"COUNTIF($D42:$AL42,$AU$4)/$AV$1","v":{"v":0,"d":"0%"}},{"$f":"COUNTIF(D42:$AL42,\"NE\")/$AV$1","v":{"v":0,"d":"0%"}},{"$f":"AN42+(AO42*0.66)+(AP42*0.33)","v":{"v":0,"d":"0%"}}]
[null,"EC2","Écrire sans erreur, sous la dictée, des syllabes, des mots et de courtes phrases dont les graphies ont été étudiées.",{"$nulls":36},{"$f":"COUNTIF($D43:$AL43,$AU$1)/$AV$1","v":{"v":0,"d":"0%"}},{"$f":"COUNTIF($D43:$AL43,$AU$2)/$AV$1","v":{"v":0,"d":"0%"}},{"$f":"COUNTIF($D43:$AL43,$AU$3)/$AV$1","v":{"v":0,"d":"0%"}},{"$f":"COUNTIF($D43:$AL43,$AU$4)/$AV$1","v":{"v":0,"d":"0%"}},{"$f":"COUNTIF(D43:$AL43,\"NE\")/$AV$1","v":{"v":0,"d":"0%"}},{"$f":"AN43+(AO43*0.66)+(AP43*0.33)","v":{"v":0,"d":"0%"}}]
[null,"EC3","Choisir et écrire de manière autonome des mots simples en respectant les correspondances entre lettres et sons.",{"$nulls":36},{"$f":"COUNTIF($D44:$AL44,$AU$1)/$AV$1","v":{"v":0,"d":"0%"}},{"$f":"COUNTIF($D44:$AL44,$AU$2)/$AV$1","v":{"v":0,"d":"0%"}},{"$f":"COUNTIF($D44:$AL44,$AU$3)/$AV$1","v":{"v":0,"d":"0%"}},{"$f":"COUNTIF($D44:$AL44,$AU$4)/$AV$1","v":{"v":0,"d":"0%"}},{"$f":"COUNTIF(D44:$AL44,\"NE\")/$AV$1","v":{"v":0,"d":"0%"}},{"$f":"AN44+(AO44*0.66)+(AP44*0.33)","v":{"v":0,"d":"0%"}}]
[null,"EC4","Concevoir et écrire collectivement avec l’aide du maître une phrase simple cohérente, puis plusieurs. ",{"$nulls":36},{"$f":"COUNTIF($D45:$AL45,$AU$1)/$AV$1","v":{"v":0,"d":"0%"}},{"$f":"COUNTIF($D45:$AL45,$AU$2)/$AV$1","v":{"v":0,"d":"0%"}},{"$f":"COUNTIF($D45:$AL45,$AU$3)/$AV$1","v":{"v":0,"d":"0%"}},{"$f":"COUNTIF($D45:$AL45,$AU$4)/$AV$1","v":{"v":0,"d":"0%"}},{"$f":"COUNTIF(D45:$AL45,\"NE\")/$AV$1","v":{"v":0,"d":"0%"}},{"$f":"AN45+(AO45*0.66)+(AP45*0.33)","v":{"v":0,"d":"0%"}}]
[null,"EC5","Comparer sa production écrite à un modèle et rectifier ses erreurs.",{"$nulls":36},{"$f":"COUNTIF($D46:$AL46,$AU$1)/$AV$1","v":{"v":0,"d":"0%"}},{"$f":"COUNTIF($D46:$AL46,$AU$2)/$AV$1","v":{"v":0,"d":"0%"}},{"$f":"COUNTIF($D46:$AL46,$AU$3)/$AV$1","v":{"v":0,"d":"0%"}},{"$f":"COUNTIF($D46:$AL46,$AU$4)/$AV$1","v":{"v":0,"d":"0%"}},{"$f":"COUNTIF(D46:$AL46,\"NE\")/$AV$1","v":{"v":0,"d":"0%"}},{"$f":"AN46+(AO46*0.66)+(AP46*0.33)","v":{"v":0,"d":"0%"}}]
[null,"EC6","Produire un travail écrit soigné ; maîtriser son attitude et son geste pour écrire avec aisance ; prendre soin des outils du travail scolaire. ",{"$nulls":36},{"$f":"COUNTIF($D47:$AL47,$AU$1)/$AV$1","v":{"v":0,"d":"0%"}},{"$f":"COUNTIF($D47:$AL47,$AU$2)/$AV$1","v":{"v":0,"d":"0%"}},{"$f":"COUNTIF($D47:$AL47,$AU$3)/$AV$1","v":{"v":0,"d":"0%"}},{"$f":"COUNTIF($D47:$AL47,$AU$4)/$AV$1","v":{"v":0,"d":"0%"}},{"$f":"COUNTIF(D47:$AL47,\"NE\")/$AV$1","v":{"v":0,"d":"0%"}},{"$f":"AN47+(AO47*0.66)+(AP47*0.33)","v":{"v":0,"d":"0%"}}]
[null,".EC7"," Copier un court texte (par mots entiers ou groupes de mots) en respectant l’orthographe, la ponctuation, les majuscules et en soignant la présentation.",{"$nulls":36},{"$f":"COUNTIF($D48:$AL48,$AU$1)/$AV$1","v":{"v":0,"d":"0%"}},{"$f":"COUNTIF($D48:$AL48,$AU$2)/$AV$1","v":{"v":0,"d":"0%"}},{"$f":"COUNTIF($D48:$AL48,$AU$3)/$AV$1","v":{"v":0,"d":"0%"}},{"$f":"COUNTIF($D48:$AL48,$AU$4)/$AV$1","v":{"v":0,"d":"0%"}},{"$f":"COUNTIF(D48:$AL48,\"NE\")/$AV$1","v":{"v":0,"d":"0%"}},{"$f":"AN48+(AO48*0.66)+(AP48*0.33)","v":{"v":0,"d":"0%"}}]
[null,".EC8","En particulier, copier avec soin, en respectant la mise en page, un texte en prose ou poème appris en récitation ; réaliser un dessin pour l’illustrer.",{"$nulls":36},{"$f":"COUNTIF($D49:$AL49,$AU$1)/$AV$1","v":{"v":0,"d":"0%"}},{"$f":"COUNTIF($D49:$AL49,$AU$2)/$AV$1","v":{"v":0,"d":"0%"}},{"$f":"COUNTIF($D49:$AL49,$AU$3)/$AV$1","v":{"v":0,"d":"0%"}},{"$f":"COUNTIF($D49:$AL49,$AU$4)/$AV$1","v":{"v":0,"d":"0%"}},{"$f":"COUNTIF(D49:$AL49,\"NE\")/$AV$1","v":{"v":0,"d":"0%"}},{"$f":"AN49+(AO49*0.66)+(AP49*0.33)","v":{"v":0,"d":"0%"}}]
[null,"EC9","Écrire sans erreur, sous la dictée, des phrases ou un court texte (5 lignes), préparés ou non, en utilisant ses connaissances orthographiques et grammaticales, ",{"$nulls":36},{"$f":"COUNTIF($D50:$AL50,$AU$1)/$AV$1","v":{"v":0,"d":"0%"}},{"$f":"COUNTIF($D50:$AL50,$AU$2)/$AV$1","v":{"v":0,"d":"0%"}},{"$f":"COUNTIF($D50:$AL50,$AU$3)/$AV$1","v":{"v":0,"d":"0%"}},{"$f":"COUNTIF($D50:$AL50,$AU$4)/$AV$1","v":{"v":0,"d":"0%"}},{"$f":"COUNTIF(D50:$AL50,\"NE\")/$AV$1","v":{"v":0,"d":"0%"}},{"$f":"AN50+(AO50*0.66)+(AP50*0.33)","v":{"v":0,"d":"0%"}}]
[null,".EC10","Concevoir et écrire de manière autonome une phrase simple cohérente, puis plusieurs, puis un texte narratif ou explicatif de 5 à 10 lignes.",{"$nulls":36},{"$f":"COUNTIF($D51:$AL51,$AU$1)/$AV$1","v":{"v":0,"d":"0%"}},{"$f":"COUNTIF($D51:$AL51,$AU$2)/$AV$1","v":{"v":0,"d":"0%"}},{"$f":"COUNTIF($D51:$AL51,$AU$3)/$AV$1","v":{"v":0,"d":"0%"}},{"$f":"COUNTIF($D51:$AL51,$AU$4)/$AV$1","v":{"v":0,"d":"0%"}},{"$f":"COUNTIF(D51:$AL51,\"NE\")/$AV$1","v":{"v":0,"d":"0%"}},{"$f":"AN51+(AO51*0.66)+(AP51*0.33)","v":{"v":0,"d":"0%"}}]
[null,".EC11","Rédiger différents types de textes d’au moins deux paragraphes en veillant à leur cohérence  , en évitant les répétitions, et en respectant les contraintes syntaxiques et orthographiques ainsi que la ponctuation.",{"$nulls":36},{"$f":"COUNTIF($D52:$AL52,$AU$1)/$AV$1","v":{"v":0,"d":"0%"}},{"$f":"COUNTIF($D52:$AL52,$AU$2)/$AV$1","v":{"v":0,"d":"0%"}},{"$f":"COUNTIF($D52:$AL52,$AU$3)/$AV$1","v":{"v":0,"d":"0%"}},{"$f":"COUNTIF($D52:$AL52,$AU$4)/$AV$1","v":{"v":0,"d":"0%"}},{"$f":"COUNTIF(D52:$AL52,\"NE\")/$AV$1","v":{"v":0,"d":"0%"}},{"$f":"AN52+(AO52*0.66)+(AP52*0.33)","v":{"v":0,"d":"0%"}}]
[null,".EC12","Ecrire un texte de type poétique en obéissant à une ou plusieurs consignes précises.",{"$nulls":36},{"$f":"COUNTIF($D53:$AL53,$AU$1)/$AV$1","v":{"v":0,"d":"0%"}},{"$f":"COUNTIF($D53:$AL53,$AU$2)/$AV$1","v":{"v":0,"d":"0%"}},{"$f":"COUNTIF($D53:$AL53,$AU$3)/$AV$1","v":{"v":0,"d":"0%"}},{"$f":"COUNTIF($D53:$AL53,$AU$4)/$AV$1","v":{"v":0,"d":"0%"}},{"$f":"COUNTIF(D53:$AL53,\"NE\")/$AV$1","v":{"v":0,"d":"0%"}},{"$f":"AN53+(AO53*0.66)+(AP53*0.33)","v":{"v":0,"d":"0%"}}]
[null,"","VOCABULAIRE",{"$f":"COUNTA(D53:D61)*10","v":0},{"$f":"COUNTA(E53:E61)*10","v":0},0,0,0,0,0,0,0,0,0,0,0,0,0,0,0,0,0,0,0,0,0,0,0,0,0,0,0,0,0,0,0,{"$nulls":3},{"$f":"COUNTIF($D54:$AL54,$AU$1)/$AV$1","v":{"v":0,"d":"0%"}},{"$f":"COUNTIF($D54:$AL54,$AU$2)/$AV$1","v":{"v":0,"d":"0%"}},{"$f":"COUNTIF($D54:$AL54,$AU$3)/$AV$1","v":{"v":0,"d":"0%"}},{"$f":"COUNTIF($D54:$AL54,$AU$4)/$AV$1","v":{"v":0,"d":"0%"}},{"$f":"COUNTIF(D54:$AL54,\"NE\")/$AV$1","v":{"v":0,"d":"0%"}},{"$f":"AN54+(AO54*0.66)+(AP54*0.33)","v":{"v":0,"d":"0%"}}]
[null,".VO1","Utiliser des mots précis pour s’exprimer",{"$nulls":36},{"$f":"COUNTIF($D55:$AL55,$AU$1)/$AV$1","v":{"v":0,"d":"0%"}},{"$f":"COUNTIF($D55:$AL55,$AU$2)/$AV$1","v":{"v":0,"d":"0%"}},{"$f":"COUNTIF($D55:$AL55,$AU$3)/$AV$1","v":{"v":0,"d":"0%"}},{"$f":"COUNTIF($D55:$AL55,$AU$4)/$AV$1","v":{"v":0,"d":"0%"}},{"$f":"COUNTIF(D55:$AL55,\"NE\")/$AV$1","v":{"v":0,"d":"0%"}},{"$f":"AN55+(AO55*0.66)+(AP55*0.33)","v":{"v":0,"d":"0%"}}]
[null,"VO2","Commencer à classer les noms par catégories sémantiques larges (noms de personnes, noms d’animaux, noms de choses) ou plus étroites et se référant au monde concret (ex. : noms de fruits).",{"$nulls":36},{"$f":"COUNTIF($D56:$AL56,$AU$1)/$AV$1","v":{"v":0,"d":"0%"}},{"$f":"COUNTIF($D56:$AL56,$AU$2)/$AV$1","v":{"v":0,"d":"0%"}},{"$f":"COUNTIF($D56:$AL56,$AU$3)/$AV$1","v":{"v":0,"d":"0%"}},{"$f":"COUNTIF($D56:$AL56,$AU$4)/$AV$1","v":{"v":0,"d":"0%"}},{"$f":"COUNTIF(D56:$AL56,\"NE\")/$AV$1","v":{"v":0,"d":"0%"}},{"$f":"AN56+(AO56*0.66)+(AP56*0.33)","v":{"v":0,"d":"0%"}}]
[null,"VO3","Trouver un ou des noms appartenant à une catégorie donnée (ex. un nom d’arbre, un nom de commerçant). ",{"$nulls":36},{"$f":"COUNTIF($D57:$AL57,$AU$1)/$AV$1","v":{"v":0,"d":"0%"}},{"$f":"COUNTIF($D57:$AL57,$AU$2)/$AV$1","v":{"v":0,"d":"0%"}},{"$f":"COUNTIF($D57:$AL57,$AU$3)/$AV$1","v":{"v":0,"d":"0%"}},{"$f":"COUNTIF($D57:$AL57,$AU$4)/$AV$1","v":{"v":0,"d":"0%"}},{"$f":"COUNTIF(D57:$AL57,\"NE\")/$AV$1","v":{"v":0,"d":"0%"}},{"$f":"AN57+(AO57*0.66)+(AP57*0.33)","v":{"v":0,"d":"0%"}}]
[null,"VO4","Trouver un mot de sens opposé pour un adjectif qualificatif ou un verbe d’action. ",{"$nulls":36},{"$f":"COUNTIF($D58:$AL58,$AU$1)/$AV$1","v":{"v":0,"d":"0%"}},{"$f":"COUNTIF($D58:$AL58,$AU$2)/$AV$1","v":{"v":0,"d":"0%"}},{"$f":"COUNTIF($D58:$AL58,$AU$3)/$AV$1","v":{"v":0,"d":"0%"}},{"$f":"COUNTIF($D58:$AL58,$AU$4)/$AV$1","v":{"v":0,"d":"0%"}},{"$f":"COUNTIF(D58:$AL58,\"NE\")/$AV$1","v":{"v":0,"d":"0%"}},{"$f":"AN58+(AO58*0.66)+(AP58*0.33)","v":{"v":0,"d":"0%"}}]
[null,"VO5","Ranger des mots par ordre alphabétique.",{"$nulls":36},{"$f":"COUNTIF($D59:$AL59,$AU$1)/$AV$1","v":{"v":0,"d":"0%"}},{"$f":"COUNTIF($D59:$AL59,$AU$2)/$AV$1","v":{"v":0,"d":"0%"}},{"$f":"COUNTIF($D59:$AL59,$AU$3)/$AV$1","v":{"v":0,"d":"0%"}},{"$f":"COUNTIF($D59:$AL59,$AU$4)/$AV$1","v":{"v":0,"d":"0%"}},{"$f":"COUNTIF(D59:$AL59,\"NE\")/$AV$1","v":{"v":0,"d":"0%"}},{"$f":"AN59+(AO59*0.66)+(AP59*0.33)","v":{"v":0,"d":"0%"}}]
[null,".VO6","Donner des synonymes (par exemple pour reformuler le sens d’un texte ou pour améliorer une expression orale ou écrite).",{"$nulls":36},{"$f":"COUNTIF($D60:$AL60,$AU$1)/$AV$1","v":{"v":0,"d":"0%"}},{"$f":"COUNTIF($D60:$AL60,$AU$2)/$AV$1","v":{"v":0,"d":"0%"}},{"$f":"COUNTIF($D60:$AL60,$AU$3)/$AV$1","v":{"v":0,"d":"0%"}},{"$f":"COUNTIF($D60:$AL60,$AU$4)/$AV$1","v":{"v":0,"d":"0%"}},{"$f":"COUNTIF(D60:$AL60,\"NE\")/$AV$1","v":{"v":0,"d":"0%"}},{"$f":"AN60+(AO60*0.66)+(AP60*0.33)","v":{"v":0,"d":"0%"}}]
[null,".VO7","Trouver un mot de sens opposé pour un adjectif qualificatif, un verbe d’action ou pour un nom  ",{"$nulls":36},{"$f":"COUNTIF($D61:$AL61,$AU$1)/$AV$1","v":{"v":0,"d":"0%"}},{"$f":"COUNTIF($D61:$AL61,$AU$2)/$AV$1","v":{"v":0,"d":"0%"}},{"$f":"COUNTIF($D61:$AL61,$AU$3)/$AV$1","v":{"v":0,"d":"0%"}},{"$f":"COUNTIF($D61:$AL61,$AU$4)/$AV$1","v":{"v":0,"d":"0%"}},{"$f":"COUNTIF(D61:$AL61,\"NE\")/$AV$1","v":{"v":0,"d":"0%"}},{"$f":"AN61+(AO61*0.66)+(AP61*0.33)","v":{"v":0,"d":"0%"}}]
[null,".VO8","Regrouper des mots par familles ; trouver un ou des mots d’une famille donnée.",{"$nulls":36},{"$f":"COUNTIF($D62:$AL62,$AU$1)/$AV$1","v":{"v":0,"d":"0%"}},{"$f":"COUNTIF($D62:$AL62,$AU$2)/$AV$1","v":{"v":0,"d":"0%"}},{"$f":"COUNTIF($D62:$AL62,$AU$3)/$AV$1","v":{"v":0,"d":"0%"}},{"$f":"COUNTIF($D62:$AL62,$AU$4)/$AV$1","v":{"v":0,"d":"0%"}},{"$f":"COUNTIF(D62:$AL62,\"NE\")/$AV$1","v":{"v":0,"d":"0%"}},{"$f":"AN62+(AO62*0.66)+(AP62*0.33)","v":{"v":0,"d":"0%"}}]
[null,".VO9","Commencer à utiliser l’ordre alphabétique pour vérifier dans un dictionnaire l’écriture d’un mot ou en chercher le sens.",{"$nulls":36},{"$f":"COUNTIF($D63:$AL63,$AU$1)/$AV$1","v":{"v":0,"d":"0%"}},{"$f":"COUNTIF($D63:$AL63,$AU$2)/$AV$1","v":{"v":0,"d":"0%"}},{"$f":"COUNTIF($D63:$AL63,$AU$3)/$AV$1","v":{"v":0,"d":"0%"}},{"$f":"COUNTIF($D63:$AL63,$AU$4)/$AV$1","v":{"v":0,"d":"0%"}},{"$f":"COUNTIF(D63:$AL63,\"NE\")/$AV$1","v":{"v":0,"d":"0%"}},{"$f":"AN63+(AO63*0.66)+(AP63*0.33)","v":{"v":0,"d":"0%"}}]
[null,""," GRAMMAIRE",{"$f":"D63+D66+D75+D78+D82","v":0},{"$f":"E63+E66+E75+E78+E82","v":0},0,0,0,0,0,0,0,0,0,0,0,0,0,0,0,0,0,0,0,0,0,0,0,0,0,0,0,0,0,0,0,{"$nulls":3},{"$f":"COUNTIF($D64:$AL64,$AU$1)/$AV$1","v":{"v":0,"d":"0%"}},{"$f":"COUNTIF($D64:$AL64,$AU$2)/$AV$1","v":{"v":0,"d":"0%"}},{"$f":"COUNTIF($D64:$AL64,$AU$3)/$AV$1","v":{"v":0,"d":"0%"}},{"$f":"COUNTIF($D64:$AL64,$AU$4)/$AV$1","v":{"v":0,"d":"0%"}},{"$f":"COUNTIF(D64:$AL64,\"NE\")/$AV$1","v":{"v":0,"d":"0%"}},{"$f":"AN64+(AO64*0.66)+(AP64*0.33)","v":{"v":0,"d":"0%"}}]
[null,"","La phrase",{"$f":"COUNTA(D64:D65)*10","v":0},{"$f":"COUNTA(E64:E65)*10","v":0},0,0,0,0,0,0,0,0,0,0,0,0,0,0,0,0,0,0,0,0,0,0,0,0,0,0,0,0,0,0,0,{"$nulls":3},{"$f":"COUNTIF($D65:$AL65,$AU$1)/$AV$1","v":{"v":0,"d":"0%"}},{"$f":"COUNTIF($D65:$AL65,$AU$2)/$AV$1","v":{"v":0,"d":"0%"}},{"$f":"COUNTIF($D65:$AL65,$AU$3)/$AV$1","v":{"v":0,"d":"0%"}},{"$f":"COUNTIF($D65:$AL65,$AU$4)/$AV$1","v":{"v":0,"d":"0%"}},{"$f":"COUNTIF(D65:$AL65,\"NE\")/$AV$1","v":{"v":0,"d":"0%"}},{"$f":"AN65+(AO65*0.66)+(AP65*0.33)","v":{"v":0,"d":"0%"}}]
[null,"GR1","identifier les phrases d’un texte en s’appuyant sur la ponctuation (point et majuscule). ",{"$nulls":36},{"$f":"COUNTIF($D66:$AL66,$AU$1)/$AV$1","v":{"v":0,"d":"0%"}},{"$f":"COUNTIF($D66:$AL66,$AU$2)/$AV$1","v":{"v":0,"d":"0%"}},{"$f":"COUNTIF($D66:$AL66,$AU$3)/$AV$1","v":{"v":0,"d":"0%"}},{"$f":"COUNTIF($D66:$AL66,$AU$4)/$AV$1","v":{"v":0,"d":"0%"}},{"$f":"COUNTIF(D66:$AL66,\"NE\")/$AV$1","v":{"v":0,"d":"0%"}},{"$f":"AN66+(AO66*0.66)+(AP66*0.33)","v":{"v":0,"d":"0%"}}]
[null,"GR2","approche des formes et types de phrase : savoir transposer oralement une phrase affirmative en phrase négative ou interrogative.",{"$nulls":36},{"$f":"COUNTIF($D67:$AL67,$AU$1)/$AV$1","v":{"v":0,"d":"0%"}},{"$f":"COUNTIF($D67:$AL67,$AU$2)/$AV$1","v":{"v":0,"d":"0%"}},{"$f":"COUNTIF($D67:$AL67,$AU$3)/$AV$1","v":{"v":0,"d":"0%"}},{"$f":"COUNTIF($D67:$AL67,$AU$4)/$AV$1","v":{"v":0,"d":"0%"}},{"$f":"COUNTIF(D67:$AL67,\"NE\")/$AV$1","v":{"v":0,"d":"0%"}},{"$f":"AN67+(AO67*0.66)+(AP67*0.33)","v":{"v":0,"d":"0%"}}]
[null,"","Les classes de mots",{"$f":"COUNTA(D67:D74)*10","v":0},{"$f":"COUNTA(E67:E74)*10","v":0},0,0,0,0,0,0,0,0,0,0,0,0,0,0,0,0,0,0,0,0,0,0,0,0,0,0,0,0,0,0,0,{"$nulls":3},{"$f":"COUNTIF($D68:$AL68,$AU$1)/$AV$1","v":{"v":0,"d":"0%"}},{"$f":"COUNTIF($D68:$AL68,$AU$2)/$AV$1","v":{"v":0,"d":"0%"}},{"$f":"COUNTIF($D68:$AL68,$AU$3)/$AV$1","v":{"v":0,"d":"0%"}},{"$f":"COUNTIF($D68:$AL68,$AU$4)/$AV$1","v":{"v":0,"d":"0%"}},{"$f":"COUNTIF(D68:$AL68,\"NE\")/$AV$1","v":{"v":0,"d":"0%"}},{"$f":"AN68+(AO68*0.66)+(AP68*0.33)","v":{"v":0,"d":"0%"}}]
[null,"GR3","reconnaître les noms et les verbes et les distinguer des autres mots ",{"$nulls":36},{"$f":"COUNTIF($D69:$AL69,$AU$1)/$AV$1","v":{"v":0,"d":"0%"}},{"$f":"COUNTIF($D69:$AL69,$AU$2)/$AV$1","v":{"v":0,"d":"0%"}},{"$f":"COUNTIF($D69:$AL69,$AU$3)/$AV$1","v":{"v":0,"d":"0%"}},{"$f":"COUNTIF($D69:$AL69,$AU$4)/$AV$1","v":{"v":0,"d":"0%"}},{"$f":"COUNTIF(D69:$AL69,\"NE\")/$AV$1","v":{"v":0,"d":"0%"}},{"$f":"AN69+(AO69*0.66)+(AP69*0.33)","v":{"v":0,"d":"0%"}}]
[null,"GR4","distinguer le nom et l’article qui le précède ; identifier l’article ",{"$nulls":36},{"$f":"COUNTIF($D70:$AL70,$AU$1)/$AV$1","v":{"v":0,"d":"0%"}},{"$f":"COUNTIF($D70:$AL70,$AU$2)/$AV$1","v":{"v":0,"d":"0%"}},{"$f":"COUNTIF($D70:$AL70,$AU$3)/$AV$1","v":{"v":0,"d":"0%"}},{"$f":"COUNTIF($D70:$AL70,$AU$4)/$AV$1","v":{"v":0,"d":"0%"}},{"$f":"COUNTIF(D70:$AL70,\"NE\")/$AV$1","v":{"v":0,"d":"0%"}},{"$f":"AN70+(AO70*0.66)+(AP70*0.33)","v":{"v":0,"d":"0%"}}]
[null,"GR5","approche du pronom : savoir utiliser oralement les pronoms personnels sujets.",{"$nulls":36},{"$f":"COUNTIF($D71:$AL71,$AU$1)/$AV$1","v":{"v":0,"d":"0%"}},{"$f":"COUNTIF($D71:$AL71,$AU$2)/$AV$1","v":{"v":0,"d":"0%"}},{"$f":"COUNTIF($D71:$AL71,$AU$3)/$AV$1","v":{"v":0,"d":"0%"}},{"$f":"COUNTIF($D71:$AL71,$AU$4)/$AV$1","v":{"v":0,"d":"0%"}},{"$f":"COUNTIF(D71:$AL71,\"NE\")/$AV$1","v":{"v":0,"d":"0%"}},{"$f":"AN71+(AO71*0.66)+(AP71*0.33)","v":{"v":0,"d":"0%"}}]
[null,".GR6","- distinguer selon leur nature : les verbes, les noms, les articles, les pronoms personnels (formes sujet), les adjectifs qualificatifs ;",{"$nulls":36},{"$f":"COUNTIF($D72:$AL72,$AU$1)/$AV$1","v":{"v":0,"d":"0%"}},{"$f":"COUNTIF($D72:$AL72,$AU$2)/$AV$1","v":{"v":0,"d":"0%"}},{"$f":"COUNTIF($D72:$AL72,$AU$3)/$AV$1","v":{"v":0,"d":"0%"}},{"$f":"COUNTIF($D72:$AL72,$AU$4)/$AV$1","v":{"v":0,"d":"0%"}},{"$f":"COUNTIF(D72:$AL72,\"NE\")/$AV$1","v":{"v":0,"d":"0%"}},{"$f":"AN72+(AO72*0.66)+(AP72*0.33)","v":{"v":0,"d":"0%"}}]
[null,"GR7","- le nom : distinguer nom propre et nom commun ;",{"$nulls":36},{"$f":"COUNTIF($D73:$AL73,$AU$1)/$AV$1","v":{"v":0,"d":"0%"}},{"$f":"COUNTIF($D73:$AL73,$AU$2)/$AV$1","v":{"v":0,"d":"0%"}},{"$f":"COUNTIF($D73:$AL73,$AU$3)/$AV$1","v":{"v":0,"d":"0%"}},{"$f":"COUNTIF($D73:$AL73,$AU$4)/$AV$1","v":{"v":0,"d":"0%"}},{"$f":"COUNTIF(D73:$AL73,\"NE\")/$AV$1","v":{"v":0,"d":"0%"}},{"$f":"AN73+(AO73*0.66)+(AP73*0.33)","v":{"v":0,"d":"0%"}}]
[null,"GR8","- l’article : commencer à repérer les articles élidés (l’) et contractés (du, au, aux) ;",{"$nulls":36},{"$f":"COUNTIF($D74:$AL74,$AU$1)/$AV$1","v":{"v":0,"d":"0%"}},{"$f":"COUNTIF($D74:$AL74,$AU$2)/$AV$1","v":{"v":0,"d":"0%"}},{"$f":"COUNTIF($D74:$AL74,$AU$3)/$AV$1","v":{"v":0,"d":"0%"}},{"$f":"COUNTIF($D74:$AL74,$AU$4)/$AV$1","v":{"v":0,"d":"0%"}},{"$f":"COUNTIF(D74:$AL74,\"NE\")/$AV$1","v":{"v":0,"d":"0%"}},{"$f":"AN74+(AO74*0.66)+(AP74*0.33)","v":{"v":0,"d":"0%"}}]
[null,"GR9","- manipuler d’autres déterminants ;",{"$nulls":36},{"$f":"COUNTIF($D75:$AL75,$AU$1)/$AV$1","v":{"v":0,"d":"0%"}},{"$f":"COUNTIF($D75:$AL75,$AU$2)/$AV$1","v":{"v":0,"d":"0%"}},{"$f":"COUNTIF($D75:$AL75,$AU$3)/$AV$1","v":{"v":0,"d":"0%"}},{"$f":"COUNTIF($D75:$AL75,$AU$4)/$AV$1","v":{"v":0,"d":"0%"}},{"$f":"COUNTIF(D75:$AL75,\"NE\")/$AV$1","v":{"v":0,"d":"0%"}},{"$f":"AN75+(AO75*0.66)+(AP75*0.33)","v":{"v":0,"d":"0%"}}]
[null,"GR10","- approche de l’adverbe : modifier le sens d’un verbe en ajoutant un adverbe.",{"$nulls":36},{"$f":"COUNTIF($D76:$AL76,$AU$1)/$AV$1","v":{"v":0,"d":"0%"}},{"$f":"COUNTIF($D76:$AL76,$AU$2)/$AV$1","v":{"v":0,"d":"0%"}},{"$f":"COUNTIF($D76:$AL76,$AU$3)/$AV$1","v":{"v":0,"d":"0%"}},{"$f":"COUNTIF($D76:$AL76,$AU$4)/$AV$1","v":{"v":0,"d":"0%"}},{"$f":"COUNTIF(D76:$AL76,\"NE\")/$AV$1","v":{"v":0,"d":"0%"}},{"$f":"AN76+(AO76*0.66)+(AP76*0.33)","v":{"v":0,"d":"0%"}}]
[null,"","Les fonctions",{"$f":"COUNTA(D76:D77)*10","v":0},{"$f":"COUNTA(E76:E77)*10","v":0},0,0,0,0,0,0,0,0,0,0,0,0,0,0,0,0,0,0,0,0,0,0,0,0,0,0,0,0,0,0,0,{"$nulls":3},{"$f":"COUNTIF($D77:$AL77,$AU$1)/$AV$1","v":{"v":0,"d":"0%"}},{"$f":"COUNTIF($D77:$AL77,$AU$2)/$AV$1","v":{"v":0,"d":"0%"}},{"$f":"COUNTIF($D77:$AL77,$AU$3)/$AV$1","v":{"v":0,"d":"0%"}},{"$f":"COUNTIF($D77:$AL77,$AU$4)/$AV$1","v":{"v":0,"d":"0%"}},{"$f":"COUNTIF(D77:$AL77,\"NE\")/$AV$1","v":{"v":0,"d":"0%"}},{"$f":"AN77+(AO77*0.66)+(AP77*0.33)","v":{"v":0,"d":"0%"}}]
[null,".GR11","dans la phrase simple où l’ordre syntaxique régulier sujet-verbe est respecté, identifier le verbe et son sujet (sous la forme d’un nom propre, d’un pronom, ou d’un groupe nominal) ;",{"$nulls":36},{"$f":"COUNTIF($D78:$AL78,$AU$1)/$AV$1","v":{"v":0,"d":"0%"}},{"$f":"COUNTIF($D78:$AL78,$AU$2)/$AV$1","v":{"v":0,"d":"0%"}},{"$f":"COUNTIF($D78:$AL78,$AU$3)/$AV$1","v":{"v":0,"d":"0%"}},{"$f":"COUNTIF($D78:$AL78,$AU$4)/$AV$1","v":{"v":0,"d":"0%"}},{"$f":"COUNTIF(D78:$AL78,\"NE\")/$AV$1","v":{"v":0,"d":"0%"}},{"$f":"AN78+(AO78*0.66)+(AP78*0.33)","v":{"v":0,"d":"0%"}}]
[null,"GR12","approche de la notion de circonstance : savoir répondre oralement aux questions où ?, quand ?, pourquoi ?, comment ? ",{"$nulls":36},{"$f":"COUNTIF($D79:$AL79,$AU$1)/$AV$1","v":{"v":0,"d":"0%"}},{"$f":"COUNTIF($D79:$AL79,$AU$2)/$AV$1","v":{"v":0,"d":"0%"}},{"$f":"COUNTIF($D79:$AL79,$AU$3)/$AV$1","v":{"v":0,"d":"0%"}},{"$f":"COUNTIF($D79:$AL79,$AU$4)/$AV$1","v":{"v":0,"d":"0%"}},{"$f":"COUNTIF(D79:$AL79,\"NE\")/$AV$1","v":{"v":0,"d":"0%"}},{"$f":"AN79+(AO79*0.66)+(AP79*0.33)","v":{"v":0,"d":"0%"}}]
[null,"","Les genres et nombres",{"$f":"COUNTA(D79:D81)*10","v":0},{"$f":"COUNTA(E79:E81)*10","v":0},0,0,0,0,0,0,0,0,0,0,0,0,0,0,0,0,0,0,0,0,0,0,0,0,0,0,0,0,0,0,0,{"$nulls":3},{"$f":"COUNTIF($D80:$AL80,$AU$1)/$AV$1","v":{"v":0,"d":"0%"}},{"$f":"COUNTIF($D80:$AL80,$AU$2)/$AV$1","v":{"v":0,"d":"0%"}},{"$f":"COUNTIF($D80:$AL80,$AU$3)/$AV$1","v":{"v":0,"d":"0%"}},{"$f":"COUNTIF($D80:$AL80,$AU$4)/$AV$1","v":{"v":0,"d":"0%"}},{"$f":"COUNTIF(D80:$AL80,\"NE\")/$AV$1","v":{"v":0,"d":"0%"}},{"$f":"AN80+(AO80*0.66)+(AP80*0.33)","v":{"v":0,"d":"0%"}}]
[null,"GR13","repérer et justifier des marques du genre et du nombre : les du pluriel des noms, le e du féminin de l’adjectif, les terminaisons –nt des verbes du 1er groupe au présent de l’indicatif. ",{"$nulls":36},{"$f":"COUNTIF($D81:$AL81,$AU$1)/$AV$1","v":{"v":0,"d":"0%"}},{"$f":"COUNTIF($D81:$AL81,$AU$2)/$AV$1","v":{"v":0,"d":"0%"}},{"$f":"COUNTIF($D81:$AL81,$AU$3)/$AV$1","v":{"v":0,"d":"0%"}},{"$f":"COUNTIF($D81:$AL81,$AU$4)/$AV$1","v":{"v":0,"d":"0%"}},{"$f":"COUNTIF(D81:$AL81,\"NE\")/$AV$1","v":{"v":0,"d":"0%"}},{"$f":"AN81+(AO81*0.66)+(AP81*0.33)","v":{"v":0,"d":"0%"}}]
[null,"GR14","connaître et appliquer les notions de masculin/féminin, singulier/pluriel ;",{"$nulls":36},{"$f":"COUNTIF($D82:$AL82,$AU$1)/$AV$1","v":{"v":0,"d":"0%"}},{"$f":"COUNTIF($D82:$AL82,$AU$2)/$AV$1","v":{"v":0,"d":"0%"}},{"$f":"COUNTIF($D82:$AL82,$AU$3)/$AV$1","v":{"v":0,"d":"0%"}},{"$f":"COUNTIF($D82:$AL82,$AU$4)/$AV$1","v":{"v":0,"d":"0%"}},{"$f":"COUNTIF(D82:$AL82,\"NE\")/$AV$1","v":{"v":0,"d":"0%"}},{"$f":"AN82+(AO82*0.66)+(AP82*0.33)","v":{"v":0,"d":"0%"}}]
[null,"GR15","connaître et appliquer la règle de l’accord du verbe avec son sujet, et, dans le groupe nominal, la règle de l’accord entre le déterminant et le nom qu’il détermine, entre l’adjectif qualificatif et le nom qu’il qualifie.",{"$nulls":36},{"$f":"COUNTIF($D83:$AL83,$AU$1)/$AV$1","v":{"v":0,"d":"0%"}},{"$f":"COUNTIF($D83:$AL83,$AU$2)/$AV$1","v":{"v":0,"d":"0%"}},{"$f":"COUNTIF($D83:$AL83,$AU$3)/$AV$1","v":{"v":0,"d":"0%"}},{"$f":"COUNTIF($D83:$AL83,$AU$4)/$AV$1","v":{"v":0,"d":"0%"}},{"$f":"COUNTIF(D83:$AL83,\"NE\")/$AV$1","v":{"v":0,"d":"0%"}},{"$f":"AN83+(AO83*0.66)+(AP83*0.33)","v":{"v":0,"d":"0%"}}]
[null,"","Le verbe",{"$f":"COUNTA(D83:D87)*10","v":0},{"$f":"COUNTA(E83:E87)*10","v":0},0,0,0,0,0,0,0,0,0,0,0,0,0,0,0,0,0,0,0,0,0,0,0,0,0,0,0,0,0,0,0,{"$nulls":3},{"$f":"COUNTIF($D84:$AL84,$AU$1)/$AV$1","v":{"v":0,"d":"0%"}},{"$f":"COUNTIF($D84:$AL84,$AU$2)/$AV$1","v":{"v":0,"d":"0%"}},{"$f":"COUNTIF($D84:$AL84,$AU$3)/$AV$1","v":{"v":0,"d":"0%"}},{"$f":"COUNTIF($D84:$AL84,$AU$4)/$AV$1","v":{"v":0,"d":"0%"}},{"$f":"COUNTIF(D84:$AL84,\"NE\")/$AV$1","v":{"v":0,"d":"0%"}},{"$f":"AN84+(AO84*0.66)+(AP84*0.33)","v":{"v":0,"d":"0%"}}]
[null,"GR16","utiliser à l’oral, le présent, le futur et le passé composé.",{"$nulls":36},{"$f":"COUNTIF($D85:$AL85,$AU$1)/$AV$1","v":{"v":0,"d":"0%"}},{"$f":"COUNTIF($D85:$AL85,$AU$2)/$AV$1","v":{"v":0,"d":"0%"}},{"$f":"COUNTIF($D85:$AL85,$AU$3)/$AV$1","v":{"v":0,"d":"0%"}},{"$f":"COUNTIF($D85:$AL85,$AU$4)/$AV$1","v":{"v":0,"d":"0%"}},{"$f":"COUNTIF(D85:$AL85,\"NE\")/$AV$1","v":{"v":0,"d":"0%"}},{"$f":"AN85+(AO85*0.66)+(AP85*0.33)","v":{"v":0,"d":"0%"}}]
[null,".GR17","comprendre la correspondance entre les temps verbaux (passé, présent,   futur) et les notions d’action déjà faite, action en train de se faire, action non encore faite.",{"$nulls":36},{"$f":"COUNTIF($D86:$AL86,$AU$1)/$AV$1","v":{"v":0,"d":"0%"}},{"$f":"COUNTIF($D86:$AL86,$AU$2)/$AV$1","v":{"v":0,"d":"0%"}},{"$f":"COUNTIF($D86:$AL86,$AU$3)/$AV$1","v":{"v":0,"d":"0%"}},{"$f":"COUNTIF($D86:$AL86,$AU$4)/$AV$1","v":{"v":0,"d":"0%"}},{"$f":"COUNTIF(D86:$AL86,\"NE\")/$AV$1","v":{"v":0,"d":"0%"}},{"$f":"AN86+(AO86*0.66)+(AP86*0.33)","v":{"v":0,"d":"0%"}}]
[null,".GR18","identifier le présent, futur, imparfait et passé composé de l’indicatif des verbes étudiés ; trouver leur infinitif ; ",{"$nulls":36},{"$f":"COUNTIF($D87:$AL87,$AU$1)/$AV$1","v":{"v":0,"d":"0%"}},{"$f":"COUNTIF($D87:$AL87,$AU$2)/$AV$1","v":{"v":0,"d":"0%"}},{"$f":"COUNTIF($D87:$AL87,$AU$3)/$AV$1","v":{"v":0,"d":"0%"}},{"$f":"COUNTIF($D87:$AL87,$AU$4)/$AV$1","v":{"v":0,"d":"0%"}},{"$f":"COUNTIF(D87:$AL87,\"NE\")/$AV$1","v":{"v":0,"d":"0%"}},{"$f":"AN87+(AO87*0.66)+(AP87*0.33)","v":{"v":0,"d":"0%"}}]
[null,".GR19","conjuguer les verbes du premier groupe, être et avoir, au présent, au futur, au passé composé de l’indicatif ;",{"$nulls":36},{"$f":"COUNTIF($D88:$AL88,$AU$1)/$AV$1","v":{"v":0,"d":"0%"}},{"$f":"COUNTIF($D88:$AL88,$AU$2)/$AV$1","v":{"v":0,"d":"0%"}},{"$f":"COUNTIF($D88:$AL88,$AU$3)/$AV$1","v":{"v":0,"d":"0%"}},{"$f":"COUNTIF($D88:$AL88,$AU$4)/$AV$1","v":{"v":0,"d":"0%"}},{"$f":"COUNTIF(D88:$AL88,\"NE\")/$AV$1","v":{"v":0,"d":"0%"}},{"$f":"AN88+(AO88*0.66)+(AP88*0.33)","v":{"v":0,"d":"0%"}}]
[null,"GR20","conjuguer les verbes faire, aller, dire, venir  au présent de l’indicatif..",{"$nulls":36},{"$f":"COUNTIF($D89:$AL89,$AU$1)/$AV$1","v":{"v":0,"d":"0%"}},{"$f":"COUNTIF($D89:$AL89,$AU$2)/$AV$1","v":{"v":0,"d":"0%"}},{"$f":"COUNTIF($D89:$AL89,$AU$3)/$AV$1","v":{"v":0,"d":"0%"}},{"$f":"COUNTIF($D89:$AL89,$AU$4)/$AV$1","v":{"v":0,"d":"0%"}},{"$f":"COUNTIF(D89:$AL89,\"NE\")/$AV$1","v":{"v":0,"d":"0%"}},{"$f":"AN89+(AO89*0.66)+(AP89*0.33)","v":{"v":0,"d":"0%"}}]
[null,"","ORTHOGRAPHE",{"$f":"COUNTA(D89:D102)*10","v":0},{"$f":"COUNTA(E89:E102)*10","v":0},0,0,0,0,0,0,0,0,0,0,0,0,0,0,0,0,0,0,0,0,0,0,0,0,0,0,0,0,0,0,0,{"$nulls":3},{"$f":"COUNTIF($D90:$AL90,$AU$1)/$AV$1","v":{"v":0,"d":"0%"}},{"$f":"COUNTIF($D90:$AL90,$AU$2)/$AV$1","v":{"v":0,"d":"0%"}},{"$f":"COUNTIF($D90:$AL90,$AU$3)/$AV$1","v":{"v":0,"d":"0%"}},{"$f":"COUNTIF($D90:$AL90,$AU$4)/$AV$1","v":{"v":0,"d":"0%"}},{"$f":"COUNTIF(D90:$AL90,\"NE\")/$AV$1","v":{"v":0,"d":"0%"}},{"$f":"AN90+(AO90*0.66)+(AP90*0.33)","v":{"v":0,"d":"0%"}}]
[null,"OR1","Écrire sans erreur des mots appris.",{"$nulls":36},{"$f":"COUNTIF($D91:$AL91,$AU$1)/$AV$1","v":{"v":0,"d":"0%"}},{"$f":"COUNTIF($D91:$AL91,$AU$2)/$AV$1","v":{"v":0,"d":"0%"}},{"$f":"COUNTIF($D91:$AL91,$AU$3)/$AV$1","v":{"v":0,"d":"0%"}},{"$f":"COUNTIF($D91:$AL91,$AU$4)/$AV$1","v":{"v":0,"d":"0%"}},{"$f":"COUNTIF(D91:$AL91,\"NE\")/$AV$1","v":{"v":0,"d":"0%"}},{"$f":"AN91+(AO91*0.66)+(AP91*0.33)","v":{"v":0,"d":"0%"}}]
[null,"OR2","Ecrire sans erreur de manière autonome des mots simples en respectant les correspondances entre lettres et sons.",{"$nulls":36},{"$f":"COUNTIF($D92:$AL92,$AU$1)/$AV$1","v":{"v":0,"d":"0%"}},{"$f":"COUNTIF($D92:$AL92,$AU$2)/$AV$1","v":{"v":0,"d":"0%"}},{"$f":"COUNTIF($D92:$AL92,$AU$3)/$AV$1","v":{"v":0,"d":"0%"}},{"$f":"COUNTIF($D92:$AL92,$AU$4)/$AV$1","v":{"v":0,"d":"0%"}},{"$f":"COUNTIF(D92:$AL92,\"NE\")/$AV$1","v":{"v":0,"d":"0%"}},{"$f":"AN92+(AO92*0.66)+(AP92*0.33)","v":{"v":0,"d":"0%"}}]
[null,"OR3","Recopier sans erreur un texte court (2 à 5 lignes).",{"$nulls":36},{"$f":"COUNTIF($D93:$AL93,$AU$1)/$AV$1","v":{"v":0,"d":"0%"}},{"$f":"COUNTIF($D93:$AL93,$AU$2)/$AV$1","v":{"v":0,"d":"0%"}},{"$f":"COUNTIF($D93:$AL93,$AU$3)/$AV$1","v":{"v":0,"d":"0%"}},{"$f":"COUNTIF($D93:$AL93,$AU$4)/$AV$1","v":{"v":0,"d":"0%"}},{"$f":"COUNTIF(D93:$AL93,\"NE\")/$AV$1","v":{"v":0,"d":"0%"}},{"$f":"AN93+(AO93*0.66)+(AP93*0.33)","v":{"v":0,"d":"0%"}}]
[null,"OR4","Commencer à utiliser de manière autonome les marques du genre et du nombre (pluriel du nom, féminin de l’adjectif, terminaison –nt des verbes du 1er groupe).",{"$nulls":36},{"$f":"COUNTIF($D94:$AL94,$AU$1)/$AV$1","v":{"v":0,"d":"0%"}},{"$f":"COUNTIF($D94:$AL94,$AU$2)/$AV$1","v":{"v":0,"d":"0%"}},{"$f":"COUNTIF($D94:$AL94,$AU$3)/$AV$1","v":{"v":0,"d":"0%"}},{"$f":"COUNTIF($D94:$AL94,$AU$4)/$AV$1","v":{"v":0,"d":"0%"}},{"$f":"COUNTIF(D94:$AL94,\"NE\")/$AV$1","v":{"v":0,"d":"0%"}},{"$f":"AN94+(AO94*0.66)+(AP94*0.33)","v":{"v":0,"d":"0%"}}]
[null,"OR5","Commencer à utiliser correctement la majuscule (débuts de phrase, noms propres de personne). ",{"$nulls":36},{"$f":"COUNTIF($D95:$AL95,$AU$1)/$AV$1","v":{"v":0,"d":"0%"}},{"$f":"COUNTIF($D95:$AL95,$AU$2)/$AV$1","v":{"v":0,"d":"0%"}},{"$f":"COUNTIF($D95:$AL95,$AU$3)/$AV$1","v":{"v":0,"d":"0%"}},{"$f":"COUNTIF($D95:$AL95,$AU$4)/$AV$1","v":{"v":0,"d":"0%"}},{"$f":"COUNTIF(D95:$AL95,\"NE\")/$AV$1","v":{"v":0,"d":"0%"}},{"$f":"AN95+(AO95*0.66)+(AP95*0.33)","v":{"v":0,"d":"0%"}}]
[null,".OR6","Écrire sans erreur, sous la dictée, des phrases ou un court texte (5 lignes), préparés ou non, en utilisant ses connaissances lexicales, orthographiques et grammaticales. ",{"$nulls":36},{"$f":"COUNTIF($D96:$AL96,$AU$1)/$AV$1","v":{"v":0,"d":"0%"}},{"$f":"COUNTIF($D96:$AL96,$AU$2)/$AV$1","v":{"v":0,"d":"0%"}},{"$f":"COUNTIF($D96:$AL96,$AU$3)/$AV$1","v":{"v":0,"d":"0%"}},{"$f":"COUNTIF($D96:$AL96,$AU$4)/$AV$1","v":{"v":0,"d":"0%"}},{"$f":"COUNTIF(D96:$AL96,\"NE\")/$AV$1","v":{"v":0,"d":"0%"}},{"$f":"AN96+(AO96*0.66)+(AP96*0.33)","v":{"v":0,"d":"0%"}}]
[null,"OR7","Dans les productions dictées et autonomes :",{"$nulls":36},{"$f":"COUNTIF($D97:$AL97,$AU$1)/$AV$1","v":{"v":0,"d":"0%"}},{"$f":"COUNTIF($D97:$AL97,$AU$2)/$AV$1","v":{"v":0,"d":"0%"}},{"$f":"COUNTIF($D97:$AL97,$AU$3)/$AV$1","v":{"v":0,"d":"0%"}},{"$f":"COUNTIF($D97:$AL97,$AU$4)/$AV$1","v":{"v":0,"d":"0%"}},{"$f":"COUNTIF(D97:$AL97,\"NE\")/$AV$1","v":{"v":0,"d":"0%"}},{"$f":"AN97+(AO97*0.66)+(AP97*0.33)","v":{"v":0,"d":"0%"}}]
[null,".OR8","respecter les correspondances entre lettres et sons,",{"$nulls":36},{"$f":"COUNTIF($D98:$AL98,$AU$1)/$AV$1","v":{"v":0,"d":"0%"}},{"$f":"COUNTIF($D98:$AL98,$AU$2)/$AV$1","v":{"v":0,"d":"0%"}},{"$f":"COUNTIF($D98:$AL98,$AU$3)/$AV$1","v":{"v":0,"d":"0%"}},{"$f":"COUNTIF($D98:$AL98,$AU$4)/$AV$1","v":{"v":0,"d":"0%"}},{"$f":"COUNTIF(D98:$AL98,\"NE\")/$AV$1","v":{"v":0,"d":"0%"}},{"$f":"AN98+(AO98*0.66)+(AP98*0.33)","v":{"v":0,"d":"0%"}}]
[null,".OR9","en particulier, respecter les règles relatives à la valeur des lettres en fonction des voyelles placées à proximité (c/ç, c/qu, g/gu/ge, s/ss),",{"$nulls":36},{"$f":"COUNTIF($D99:$AL99,$AU$1)/$AV$1","v":{"v":0,"d":"0%"}},{"$f":"COUNTIF($D99:$AL99,$AU$2)/$AV$1","v":{"v":0,"d":"0%"}},{"$f":"COUNTIF($D99:$AL99,$AU$3)/$AV$1","v":{"v":0,"d":"0%"}},{"$f":"COUNTIF($D99:$AL99,$AU$4)/$AV$1","v":{"v":0,"d":"0%"}},{"$f":"COUNTIF(D99:$AL99,\"NE\")/$AV$1","v":{"v":0,"d":"0%"}},{"$f":"AN99+(AO99*0.66)+(AP99*0.33)","v":{"v":0,"d":"0%"}}]
[null,"OR10","orthographier sans erreur les mots invariables les plus fréquemment rencontrés ainsi que les mots-outils appris au CP, ",{"$nulls":36},{"$f":"COUNTIF($D100:$AL100,$AU$1)/$AV$1","v":{"v":0,"d":"0%"}},{"$f":"COUNTIF($D100:$AL100,$AU$2)/$AV$1","v":{"v":0,"d":"0%"}},{"$f":"COUNTIF($D100:$AL100,$AU$3)/$AV$1","v":{"v":0,"d":"0%"}},{"$f":"COUNTIF($D100:$AL100,$AU$4)/$AV$1","v":{"v":0,"d":"0%"}},{"$f":"COUNTIF(D100:$AL100,\"NE\")/$AV$1","v":{"v":0,"d":"0%"}},{"$f":"AN100+(AO100*0.66)+(AP100*0.33)","v":{"v":0,"d":"0%"}}]
[null,".OR11","marquer l’accord entre le sujet et le verbe dans les phrases où l’ordre sujet-verbe est respecté,",{"$nulls":36},{"$f":"COUNTIF($D101:$AL101,$AU$1)/$AV$1","v":{"v":0,"d":"0%"}},{"$f":"COUNTIF($D101:$AL101,$AU$2)/$AV$1","v":{"v":0,"d":"0%"}},{"$f":"COUNTIF($D101:$AL101,$AU$3)/$AV$1","v":{"v":0,"d":"0%"}},{"$f":"COUNTIF($D101:$AL101,$AU$4)/$AV$1","v":{"v":0,"d":"0%"}},{"$f":"COUNTIF(D101:$AL101,\"NE\")/$AV$1","v":{"v":0,"d":"0%"}},{"$f":"AN101+(AO101*0.66)+(AP101*0.33)","v":{"v":0,"d":"0%"}}]
[null,".OR12","dans le groupe nominal simple, marquer l’accord de l’adjectif qualificatif avec le nom qu’il qualifie,",{"$nulls":36},{"$f":"COUNTIF($D102:$AL102,$AU$1)/$AV$1","v":{"v":0,"d":"0%"}},{"$f":"COUNTIF($D102:$AL102,$AU$2)/$AV$1","v":{"v":0,"d":"0%"}},{"$f":"COUNTIF($D102:$AL102,$AU$3)/$AV$1","v":{"v":0,"d":"0%"}},{"$f":"COUNTIF($D102:$AL102,$AU$4)/$AV$1","v":{"v":0,"d":"0%"}},{"$f":"COUNTIF(D102:$AL102,\"NE\")/$AV$1","v":{"v":0,"d":"0%"}},{"$f":"AN102+(AO102*0.66)+(AP102*0.33)","v":{"v":0,"d":"0%"}}]
[null,".OR13","orthographier sans erreur les formes conjuguées apprises,",{"$nulls":36},{"$f":"COUNTIF($D103:$AL103,$AU$1)/$AV$1","v":{"v":0,"d":"0%"}},{"$f":"COUNTIF($D103:$AL103,$AU$2)/$AV$1","v":{"v":0,"d":"0%"}},{"$f":"COUNTIF($D103:$AL103,$AU$3)/$AV$1","v":{"v":0,"d":"0%"}},{"$f":"COUNTIF($D103:$AL103,$AU$4)/$AV$1","v":{"v":0,"d":"0%"}},{"$f":"COUNTIF(D103:$AL103,\"NE\")/$AV$1","v":{"v":0,"d":"0%"}},{"$f":"AN103+(AO103*0.66)+(AP103*0.33)","v":{"v":0,"d":"0%"}}]
[null,"OR14","utiliser à bon escient le point, la majuscule, ainsi que la virgule dans le cas de l’énumération.",{"$nulls":36},{"$f":"COUNTIF($D104:$AL104,$AU$1)/$AV$1","v":{"v":0,"d":"0%"}},{"$f":"COUNTIF($D104:$AL104,$AU$2)/$AV$1","v":{"v":0,"d":"0%"}},{"$f":"COUNTIF($D104:$AL104,$AU$3)/$AV$1","v":{"v":0,"d":"0%"}},{"$f":"COUNTIF($D104:$AL104,$AU$4)/$AV$1","v":{"v":0,"d":"0%"}},{"$f":"COUNTIF(D104:$AL104,\"NE\")/$AV$1","v":{"v":0,"d":"0%"}},{"$f":"AN104+(AO104*0.66)+(AP104*0.33)","v":{"v":0,"d":"0%"}}]
[null,""," NOMBRE ET CALCUL",{"$f":"COUNTA(D104:D126)*10","v":0},{"$f":"COUNTA(E104:E126)*10","v":0},0,0,0,0,0,0,0,0,0,0,0,0,0,0,0,0,0,0,0,0,0,0,0,0,0,0,0,0,0,0,0,{"$nulls":3},{"$f":"COUNTIF($D105:$AL105,$AU$1)/$AV$1","v":{"v":0,"d":"0%"}},{"$f":"COUNTIF($D105:$AL105,$AU$2)/$AV$1","v":{"v":0,"d":"0%"}},{"$f":"COUNTIF($D105:$AL105,$AU$3)/$AV$1","v":{"v":0,"d":"0%"}},{"$f":"COUNTIF($D105:$AL105,$AU$4)/$AV$1","v":{"v":0,"d":"0%"}},{"$f":"COUNTIF(D105:$AL105,\"NE\")/$AV$1","v":{"v":0,"d":"0%"}},{"$f":"AN105+(AO105*0.66)+(AP105*0.33)","v":{"v":0,"d":"0%"}}]
[null,"NB1","Connaître (savoir écrire et nommer) les nombres entiers naturels inférieurs à 100.",{"$nulls":36},{"$f":"COUNTIF($D106:$AL106,$AU$1)/$AV$1","v":{"v":0,"d":"0%"}},{"$f":"COUNTIF($D106:$AL106,$AU$2)/$AV$1","v":{"v":0,"d":"0%"}},{"$f":"COUNTIF($D106:$AL106,$AU$3)/$AV$1","v":{"v":0,"d":"0%"}},{"$f":"COUNTIF($D106:$AL106,$AU$4)/$AV$1","v":{"v":0,"d":"0%"}},{"$f":"COUNTIF(D106:$AL106,\"NE\")/$AV$1","v":{"v":0,"d":"0%"}},{"$f":"AN106+(AO106*0.66)+(AP106*0.33)","v":{"v":0,"d":"0%"}}]
[null,"NB2","Produire et reconnaître les décompositions additives des nombres inférieurs à 20 (« table d’addition »).",{"$nulls":36},{"$f":"COUNTIF($D107:$AL107,$AU$1)/$AV$1","v":{"v":0,"d":"0%"}},{"$f":"COUNTIF($D107:$AL107,$AU$2)/$AV$1","v":{"v":0,"d":"0%"}},{"$f":"COUNTIF($D107:$AL107,$AU$3)/$AV$1","v":{"v":0,"d":"0%"}},{"$f":"COUNTIF($D107:$AL107,$AU$4)/$AV$1","v":{"v":0,"d":"0%"}},{"$f":"COUNTIF(D107:$AL107,\"NE\")/$AV$1","v":{"v":0,"d":"0%"}},{"$f":"AN107+(AO107*0.66)+(AP107*0.33)","v":{"v":0,"d":"0%"}}]
[null,"NB3","Comparer, ranger, encadrer ces nombres.",{"$nulls":36},{"$f":"COUNTIF($D108:$AL108,$AU$1)/$AV$1","v":{"v":0,"d":"0%"}},{"$f":"COUNTIF($D108:$AL108,$AU$2)/$AV$1","v":{"v":0,"d":"0%"}},{"$f":"COUNTIF($D108:$AL108,$AU$3)/$AV$1","v":{"v":0,"d":"0%"}},{"$f":"COUNTIF($D108:$AL108,$AU$4)/$AV$1","v":{"v":0,"d":"0%"}},{"$f":"COUNTIF(D108:$AL108,\"NE\")/$AV$1","v":{"v":0,"d":"0%"}},{"$f":"AN108+(AO108*0.66)+(AP108*0.33)","v":{"v":0,"d":"0%"}}]
[null,"NB4","Écrire une suite de nombres dans l’ordre croissant ou décroissant.",{"$nulls":36},{"$f":"COUNTIF($D109:$AL109,$AU$1)/$AV$1","v":{"v":0,"d":"0%"}},{"$f":"COUNTIF($D109:$AL109,$AU$2)/$AV$1","v":{"v":0,"d":"0%"}},{"$f":"COUNTIF($D109:$AL109,$AU$3)/$AV$1","v":{"v":0,"d":"0%"}},{"$f":"COUNTIF($D109:$AL109,$AU$4)/$AV$1","v":{"v":0,"d":"0%"}},{"$f":"COUNTIF(D109:$AL109,\"NE\")/$AV$1","v":{"v":0,"d":"0%"}},{"$f":"AN109+(AO109*0.66)+(AP109*0.33)","v":{"v":0,"d":"0%"}}]
[null,"NB5","Connaître les doubles des nombres inférieurs à 10 et les moitiés des nombres pairs inférieurs à 20.",{"$nulls":36},{"$f":"COUNTIF($D110:$AL110,$AU$1)/$AV$1","v":{"v":0,"d":"0%"}},{"$f":"COUNTIF($D110:$AL110,$AU$2)/$AV$1","v":{"v":0,"d":"0%"}},{"$f":"COUNTIF($D110:$AL110,$AU$3)/$AV$1","v":{"v":0,"d":"0%"}},{"$f":"COUNTIF($D110:$AL110,$AU$4)/$AV$1","v":{"v":0,"d":"0%"}},{"$f":"COUNTIF(D110:$AL110,\"NE\")/$AV$1","v":{"v":0,"d":"0%"}},{"$f":"AN110+(AO110*0.66)+(AP110*0.33)","v":{"v":0,"d":"0%"}}]
[null,"NB6","Connaître la table de multiplication par 2.",{"$nulls":36},{"$f":"COUNTIF($D111:$AL111,$AU$1)/$AV$1","v":{"v":0,"d":"0%"}},{"$f":"COUNTIF($D111:$AL111,$AU$2)/$AV$1","v":{"v":0,"d":"0%"}},{"$f":"COUNTIF($D111:$AL111,$AU$3)/$AV$1","v":{"v":0,"d":"0%"}},{"$f":"COUNTIF($D111:$AL111,$AU$4)/$AV$1","v":{"v":0,"d":"0%"}},{"$f":"COUNTIF(D111:$AL111,\"NE\")/$AV$1","v":{"v":0,"d":"0%"}},{"$f":"AN111+(AO111*0.66)+(AP111*0.33)","v":{"v":0,"d":"0%"}}]
[null,"NB7","Calculer mentalement des sommes et des différences.",{"$nulls":36},{"$f":"COUNTIF($D112:$AL112,$AU$1)/$AV$1","v":{"v":0,"d":"0%"}},{"$f":"COUNTIF($D112:$AL112,$AU$2)/$AV$1","v":{"v":0,"d":"0%"}},{"$f":"COUNTIF($D112:$AL112,$AU$3)/$AV$1","v":{"v":0,"d":"0%"}},{"$f":"COUNTIF($D112:$AL112,$AU$4)/$AV$1","v":{"v":0,"d":"0%"}},{"$f":"COUNTIF(D112:$AL112,\"NE\")/$AV$1","v":{"v":0,"d":"0%"}},{"$f":"AN112+(AO112*0.66)+(AP112*0.33)","v":{"v":0,"d":"0%"}}]
[null,"NB8","Calculer en ligne des sommes, des différences, des opérations à trous.",{"$nulls":36},{"$f":"COUNTIF($D113:$AL113,$AU$1)/$AV$1","v":{"v":0,"d":"0%"}},{"$f":"COUNTIF($D113:$AL113,$AU$2)/$AV$1","v":{"v":0,"d":"0%"}},{"$f":"COUNTIF($D113:$AL113,$AU$3)/$AV$1","v":{"v":0,"d":"0%"}},{"$f":"COUNTIF($D113:$AL113,$AU$4)/$AV$1","v":{"v":0,"d":"0%"}},{"$f":"COUNTIF(D113:$AL113,\"NE\")/$AV$1","v":{"v":0,"d":"0%"}},{"$f":"AN113+(AO113*0.66)+(AP113*0.33)","v":{"v":0,"d":"0%"}}]
[null,"NB9","Connaître et utiliser les techniques opératoires de l’addition et commencer à utliser celles de la soustraction (sur les nombres inférieurs à 100).",{"$nulls":36},{"$f":"COUNTIF($D114:$AL114,$AU$1)/$AV$1","v":{"v":0,"d":"0%"}},{"$f":"COUNTIF($D114:$AL114,$AU$2)/$AV$1","v":{"v":0,"d":"0%"}},{"$f":"COUNTIF($D114:$AL114,$AU$3)/$AV$1","v":{"v":0,"d":"0%"}},{"$f":"COUNTIF($D114:$AL114,$AU$4)/$AV$1","v":{"v":0,"d":"0%"}},{"$f":"COUNTIF(D114:$AL114,\"NE\")/$AV$1","v":{"v":0,"d":"0%"}},{"$f":"AN114+(AO114*0.66)+(AP114*0.33)","v":{"v":0,"d":"0%"}}]
[null,"NB10","Résoudre des problèmes simples à une opération. ",{"$nulls":36},{"$f":"COUNTIF($D115:$AL115,$AU$1)/$AV$1","v":{"v":0,"d":"0%"}},{"$f":"COUNTIF($D115:$AL115,$AU$2)/$AV$1","v":{"v":0,"d":"0%"}},{"$f":"COUNTIF($D115:$AL115,$AU$3)/$AV$1","v":{"v":0,"d":"0%"}},{"$f":"COUNTIF($D115:$AL115,$AU$4)/$AV$1","v":{"v":0,"d":"0%"}},{"$f":"COUNTIF(D115:$AL115,\"NE\")/$AV$1","v":{"v":0,"d":"0%"}},{"$f":"AN115+(AO115*0.66)+(AP115*0.33)","v":{"v":0,"d":"0%"}}]
[null,".NB11","Connaître (savoir écrire et nommer) les nombres entiers naturels inférieurs à 1 000.",{"$nulls":36},{"$f":"COUNTIF($D116:$AL116,$AU$1)/$AV$1","v":{"v":0,"d":"0%"}},{"$f":"COUNTIF($D116:$AL116,$AU$2)/$AV$1","v":{"v":0,"d":"0%"}},{"$f":"COUNTIF($D116:$AL116,$AU$3)/$AV$1","v":{"v":0,"d":"0%"}},{"$f":"COUNTIF($D116:$AL116,$AU$4)/$AV$1","v":{"v":0,"d":"0%"}},{"$f":"COUNTIF(D116:$AL116,\"NE\")/$AV$1","v":{"v":0,"d":"0%"}},{"$f":"AN116+(AO116*0.66)+(AP116*0.33)","v":{"v":0,"d":"0%"}}]
[null,".NB12","Repérer et placer ces nombres sur une droite graduée, les comparer, les ranger, les encadrer.",{"$nulls":36},{"$f":"COUNTIF($D117:$AL117,$AU$1)/$AV$1","v":{"v":0,"d":"0%"}},{"$f":"COUNTIF($D117:$AL117,$AU$2)/$AV$1","v":{"v":0,"d":"0%"}},{"$f":"COUNTIF($D117:$AL117,$AU$3)/$AV$1","v":{"v":0,"d":"0%"}},{"$f":"COUNTIF($D117:$AL117,$AU$4)/$AV$1","v":{"v":0,"d":"0%"}},{"$f":"COUNTIF(D117:$AL117,\"NE\")/$AV$1","v":{"v":0,"d":"0%"}},{"$f":"AN117+(AO117*0.66)+(AP117*0.33)","v":{"v":0,"d":"0%"}}]
[null,"NB13","Écrire ou dire des suites de nombres de 10 en 10, de 100 en 100, etc.",{"$nulls":36},{"$f":"COUNTIF($D118:$AL118,$AU$1)/$AV$1","v":{"v":0,"d":"0%"}},{"$f":"COUNTIF($D118:$AL118,$AU$2)/$AV$1","v":{"v":0,"d":"0%"}},{"$f":"COUNTIF($D118:$AL118,$AU$3)/$AV$1","v":{"v":0,"d":"0%"}},{"$f":"COUNTIF($D118:$AL118,$AU$4)/$AV$1","v":{"v":0,"d":"0%"}},{"$f":"COUNTIF(D118:$AL118,\"NE\")/$AV$1","v":{"v":0,"d":"0%"}},{"$f":"AN118+(AO118*0.66)+(AP118*0.33)","v":{"v":0,"d":"0%"}}]
[null,"NB14","Connaître les doubles et moitiés de nombres d’usage courant.",{"$nulls":36},{"$f":"COUNTIF($D119:$AL119,$AU$1)/$AV$1","v":{"v":0,"d":"0%"}},{"$f":"COUNTIF($D119:$AL119,$AU$2)/$AV$1","v":{"v":0,"d":"0%"}},{"$f":"COUNTIF($D119:$AL119,$AU$3)/$AV$1","v":{"v":0,"d":"0%"}},{"$f":"COUNTIF($D119:$AL119,$AU$4)/$AV$1","v":{"v":0,"d":"0%"}},{"$f":"COUNTIF(D119:$AL119,\"NE\")/$AV$1","v":{"v":0,"d":"0%"}},{"$f":"AN119+(AO119*0.66)+(AP119*0.33)","v":{"v":0,"d":"0%"}}]
[null,".NB15","Mémoriser les tables de multiplication par 2, 3, 4 et 5.",{"$nulls":36},{"$f":"COUNTIF($D120:$AL120,$AU$1)/$AV$1","v":{"v":0,"d":"0%"}},{"$f":"COUNTIF($D120:$AL120,$AU$2)/$AV$1","v":{"v":0,"d":"0%"}},{"$f":"COUNTIF($D120:$AL120,$AU$3)/$AV$1","v":{"v":0,"d":"0%"}},{"$f":"COUNTIF($D120:$AL120,$AU$4)/$AV$1","v":{"v":0,"d":"0%"}},{"$f":"COUNTIF(D120:$AL120,\"NE\")/$AV$1","v":{"v":0,"d":"0%"}},{"$f":"AN120+(AO120*0.66)+(AP120*0.33)","v":{"v":0,"d":"0%"}}]
[null,".NB16","Connaître et utiliser des procédures de calcul mental pour calculer des sommes, des différences et des produits.",{"$nulls":36},{"$f":"COUNTIF($D121:$AL121,$AU$1)/$AV$1","v":{"v":0,"d":"0%"}},{"$f":"COUNTIF($D121:$AL121,$AU$2)/$AV$1","v":{"v":0,"d":"0%"}},{"$f":"COUNTIF($D121:$AL121,$AU$3)/$AV$1","v":{"v":0,"d":"0%"}},{"$f":"COUNTIF($D121:$AL121,$AU$4)/$AV$1","v":{"v":0,"d":"0%"}},{"$f":"COUNTIF(D121:$AL121,\"NE\")/$AV$1","v":{"v":0,"d":"0%"}},{"$f":"AN121+(AO121*0.66)+(AP121*0.33)","v":{"v":0,"d":"0%"}}]
[null,".NB17","Calculer en ligne des suites d’opérations.",{"$nulls":36},{"$f":"COUNTIF($D122:$AL122,$AU$1)/$AV$1","v":{"v":0,"d":"0%"}},{"$f":"COUNTIF($D122:$AL122,$AU$2)/$AV$1","v":{"v":0,"d":"0%"}},{"$f":"COUNTIF($D122:$AL122,$AU$3)/$AV$1","v":{"v":0,"d":"0%"}},{"$f":"COUNTIF($D122:$AL122,$AU$4)/$AV$1","v":{"v":0,"d":"0%"}},{"$f":"COUNTIF(D122:$AL122,\"NE\")/$AV$1","v":{"v":0,"d":"0%"}},{"$f":"AN122+(AO122*0.66)+(AP122*0.33)","v":{"v":0,"d":"0%"}}]
[null,".NB18","Connaître et utiliser les techniques opératoires de l’addition et de la soustraction (sur les nombres inférieurs à 1 000).",{"$nulls":36},{"$f":"COUNTIF($D123:$AL123,$AU$1)/$AV$1","v":{"v":0,"d":"0%"}},{"$f":"COUNTIF($D123:$AL123,$AU$2)/$AV$1","v":{"v":0,"d":"0%"}},{"$f":"COUNTIF($D123:$AL123,$AU$3)/$AV$1","v":{"v":0,"d":"0%"}},{"$f":"COUNTIF($D123:$AL123,$AU$4)/$AV$1","v":{"v":0,"d":"0%"}},{"$f":"COUNTIF(D123:$AL123,\"NE\")/$AV$1","v":{"v":0,"d":"0%"}},{"$f":"AN123+(AO123*0.66)+(AP123*0.33)","v":{"v":0,"d":"0%"}}]
[null,".NB19","Connaître une technique opératoire de la multiplication et l’utiliser pour effectuer des multiplications par un nombre à un chiffre.",{"$nulls":36},{"$f":"COUNTIF($D124:$AL124,$AU$1)/$AV$1","v":{"v":0,"d":"0%"}},{"$f":"COUNTIF($D124:$AL124,$AU$2)/$AV$1","v":{"v":0,"d":"0%"}},{"$f":"COUNTIF($D124:$AL124,$AU$3)/$AV$1","v":{"v":0,"d":"0%"}},{"$f":"COUNTIF($D124:$AL124,$AU$4)/$AV$1","v":{"v":0,"d":"0%"}},{"$f":"COUNTIF(D124:$AL124,\"NE\")/$AV$1","v":{"v":0,"d":"0%"}},{"$f":"AN124+(AO124*0.66)+(AP124*0.33)","v":{"v":0,"d":"0%"}}]
[null,".NB20","Diviser par 2 ou 5 des nombres inférieurs à 100 (quotient exact entier).",{"$nulls":36},{"$f":"COUNTIF($D125:$AL125,$AU$1)/$AV$1","v":{"v":0,"d":"0%"}},{"$f":"COUNTIF($D125:$AL125,$AU$2)/$AV$1","v":{"v":0,"d":"0%"}},{"$f":"COUNTIF($D125:$AL125,$AU$3)/$AV$1","v":{"v":0,"d":"0%"}},{"$f":"COUNTIF($D125:$AL125,$AU$4)/$AV$1","v":{"v":0,"d":"0%"}},{"$f":"COUNTIF(D125:$AL125,\"NE\")/$AV$1","v":{"v":0,"d":"0%"}},{"$f":"AN125+(AO125*0.66)+(AP125*0.33)","v":{"v":0,"d":"0%"}}]
[null,".NB21","Résoudre des problèmes relevant de l’addition, de la soustraction et de la multiplication.",{"$nulls":36},{"$f":"COUNTIF($D126:$AL126,$AU$1)/$AV$1","v":{"v":0,"d":"0%"}},{"$f":"COUNTIF($D126:$AL126,$AU$2)/$AV$1","v":{"v":0,"d":"0%"}},{"$f":"COUNTIF($D126:$AL126,$AU$3)/$AV$1","v":{"v":0,"d":"0%"}},{"$f":"COUNTIF($D126:$AL126,$AU$4)/$AV$1","v":{"v":0,"d":"0%"}},{"$f":"COUNTIF(D126:$AL126,\"NE\")/$AV$1","v":{"v":0,"d":"0%"}},{"$f":"AN126+(AO126*0.66)+(AP126*0.33)","v":{"v":0,"d":"0%"}}]
[null,"NB22","Approcher la division de deux nombres entiers à partir d’un problème de partage ou de groupements.",{"$nulls":36},{"$f":"COUNTIF($D127:$AL127,$AU$1)/$AV$1","v":{"v":0,"d":"0%"}},{"$f":"COUNTIF($D127:$AL127,$AU$2)/$AV$1","v":{"v":0,"d":"0%"}},{"$f":"COUNTIF($D127:$AL127,$AU$3)/$AV$1","v":{"v":0,"d":"0%"}},{"$f":"COUNTIF($D127:$AL127,$AU$4)/$AV$1","v":{"v":0,"d":"0%"}},{"$f":"COUNTIF(D127:$AL127,\"NE\")/$AV$1","v":{"v":0,"d":"0%"}},{"$f":"AN127+(AO127*0.66)+(AP127*0.33)","v":{"v":0,"d":"0%"}}]
[null,".NB23","Utiliser les fonctions de base de la calculatrice. ",{"$nulls":36},{"$f":"COUNTIF($D128:$AL128,$AU$1)/$AV$1","v":{"v":0,"d":"0%"}},{"$f":"COUNTIF($D128:$AL128,$AU$2)/$AV$1","v":{"v":0,"d":"0%"}},{"$f":"COUNTIF($D128:$AL128,$AU$3)/$AV$1","v":{"v":0,"d":"0%"}},{"$f":"COUNTIF($D128:$AL128,$AU$4)/$AV$1","v":{"v":0,"d":"0%"}},{"$f":"COUNTIF(D128:$AL128,\"NE\")/$AV$1","v":{"v":0,"d":"0%"}},{"$f":"AN128+(AO128*0.66)+(AP128*0.33)","v":{"v":0,"d":"0%"}}]
[null,"","Problèmes ",{"$f":"COUNTA(D128:D130)*10","v":0},{"$f":"COUNTA(E128:E130)*10","v":0},0,0,0,0,0,0,0,0,0,0,0,0,0,0,0,0,0,0,0,0,0,0,0,0,0,0,0,0,0,0,0,{"$nulls":3},{"$f":"COUNTIF($D129:$AL129,$AU$1)/$AV$1","v":{"v":0,"d":"0%"}},{"$f":"COUNTIF($D129:$AL129,$AU$2)/$AV$1","v":{"v":0,"d":"0%"}},{"$f":"COUNTIF($D129:$AL129,$AU$3)/$AV$1","v":{"v":0,"d":"0%"}},{"$f":"COUNTIF($D129:$AL129,$AU$4)/$AV$1","v":{"v":0,"d":"0%"}},{"$f":"COUNTIF(D129:$AL129,\"NE\")/$AV$1","v":{"v":0,"d":"0%"}},{"$f":"AN129+(AO129*0.66)+(AP129*0.33)","v":{"v":0,"d":"0%"}}]
[null,"PB1",{"$nulls":37},{"$f":"COUNTIF($D130:$AL130,$AU$1)/$AV$1","v":{"v":0,"d":"0%"}},{"$f":"COUNTIF($D130:$AL130,$AU$2)/$AV$1","v":{"v":0,"d":"0%"}},{"$f":"COUNTIF($D130:$AL130,$AU$3)/$AV$1","v":{"v":0,"d":"0%"}},{"$f":"COUNTIF($D130:$AL130,$AU$4)/$AV$1","v":{"v":0,"d":"0%"}},{"$f":"COUNTIF(D130:$AL130,\"NE\")/$AV$1","v":{"v":0,"d":"0%"}},{"$f":"AN130+(AO130*0.66)+(AP130*0.33)","v":{"v":0,"d":"0%"}}]
[null,"PB2",{"$nulls":37},{"$f":"COUNTIF($D131:$AL131,$AU$1)/$AV$1","v":{"v":0,"d":"0%"}},{"$f":"COUNTIF($D131:$AL131,$AU$2)/$AV$1","v":{"v":0,"d":"0%"}},{"$f":"COUNTIF($D131:$AL131,$AU$3)/$AV$1","v":{"v":0,"d":"0%"}},{"$f":"COUNTIF($D131:$AL131,$AU$4)/$AV$1","v":{"v":0,"d":"0%"}},{"$f":"COUNTIF(D131:$AL131,\"NE\")/$AV$1","v":{"v":0,"d":"0%"}},{"$f":"AN131+(AO131*0.66)+(AP131*0.33)","v":{"v":0,"d":"0%"}}]
[null,"PB3",{"$nulls":37},{"$f":"COUNTIF($D132:$AL132,$AU$1)/$AV$1","v":{"v":0,"d":"0%"}},{"$f":"COUNTIF($D132:$AL132,$AU$2)/$AV$1","v":{"v":0,"d":"0%"}},{"$f":"COUNTIF($D132:$AL132,$AU$3)/$AV$1","v":{"v":0,"d":"0%"}},{"$f":"COUNTIF($D132:$AL132,$AU$4)/$AV$1","v":{"v":0,"d":"0%"}},{"$f":"COUNTIF(D132:$AL132,\"NE\")/$AV$1","v":{"v":0,"d":"0%"}},{"$f":"AN132+(AO132*0.66)+(AP132*0.33)","v":{"v":0,"d":"0%"}}]
[null,null,"GEOMETRIE",{"$f":"COUNTA(D132:D143)*10","v":0},{"$f":"COUNTA(E132:E143)*10","v":0},0,0,0,0,0,0,0,0,0,0,0,0,0,0,0,0,0,0,0,0,0,0,0,0,0,0,0,0,0,0,0,{"$nulls":3},{"$f":"COUNTIF($D133:$AL133,$AU$1)/$AV$1","v":{"v":0,"d":"0%"}},{"$f":"COUNTIF($D133:$AL133,$AU$2)/$AV$1","v":{"v":0,"d":"0%"}},{"$f":"COUNTIF($D133:$AL133,$AU$3)/$AV$1","v":{"v":0,"d":"0%"}},{"$f":"COUNTIF($D133:$AL133,$AU$4)/$AV$1","v":{"v":0,"d":"0%"}},{"$f":"COUNTIF(D133:$AL133,\"NE\")/$AV$1","v":{"v":0,"d":"0%"}},{"$f":"AN133+(AO133*0.66)+(AP133*0.33)","v":{"v":0,"d":"0%"}}]
[null,".GE1","Situer un objet et utiliser le vocabulaire permettant de définir des positions (devant, derrière, à gauche de, à droite de…).",{"$nulls":36},{"$f":"COUNTIF($D134:$AL134,$AU$1)/$AV$1","v":{"v":0,"d":"0%"}},{"$f":"COUNTIF($D134:$AL134,$AU$2)/$AV$1","v":{"v":0,"d":"0%"}},{"$f":"COUNTIF($D134:$AL134,$AU$3)/$AV$1","v":{"v":0,"d":"0%"}},{"$f":"COUNTIF($D134:$AL134,$AU$4)/$AV$1","v":{"v":0,"d":"0%"}},{"$f":"COUNTIF(D134:$AL134,\"NE\")/$AV$1","v":{"v":0,"d":"0%"}},{"$f":"AN134+(AO134*0.66)+(AP134*0.33)","v":{"v":0,"d":"0%"}}]
[null,"GE2","Reconnaître et nommer un carré, un rectangle, un triangle.",{"$nulls":36},{"$f":"COUNTIF($D135:$AL135,$AU$1)/$AV$1","v":{"v":0,"d":"0%"}},{"$f":"COUNTIF($D135:$AL135,$AU$2)/$AV$1","v":{"v":0,"d":"0%"}},{"$f":"COUNTIF($D135:$AL135,$AU$3)/$AV$1","v":{"v":0,"d":"0%"}},{"$f":"COUNTIF($D135:$AL135,$AU$4)/$AV$1","v":{"v":0,"d":"0%"}},{"$f":"COUNTIF(D135:$AL135,\"NE\")/$AV$1","v":{"v":0,"d":"0%"}},{"$f":"AN135+(AO135*0.66)+(AP135*0.33)","v":{"v":0,"d":"0%"}}]
[null,"GE3","Reproduire des figures géométriques simples à l’aide d’instruments ou de techniques : règle, quadrillage, papier calque.",{"$nulls":36},{"$f":"COUNTIF($D136:$AL136,$AU$1)/$AV$1","v":{"v":0,"d":"0%"}},{"$f":"COUNTIF($D136:$AL136,$AU$2)/$AV$1","v":{"v":0,"d":"0%"}},{"$f":"COUNTIF($D136:$AL136,$AU$3)/$AV$1","v":{"v":0,"d":"0%"}},{"$f":"COUNTIF($D136:$AL136,$AU$4)/$AV$1","v":{"v":0,"d":"0%"}},{"$f":"COUNTIF(D136:$AL136,\"NE\")/$AV$1","v":{"v":0,"d":"0%"}},{"$f":"AN136+(AO136*0.66)+(AP136*0.33)","v":{"v":0,"d":"0%"}}]
[null,"GE4","Reconnaître et nommer le cube et le pavé droit.",{"$nulls":36},{"$f":"COUNTIF($D137:$AL137,$AU$1)/$AV$1","v":{"v":0,"d":"0%"}},{"$f":"COUNTIF($D137:$AL137,$AU$2)/$AV$1","v":{"v":0,"d":"0%"}},{"$f":"COUNTIF($D137:$AL137,$AU$3)/$AV$1","v":{"v":0,"d":"0%"}},{"$f":"COUNTIF($D137:$AL137,$AU$4)/$AV$1","v":{"v":0,"d":"0%"}},{"$f":"COUNTIF(D137:$AL137,\"NE\")/$AV$1","v":{"v":0,"d":"0%"}},{"$f":"AN137+(AO137*0.66)+(AP137*0.33)","v":{"v":0,"d":"0%"}}]
[null,"GE5","S’initier au vocabulaire géométrique.",{"$nulls":36},{"$f":"COUNTIF($D138:$AL138,$AU$1)/$AV$1","v":{"v":0,"d":"0%"}},{"$f":"COUNTIF($D138:$AL138,$AU$2)/$AV$1","v":{"v":0,"d":"0%"}},{"$f":"COUNTIF($D138:$AL138,$AU$3)/$AV$1","v":{"v":0,"d":"0%"}},{"$f":"COUNTIF($D138:$AL138,$AU$4)/$AV$1","v":{"v":0,"d":"0%"}},{"$f":"COUNTIF(D138:$AL138,\"NE\")/$AV$1","v":{"v":0,"d":"0%"}},{"$f":"AN138+(AO138*0.66)+(AP138*0.33)","v":{"v":0,"d":"0%"}}]
[null,".GE6","Décrire, reproduire, tracer un carré,  un rectangle, un triangle rectangle.",{"$nulls":36},{"$f":"COUNTIF($D139:$AL139,$AU$1)/$AV$1","v":{"v":0,"d":"0%"}},{"$f":"COUNTIF($D139:$AL139,$AU$2)/$AV$1","v":{"v":0,"d":"0%"}},{"$f":"COUNTIF($D139:$AL139,$AU$3)/$AV$1","v":{"v":0,"d":"0%"}},{"$f":"COUNTIF($D139:$AL139,$AU$4)/$AV$1","v":{"v":0,"d":"0%"}},{"$f":"COUNTIF(D139:$AL139,\"NE\")/$AV$1","v":{"v":0,"d":"0%"}},{"$f":"AN139+(AO139*0.66)+(AP139*0.33)","v":{"v":0,"d":"0%"}}]
[null,".GE7","Utiliser des instruments pour réaliser des tracés : règle, équerre ou gabarit de l’angle droit.",{"$nulls":36},{"$f":"COUNTIF($D140:$AL140,$AU$1)/$AV$1","v":{"v":0,"d":"0%"}},{"$f":"COUNTIF($D140:$AL140,$AU$2)/$AV$1","v":{"v":0,"d":"0%"}},{"$f":"COUNTIF($D140:$AL140,$AU$3)/$AV$1","v":{"v":0,"d":"0%"}},{"$f":"COUNTIF($D140:$AL140,$AU$4)/$AV$1","v":{"v":0,"d":"0%"}},{"$f":"COUNTIF(D140:$AL140,\"NE\")/$AV$1","v":{"v":0,"d":"0%"}},{"$f":"AN140+(AO140*0.66)+(AP140*0.33)","v":{"v":0,"d":"0%"}}]
[null,".GE8","Percevoir et reconnaître quelques relations et propriétés géométriques : alignement, angle droit, axe de symétrie, égalité de longueurs.",{"$nulls":36},{"$f":"COUNTIF($D141:$AL141,$AU$1)/$AV$1","v":{"v":0,"d":"0%"}},{"$f":"COUNTIF($D141:$AL141,$AU$2)/$AV$1","v":{"v":0,"d":"0%"}},{"$f":"COUNTIF($D141:$AL141,$AU$3)/$AV$1","v":{"v":0,"d":"0%"}},{"$f":"COUNTIF($D141:$AL141,$AU$4)/$AV$1","v":{"v":0,"d":"0%"}},{"$f":"COUNTIF(D141:$AL141,\"NE\")/$AV$1","v":{"v":0,"d":"0%"}},{"$f":"AN141+(AO141*0.66)+(AP141*0.33)","v":{"v":0,"d":"0%"}}]
[null,".GE9","Repérer des cases, des nœuds d’un quadrillage.",{"$nulls":36},{"$f":"COUNTIF($D142:$AL142,$AU$1)/$AV$1","v":{"v":0,"d":"0%"}},{"$f":"COUNTIF($D142:$AL142,$AU$2)/$AV$1","v":{"v":0,"d":"0%"}},{"$f":"COUNTIF($D142:$AL142,$AU$3)/$AV$1","v":{"v":0,"d":"0%"}},{"$f":"COUNTIF($D142:$AL142,$AU$4)/$AV$1","v":{"v":0,"d":"0%"}},{"$f":"COUNTIF(D142:$AL142,\"NE\")/$AV$1","v":{"v":0,"d":"0%"}},{"$f":"AN142+(AO142*0.66)+(AP142*0.33)","v":{"v":0,"d":"0%"}}]
[null,".GE10","Connaître et utiliser un vocabulaire géométrique élémentaire approprié.",{"$nulls":36},{"$f":"COUNTIF($D143:$AL143,$AU$1)/$AV$1","v":{"v":0,"d":"0%"}},{"$f":"COUNTIF($D143:$AL143,$AU$2)/$AV$1","v":{"v":0,"d":"0%"}},{"$f":"COUNTIF($D143:$AL143,$AU$3)/$AV$1","v":{"v":0,"d":"0%"}},{"$f":"COUNTIF($D143:$AL143,$AU$4)/$AV$1","v":{"v":0,"d":"0%"}},{"$f":"COUNTIF(D143:$AL143,\"NE\")/$AV$1","v":{"v":0,"d":"0%"}},{"$f":"AN143+(AO143*0.66)+(AP143*0.33)","v":{"v":0,"d":"0%"}}]
[null,".GE11"," Reconnaître, décrire, nommer quelques solides  droits : cube, pavé..",{"$nulls":36},{"$f":"COUNTIF($D144:$AL144,$AU$1)/$AV$1","v":{"v":0,"d":"0%"}},{"$f":"COUNTIF($D144:$AL144,$AU$2)/$AV$1","v":{"v":0,"d":"0%"}},{"$f":"COUNTIF($D144:$AL144,$AU$3)/$AV$1","v":{"v":0,"d":"0%"}},{"$f":"COUNTIF($D144:$AL144,$AU$4)/$AV$1","v":{"v":0,"d":"0%"}},{"$f":"COUNTIF(D144:$AL144,\"NE\")/$AV$1","v":{"v":0,"d":"0%"}},{"$f":"AN144+(AO144*0.66)+(AP144*0.33)","v":{"v":0,"d":"0%"}}]
[null,".GE12"," Résoudre des problèmes géométriques",{"$nulls":36},{"$f":"COUNTIF($D145:$AL145,$AU$1)/$AV$1","v":{"v":0,"d":"0%"}},{"$f":"COUNTIF($D145:$AL145,$AU$2)/$AV$1","v":{"v":0,"d":"0%"}},{"$f":"COUNTIF($D145:$AL145,$AU$3)/$AV$1","v":{"v":0,"d":"0%"}},{"$f":"COUNTIF($D145:$AL145,$AU$4)/$AV$1","v":{"v":0,"d":"0%"}},{"$f":"COUNTIF(D145:$AL145,\"NE\")/$AV$1","v":{"v":0,"d":"0%"}},{"$f":"AN145+(AO145*0.66)+(AP145*0.33)","v":{"v":0,"d":"0%"}}]
[null,""," GRANDEURS ET MESURE",{"$f":"COUNTA(D145:D153)*10","v":0},{"$f":"COUNTA(E145:E153)*10","v":0},0,0,0,0,0,0,0,0,0,0,0,0,0,0,0,0,0,0,0,0,0,0,0,0,0,0,0,0,0,0,0,{"$nulls":3},{"$f":"COUNTIF($D146:$AL146,$AU$1)/$AV$1","v":{"v":0,"d":"0%"}},{"$f":"COUNTIF($D146:$AL146,$AU$2)/$AV$1","v":{"v":0,"d":"0%"}},{"$f":"COUNTIF($D146:$AL146,$AU$3)/$AV$1","v":{"v":0,"d":"0%"}},{"$f":"COUNTIF($D146:$AL146,$AU$4)/$AV$1","v":{"v":0,"d":"0%"}},{"$f":"COUNTIF(D146:$AL146,\"NE\")/$AV$1","v":{"v":0,"d":"0%"}},{"$f":"AN146+(AO146*0.66)+(AP146*0.33)","v":{"v":0,"d":"0%"}}]
[null,"GM1","Repérer des évènements de la journée en utilisant les heures et les demi heures.",{"$nulls":36},{"$f":"COUNTIF($D147:$AL147,$AU$1)/$AV$1","v":{"v":0,"d":"0%"}},{"$f":"COUNTIF($D147:$AL147,$AU$2)/$AV$1","v":{"v":0,"d":"0%"}},{"$f":"COUNTIF($D147:$AL147,$AU$3)/$AV$1","v":{"v":0,"d":"0%"}},{"$f":"COUNTIF($D147:$AL147,$AU$4)/$AV$1","v":{"v":0,"d":"0%"}},{"$f":"COUNTIF(D147:$AL147,\"NE\")/$AV$1","v":{"v":0,"d":"0%"}},{"$f":"AN147+(AO147*0.66)+(AP147*0.33)","v":{"v":0,"d":"0%"}}]
[null,"GM2","Comparer et classer des objets selon leur longueur et leur masse.",{"$nulls":36},{"$f":"COUNTIF($D148:$AL148,$AU$1)/$AV$1","v":{"v":0,"d":"0%"}},{"$f":"COUNTIF($D148:$AL148,$AU$2)/$AV$1","v":{"v":0,"d":"0%"}},{"$f":"COUNTIF($D148:$AL148,$AU$3)/$AV$1","v":{"v":0,"d":"0%"}},{"$f":"COUNTIF($D148:$AL148,$AU$4)/$AV$1","v":{"v":0,"d":"0%"}},{"$f":"COUNTIF(D148:$AL148,\"NE\")/$AV$1","v":{"v":0,"d":"0%"}},{"$f":"AN148+(AO148*0.66)+(AP148*0.33)","v":{"v":0,"d":"0%"}}]
[null,"GM3","Utiliser la règle graduée pour tracer des segments, comparer des longueurs ",{"$nulls":36},{"$f":"COUNTIF($D149:$AL149,$AU$1)/$AV$1","v":{"v":0,"d":"0%"}},{"$f":"COUNTIF($D149:$AL149,$AU$2)/$AV$1","v":{"v":0,"d":"0%"}},{"$f":"COUNTIF($D149:$AL149,$AU$3)/$AV$1","v":{"v":0,"d":"0%"}},{"$f":"COUNTIF($D149:$AL149,$AU$4)/$AV$1","v":{"v":0,"d":"0%"}},{"$f":"COUNTIF(D149:$AL149,\"NE\")/$AV$1","v":{"v":0,"d":"0%"}},{"$f":"AN149+(AO149*0.66)+(AP149*0.33)","v":{"v":0,"d":"0%"}}]
[null,"GM4","Connaître et utiliser l’euro.",{"$nulls":36},{"$f":"COUNTIF($D150:$AL150,$AU$1)/$AV$1","v":{"v":0,"d":"0%"}},{"$f":"COUNTIF($D150:$AL150,$AU$2)/$AV$1","v":{"v":0,"d":"0%"}},{"$f":"COUNTIF($D150:$AL150,$AU$3)/$AV$1","v":{"v":0,"d":"0%"}},{"$f":"COUNTIF($D150:$AL150,$AU$4)/$AV$1","v":{"v":0,"d":"0%"}},{"$f":"COUNTIF(D150:$AL150,\"NE\")/$AV$1","v":{"v":0,"d":"0%"}},{"$f":"AN150+(AO150*0.66)+(AP150*0.33)","v":{"v":0,"d":"0%"}}]
[null,"GM5","Résoudre des problèmes de vie courante.",{"$nulls":36},{"$f":"COUNTIF($D151:$AL151,$AU$1)/$AV$1","v":{"v":0,"d":"0%"}},{"$f":"COUNTIF($D151:$AL151,$AU$2)/$AV$1","v":{"v":0,"d":"0%"}},{"$f":"COUNTIF($D151:$AL151,$AU$3)/$AV$1","v":{"v":0,"d":"0%"}},{"$f":"COUNTIF($D151:$AL151,$AU$4)/$AV$1","v":{"v":0,"d":"0%"}},{"$f":"COUNTIF(D151:$AL151,\"NE\")/$AV$1","v":{"v":0,"d":"0%"}},{"$f":"AN151+(AO151*0.66)+(AP151*0.33)","v":{"v":0,"d":"0%"}}]
[null,".GM6"," Utiliser un calendrier pour comparer des durées.",{"$nulls":36},{"$f":"COUNTIF($D152:$AL152,$AU$1)/$AV$1","v":{"v":0,"d":"0%"}},{"$f":"COUNTIF($D152:$AL152,$AU$2)/$AV$1","v":{"v":0,"d":"0%"}},{"$f":"COUNTIF($D152:$AL152,$AU$3)/$AV$1","v":{"v":0,"d":"0%"}},{"$f":"COUNTIF($D152:$AL152,$AU$4)/$AV$1","v":{"v":0,"d":"0%"}},{"$f":"COUNTIF(D152:$AL152,\"NE\")/$AV$1","v":{"v":0,"d":"0%"}},{"$f":"AN152+(AO152*0.66)+(AP152*0.33)","v":{"v":0,"d":"0%"}}]
[null,".GM7","Connaître la relation entre heure et minute, mètre et centimètre, kilomètre et mètre, kilogramme et gramme, euro et centimes d’euro.",{"$nulls":36},{"$f":"COUNTIF($D153:$AL153,$AU$1)/$AV$1","v":{"v":0,"d":"0%"}},{"$f":"COUNTIF($D153:$AL153,$AU$2)/$AV$1","v":{"v":0,"d":"0%"}},{"$f":"COUNTIF($D153:$AL153,$AU$3)/$AV$1","v":{"v":0,"d":"0%"}},{"$f":"COUNTIF($D153:$AL153,$AU$4)/$AV$1","v":{"v":0,"d":"0%"}},{"$f":"COUNTIF(D153:$AL153,\"NE\")/$AV$1","v":{"v":0,"d":"0%"}},{"$f":"AN153+(AO153*0.66)+(AP153*0.33)","v":{"v":0,"d":"0%"}}]
[null,".GM8","Mesurer des segments, des distances.",{"$nulls":36},{"$f":"COUNTIF($D154:$AL154,$AU$1)/$AV$1","v":{"v":0,"d":"0%"}},{"$f":"COUNTIF($D154:$AL154,$AU$2)/$AV$1","v":{"v":0,"d":"0%"}},{"$f":"COUNTIF($D154:$AL154,$AU$3)/$AV$1","v":{"v":0,"d":"0%"}},{"$f":"COUNTIF($D154:$AL154,$AU$4)/$AV$1","v":{"v":0,"d":"0%"}},{"$f":"COUNTIF(D154:$AL154,\"NE\")/$AV$1","v":{"v":0,"d":"0%"}},{"$f":"AN154+(AO154*0.66)+(AP154*0.33)","v":{"v":0,"d":"0%"}}]
[null,".GM9","Résoudre des problèmes de longueur et de masse.",{"$nulls":36},{"$f":"COUNTIF($D155:$AL155,$AU$1)/$AV$1","v":{"v":0,"d":"0%"}},{"$f":"COUNTIF($D155:$AL155,$AU$2)/$AV$1","v":{"v":0,"d":"0%"}},{"$f":"COUNTIF($D155:$AL155,$AU$3)/$AV$1","v":{"v":0,"d":"0%"}},{"$f":"COUNTIF($D155:$AL155,$AU$4)/$AV$1","v":{"v":0,"d":"0%"}},{"$f":"COUNTIF(D155:$AL155,\"NE\")/$AV$1","v":{"v":0,"d":"0%"}},{"$f":"AN155+(AO155*0.66)+(AP155*0.33)","v":{"v":0,"d":"0%"}}]
[null,null," ORGANISATION ET GESTION DES DONNEES",{"$f":"COUNTA(D155:D157)*10","v":0},{"$f":"COUNTA(E155:E157)*10","v":0},0,0,0,0,0,0,0,0,0,0,0,0,0,0,0,0,0,0,0,0,0,0,0,0,0,0,0,0,0,0,0,{"$nulls":3},{"$f":"COUNTIF($D156:$AL156,$AU$1)/$AV$1","v":{"v":0,"d":"0%"}},{"$f":"COUNTIF($D156:$AL156,$AU$2)/$AV$1","v":{"v":0,"d":"0%"}},{"$f":"COUNTIF($D156:$AL156,$AU$3)/$AV$1","v":{"v":0,"d":"0%"}},{"$f":"COUNTIF($D156:$AL156,$AU$4)/$AV$1","v":{"v":0,"d":"0%"}},{"$f":"COUNTIF(D156:$AL156,\"NE\")/$AV$1","v":{"v":0,"d":"0%"}},{"$f":"AN156+(AO156*0.66)+(AP156*0.33)","v":{"v":0,"d":"0%"}}]
[null,"OG1","Lire ou compléter un tableau dans des situations concrètes simples.",{"$nulls":36},{"$f":"COUNTIF($D157:$AL157,$AU$1)/$AV$1","v":{"v":0,"d":"0%"}},{"$f":"COUNTIF($D157:$AL157,$AU$2)/$AV$1","v":{"v":0,"d":"0%"}},{"$f":"COUNTIF($D157:$AL157,$AU$3)/$AV$1","v":{"v":0,"d":"0%"}},{"$f":"COUNTIF($D157:$AL157,$AU$4)/$AV$1","v":{"v":0,"d":"0%"}},{"$f":"COUNTIF(D157:$AL157,\"NE\")/$AV$1","v":{"v":0,"d":"0%"}},{"$f":"AN157+(AO157*0.66)+(AP157*0.33)","v":{"v":0,"d":"0%"}}]
[null,".OG2","Utiliser un tableau, un graphique.",{"$nulls":36},{"$f":"COUNTIF($D158:$AL158,$AU$1)/$AV$1","v":{"v":0,"d":"0%"}},{"$f":"COUNTIF($D158:$AL158,$AU$2)/$AV$1","v":{"v":0,"d":"0%"}},{"$f":"COUNTIF($D158:$AL158,$AU$3)/$AV$1","v":{"v":0,"d":"0%"}},{"$f":"COUNTIF($D158:$AL158,$AU$4)/$AV$1","v":{"v":0,"d":"0%"}},{"$f":"COUNTIF(D158:$AL158,\"NE\")/$AV$1","v":{"v":0,"d":"0%"}},{"$f":"AN158+(AO158*0.66)+(AP158*0.33)","v":{"v":0,"d":"0%"}}]
[null,".OG3","Organiser les informations d’un énoncé",{"$nulls":36},{"$f":"COUNTIF($D159:$AL159,$AU$1)/$AV$1","v":{"v":0,"d":"0%"}},{"$f":"COUNTIF($D159:$AL159,$AU$2)/$AV$1","v":{"v":0,"d":"0%"}},{"$f":"COUNTIF($D159:$AL159,$AU$3)/$AV$1","v":{"v":0,"d":"0%"}},{"$f":"COUNTIF($D159:$AL159,$AU$4)/$AV$1","v":{"v":0,"d":"0%"}},{"$f":"COUNTIF(D159:$AL159,\"NE\")/$AV$1","v":{"v":0,"d":"0%"}},{"$f":"AN159+(AO159*0.66)+(AP159*0.33)","v":{"v":0,"d":"0%"}}]
[null,null,"DECOUVERTE DU MONDE",{"$f":"D159+D165","v":0},{"$f":"E159+E165","v":0},0,0,0,0,0,0,0,0,0,0,0,0,0,0,0,0,0,0,0,0,0,0,0,0,0,0,0,0,0,0,0,{"$nulls":3},{"$f":"COUNTIF($D160:$AL160,$AU$1)/$AV$1","v":{"v":0,"d":"0%"}},{"$f":"COUNTIF($D160:$AL160,$AU$2)/$AV$1","v":{"v":0,"d":"0%"}},{"$f":"COUNTIF($D160:$AL160,$AU$3)/$AV$1","v":{"v":0,"d":"0%"}},{"$f":"COUNTIF($D160:$AL160,$AU$4)/$AV$1","v":{"v":0,"d":"0%"}},{"$f":"COUNTIF(D160:$AL160,\"NE\")/$AV$1","v":{"v":0,"d":"0%"}},{"$f":"AN160+(AO160*0.66)+(AP160*0.33)","v":{"v":0,"d":"0%"}}]
[null,null,"Se répérer dans l'espace et le temps",{"$f":"COUNTA(D160:D164)*10","v":0},{"$f":"COUNTA(E160:E164)*10","v":0},0,0,0,0,0,0,0,0,0,0,0,0,0,0,0,0,0,0,0,0,0,0,0,0,0,0,0,0,0,0,0,{"$nulls":3},{"$f":"COUNTIF($D161:$AL161,$AU$1)/$AV$1","v":{"v":0,"d":"0%"}},{"$f":"COUNTIF($D161:$AL161,$AU$2)/$AV$1","v":{"v":0,"d":"0%"}},{"$f":"COUNTIF($D161:$AL161,$AU$3)/$AV$1","v":{"v":0,"d":"0%"}},{"$f":"COUNTIF($D161:$AL161,$AU$4)/$AV$1","v":{"v":0,"d":"0%"}},{"$f":"COUNTIF(D161:$AL161,\"NE\")/$AV$1","v":{"v":0,"d":"0%"}},{"$f":"AN161+(AO161*0.66)+(AP161*0.33)","v":{"v":0,"d":"0%"}}]
[null,"DM1","Elaborer des représentations simples de l’espace familier : la classe, l’école, le quartier, le village, la ville. ",{"$nulls":36},{"$f":"COUNTIF($D162:$AL162,$AU$1)/$AV$1","v":{"v":0,"d":"0%"}},{"$f":"COUNTIF($D162:$AL162,$AU$2)/$AV$1","v":{"v":0,"d":"0%"}},{"$f":"COUNTIF($D162:$AL162,$AU$3)/$AV$1","v":{"v":0,"d":"0%"}},{"$f":"COUNTIF($D162:$AL162,$AU$4)/$AV$1","v":{"v":0,"d":"0%"}},{"$f":"COUNTIF(D162:$AL162,\"NE\")/$AV$1","v":{"v":0,"d":"0%"}},{"$f":"AN162+(AO162*0.66)+(AP162*0.33)","v":{"v":0,"d":"0%"}}]
[null,"DM2","Comparer ces milieux familiers avec d’autres milieux et espaces plus lointains. Ils découvrent des formes usuelles de représentation de l’espace (photographies, cartes, mappemondes, planisphères, globe).",{"$nulls":36},{"$f":"COUNTIF($D163:$AL163,$AU$1)/$AV$1","v":{"v":0,"d":"0%"}},{"$f":"COUNTIF($D163:$AL163,$AU$2)/$AV$1","v":{"v":0,"d":"0%"}},{"$f":"COUNTIF($D163:$AL163,$AU$3)/$AV$1","v":{"v":0,"d":"0%"}},{"$f":"COUNTIF($D163:$AL163,$AU$4)/$AV$1","v":{"v":0,"d":"0%"}},{"$f":"COUNTIF(D163:$AL163,\"NE\")/$AV$1","v":{"v":0,"d":"0%"}},{"$f":"AN163+(AO163*0.66)+(AP163*0.33)","v":{"v":0,"d":"0%"}}]
[null,"DM3","Découvrir des formes usuelles de représentation de l’espace (photographies, cartes, mappemondes, planisphères, globe).",{"$nulls":36},{"$f":"COUNTIF($D164:$AL164,$AU$1)/$AV$1","v":{"v":0,"d":"0%"}},{"$f":"COUNTIF($D164:$AL164,$AU$2)/$AV$1","v":{"v":0,"d":"0%"}},{"$f":"COUNTIF($D164:$AL164,$AU$3)/$AV$1","v":{"v":0,"d":"0%"}},{"$f":"COUNTIF($D164:$AL164,$AU$4)/$AV$1","v":{"v":0,"d":"0%"}},{"$f":"COUNTIF(D164:$AL164,\"NE\")/$AV$1","v":{"v":0,"d":"0%"}},{"$f":"AN164+(AO164*0.66)+(AP164*0.33)","v":{"v":0,"d":"0%"}}]
[null,"DM4","Repérer l’alternance jour-nuit, les semaines, les mois, les saisons. ",{"$nulls":36},{"$f":"COUNTIF($D165:$AL165,$AU$1)/$AV$1","v":{"v":0,"d":"0%"}},{"$f":"COUNTIF($D165:$AL165,$AU$2)/$AV$1","v":{"v":0,"d":"0%"}},{"$f":"COUNTIF($D165:$AL165,$AU$3)/$AV$1","v":{"v":0,"d":"0%"}},{"$f":"COUNTIF($D165:$AL165,$AU$4)/$AV$1","v":{"v":0,"d":"0%"}},{"$f":"COUNTIF(D165:$AL165,\"NE\")/$AV$1","v":{"v":0,"d":"0%"}},{"$f":"AN165+(AO165*0.66)+(AP165*0.33)","v":{"v":0,"d":"0%"}}]
[null,"DM5","Utiliser des outils de repérage et de mesure du temps : le calendrier, l’horloge.",{"$nulls":36},{"$f":"COUNTIF($D166:$AL166,$AU$1)/$AV$1","v":{"v":0,"d":"0%"}},{"$f":"COUNTIF($D166:$AL166,$AU$2)/$AV$1","v":{"v":0,"d":"0%"}},{"$f":"COUNTIF($D166:$AL166,$AU$3)/$AV$1","v":{"v":0,"d":"0%"}},{"$f":"COUNTIF($D166:$AL166,$AU$4)/$AV$1","v":{"v":0,"d":"0%"}},{"$f":"COUNTIF(D166:$AL166,\"NE\")/$AV$1","v":{"v":0,"d":"0%"}},{"$f":"AN166+(AO166*0.66)+(AP166*0.33)","v":{"v":0,"d":"0%"}}]
[null,null,"Découvrir le monde du vivant, de la matière et des objets ",{"$f":"COUNTA(D166:D173)*10","v":0},{"$f":"COUNTA(E166:E173)*10","v":0},0,0,0,0,0,0,0,0,0,0,0,0,0,0,0,0,0,0,0,0,0,0,0,0,0,0,0,0,0,0,0,{"$nulls":3},{"$f":"COUNTIF($D167:$AL167,$AU$1)/$AV$1","v":{"v":0,"d":"0%"}},{"$f":"COUNTIF($D167:$AL167,$AU$2)/$AV$1","v":{"v":0,"d":"0%"}},{"$f":"COUNTIF($D167:$AL167,$AU$3)/$AV$1","v":{"v":0,"d":"0%"}},{"$f":"COUNTIF($D167:$AL167,$AU$4)/$AV$1","v":{"v":0,"d":"0%"}},{"$f":"COUNTIF(D167:$AL167,\"NE\")/$AV$1","v":{"v":0,"d":"0%"}},{"$f":"AN167+(AO167*0.66)+(AP167*0.33)","v":{"v":0,"d":"0%"}}]
[null,"DM7","Repérer des caractéristiques du vivant : naissance, croissance et reproduction ; nutrition et régimes alimentaires des animaux.",{"$nulls":36},{"$f":"COUNTIF($D168:$AL168,$AU$1)/$AV$1","v":{"v":0,"d":"0%"}},{"$f":"COUNTIF($D168:$AL168,$AU$2)/$AV$1","v":{"v":0,"d":"0%"}},{"$f":"COUNTIF($D168:$AL168,$AU$3)/$AV$1","v":{"v":0,"d":"0%"}},{"$f":"COUNTIF($D168:$AL168,$AU$4)/$AV$1","v":{"v":0,"d":"0%"}},{"$f":"COUNTIF(D168:$AL168,\"NE\")/$AV$1","v":{"v":0,"d":"0%"}},{"$f":"AN168+(AO168*0.66)+(AP168*0.33)","v":{"v":0,"d":"0%"}}]
[null,"DM8","Apprendre quelques règles d’hygiène et de sécurité personnelles et collectives.",{"$nulls":36},{"$f":"COUNTIF($D169:$AL169,$AU$1)/$AV$1","v":{"v":0,"d":"0%"}},{"$f":"COUNTIF($D169:$AL169,$AU$2)/$AV$1","v":{"v":0,"d":"0%"}},{"$f":"COUNTIF($D169:$AL169,$AU$3)/$AV$1","v":{"v":0,"d":"0%"}},{"$f":"COUNTIF($D169:$AL169,$AU$4)/$AV$1","v":{"v":0,"d":"0%"}},{"$f":"COUNTIF(D169:$AL169,\"NE\")/$AV$1","v":{"v":0,"d":"0%"}},{"$f":"AN169+(AO169*0.66)+(AP169*0.33)","v":{"v":0,"d":"0%"}}]
[null,"DM9","Comprendre les interactions entre les êtres vivants et leur environnement ",{"$nulls":36},{"$f":"COUNTIF($D170:$AL170,$AU$1)/$AV$1","v":{"v":0,"d":"0%"}},{"$f":"COUNTIF($D170:$AL170,$AU$2)/$AV$1","v":{"v":0,"d":"0%"}},{"$f":"COUNTIF($D170:$AL170,$AU$3)/$AV$1","v":{"v":0,"d":"0%"}},{"$f":"COUNTIF($D170:$AL170,$AU$4)/$AV$1","v":{"v":0,"d":"0%"}},{"$f":"COUNTIF(D170:$AL170,\"NE\")/$AV$1","v":{"v":0,"d":"0%"}},{"$f":"AN170+(AO170*0.66)+(AP170*0.33)","v":{"v":0,"d":"0%"}}]
[null,"DM10","Respecter l’environnement.",{"$nulls":36},{"$f":"COUNTIF($D171:$AL171,$AU$1)/$AV$1","v":{"v":0,"d":"0%"}},{"$f":"COUNTIF($D171:$AL171,$AU$2)/$AV$1","v":{"v":0,"d":"0%"}},{"$f":"COUNTIF($D171:$AL171,$AU$3)/$AV$1","v":{"v":0,"d":"0%"}},{"$f":"COUNTIF($D171:$AL171,$AU$4)/$AV$1","v":{"v":0,"d":"0%"}},{"$f":"COUNTIF(D171:$AL171,\"NE\")/$AV$1","v":{"v":0,"d":"0%"}},{"$f":"AN171+(AO171*0.66)+(AP171*0.33)","v":{"v":0,"d":"0%"}}]
[null,"DM11","Distinguer les solides et les liquides.",{"$nulls":36},{"$f":"COUNTIF($D172:$AL172,$AU$1)/$AV$1","v":{"v":0,"d":"0%"}},{"$f":"COUNTIF($D172:$AL172,$AU$2)/$AV$1","v":{"v":0,"d":"0%"}},{"$f":"COUNTIF($D172:$AL172,$AU$3)/$AV$1","v":{"v":0,"d":"0%"}},{"$f":"COUNTIF($D172:$AL172,$AU$4)/$AV$1","v":{"v":0,"d":"0%"}},{"$f":"COUNTIF(D172:$AL172,\"NE\")/$AV$1","v":{"v":0,"d":"0%"}},{"$f":"AN172+(AO172*0.66)+(AP172*0.33)","v":{"v":0,"d":"0%"}}]
[null,"DM12","Percevoir les changements d’états de la matière.",{"$nulls":36},{"$f":"COUNTIF($D173:$AL173,$AU$1)/$AV$1","v":{"v":0,"d":"0%"}},{"$f":"COUNTIF($D173:$AL173,$AU$2)/$AV$1","v":{"v":0,"d":"0%"}},{"$f":"COUNTIF($D173:$AL173,$AU$3)/$AV$1","v":{"v":0,"d":"0%"}},{"$f":"COUNTIF($D173:$AL173,$AU$4)/$AV$1","v":{"v":0,"d":"0%"}},{"$f":"COUNTIF(D173:$AL173,\"NE\")/$AV$1","v":{"v":0,"d":"0%"}},{"$f":"AN173+(AO173*0.66)+(AP173*0.33)","v":{"v":0,"d":"0%"}}]
[null,"DM13","Réaliser des maquettes élémentaires",{"$nulls":36},{"$f":"COUNTIF($D174:$AL174,$AU$1)/$AV$1","v":{"v":0,"d":"0%"}},{"$f":"COUNTIF($D174:$AL174,$AU$2)/$AV$1","v":{"v":0,"d":"0%"}},{"$f":"COUNTIF($D174:$AL174,$AU$3)/$AV$1","v":{"v":0,"d":"0%"}},{"$f":"COUNTIF($D174:$AL174,$AU$4)/$AV$1","v":{"v":0,"d":"0%"}},{"$f":"COUNTIF(D174:$AL174,\"NE\")/$AV$1","v":{"v":0,"d":"0%"}},{"$f":"AN174+(AO174*0.66)+(AP174*0.33)","v":{"v":0,"d":"0%"}}]
[null,"DM14","Réaliser des circuits électriques simples pour comprendre le fonctionnement d’un appareil. ",{"$nulls":36},{"$f":"COUNTIF($D175:$AL175,$AU$1)/$AV$1","v":{"v":0,"d":"0%"}},{"$f":"COUNTIF($D175:$AL175,$AU$2)/$AV$1","v":{"v":0,"d":"0%"}},{"$f":"COUNTIF($D175:$AL175,$AU$3)/$AV$1","v":{"v":0,"d":"0%"}},{"$f":"COUNTIF($D175:$AL175,$AU$4)/$AV$1","v":{"v":0,"d":"0%"}},{"$f":"COUNTIF(D175:$AL175,\"NE\")/$AV$1","v":{"v":0,"d":"0%"}},{"$f":"AN175+(AO175*0.66)+(AP175*0.33)","v":{"v":0,"d":"0%"}}]
[null,null,"PRATIQUES ARTISTIQUES ET HISTOIRE DE L'ART",{"$f":"D175+D183","v":0},{"$f":"E175+E183","v":0},0,0,0,0,0,0,0,0,0,0,0,0,0,0,0,0,0,0,0,0,0,0,0,0,0,0,0,0,0,0,0,{"$nulls":3},{"$f":"COUNTIF($D176:$AL176,$AU$1)/$AV$1","v":{"v":0,"d":"0%"}},{"$f":"COUNTIF($D176:$AL176,$AU$2)/$AV$1","v":{"v":0,"d":"0%"}},{"$f":"COUNTIF($D176:$AL176,$AU$3)/$AV$1","v":{"v":0,"d":"0%"}},{"$f":"COUNTIF($D176:$AL176,$AU$4)/$AV$1","v":{"v":0,"d":"0%"}},{"$f":"COUNTIF(D176:$AL176,\"NE\")/$AV$1","v":{"v":0,"d":"0%"}},{"$f":"AN176+(AO176*0.66)+(AP176*0.33)","v":{"v":0,"d":"0%"}}]
[null,null,"Arts visuels",{"$f":"COUNTA(D176:D182)*10","v":0},{"$f":"COUNTA(E176:E182)*10","v":0},0,0,0,0,0,0,0,0,0,0,0,0,0,0,0,0,0,0,0,0,0,0,0,0,0,0,0,0,0,0,0,{"$nulls":3},{"$f":"COUNTIF($D177:$AL177,$AU$1)/$AV$1","v":{"v":0,"d":"0%"}},{"$f":"COUNTIF($D177:$AL177,$AU$2)/$AV$1","v":{"v":0,"d":"0%"}},{"$f":"COUNTIF($D177:$AL177,$AU$3)/$AV$1","v":{"v":0,"d":"0%"}},{"$f":"COUNTIF($D177:$AL177,$AU$4)/$AV$1","v":{"v":0,"d":"0%"}},{"$f":"COUNTIF(D177:$AL177,\"NE\")/$AV$1","v":{"v":0,"d":"0%"}},{"$f":"AN177+(AO177*0.66)+(AP177*0.33)","v":{"v":0,"d":"0%"}}]
[null,"PA1","Utiliser des techniques traditionnelles : peinture, dessin",{"$nulls":36},{"$f":"COUNTIF($D178:$AL178,$AU$1)/$AV$1","v":{"v":0,"d":"0%"}},{"$f":"COUNTIF($D178:$AL178,$AU$2)/$AV$1","v":{"v":0,"d":"0%"}},{"$f":"COUNTIF($D178:$AL178,$AU$3)/$AV$1","v":{"v":0,"d":"0%"}},{"$f":"COUNTIF($D178:$AL178,$AU$4)/$AV$1","v":{"v":0,"d":"0%"}},{"$f":"COUNTIF(D178:$AL178,\"NE\")/$AV$1","v":{"v":0,"d":"0%"}},{"$f":"AN178+(AO178*0.66)+(AP178*0.33)","v":{"v":0,"d":"0%"}}]
[null,"PA2","Utiliser des techniques contemporaines : phto numérique, cinéma, vidéo, infographie",{"$nulls":36},{"$f":"COUNTIF($D179:$AL179,$AU$1)/$AV$1","v":{"v":0,"d":"0%"}},{"$f":"COUNTIF($D179:$AL179,$AU$2)/$AV$1","v":{"v":0,"d":"0%"}},{"$f":"COUNTIF($D179:$AL179,$AU$3)/$AV$1","v":{"v":0,"d":"0%"}},{"$f":"COUNTIF($D179:$AL179,$AU$4)/$AV$1","v":{"v":0,"d":"0%"}},{"$f":"COUNTIF(D179:$AL179,\"NE\")/$AV$1","v":{"v":0,"d":"0%"}},{"$f":"AN179+(AO179*0.66)+(AP179*0.33)","v":{"v":0,"d":"0%"}}]
[null,"PA3","Utiliser des procédures simples mais combinées : recouvrement, tracés, montage",{"$nulls":36},{"$f":"COUNTIF($D180:$AL180,$AU$1)/$AV$1","v":{"v":0,"d":"0%"}},{"$f":"COUNTIF($D180:$AL180,$AU$2)/$AV$1","v":{"v":0,"d":"0%"}},{"$f":"COUNTIF($D180:$AL180,$AU$3)/$AV$1","v":{"v":0,"d":"0%"}},{"$f":"COUNTIF($D180:$AL180,$AU$4)/$AV$1","v":{"v":0,"d":"0%"}},{"$f":"COUNTIF(D180:$AL180,\"NE\")/$AV$1","v":{"v":0,"d":"0%"}},{"$f":"AN180+(AO180*0.66)+(AP180*0.33)","v":{"v":0,"d":"0%"}}]
[null,"PA4","Savoir travailler autant en surface qu’en volume.",{"$nulls":36},{"$f":"COUNTIF($D181:$AL181,$AU$1)/$AV$1","v":{"v":0,"d":"0%"}},{"$f":"COUNTIF($D181:$AL181,$AU$2)/$AV$1","v":{"v":0,"d":"0%"}},{"$f":"COUNTIF($D181:$AL181,$AU$3)/$AV$1","v":{"v":0,"d":"0%"}},{"$f":"COUNTIF($D181:$AL181,$AU$4)/$AV$1","v":{"v":0,"d":"0%"}},{"$f":"COUNTIF(D181:$AL181,\"NE\")/$AV$1","v":{"v":0,"d":"0%"}},{"$f":"AN181+(AO181*0.66)+(AP181*0.33)","v":{"v":0,"d":"0%"}}]
[null,"PA5","Savoir utiliser des instruments, des gestes techniques, des médiums et des supports variés.",{"$nulls":36},{"$f":"COUNTIF($D182:$AL182,$AU$1)/$AV$1","v":{"v":0,"d":"0%"}},{"$f":"COUNTIF($D182:$AL182,$AU$2)/$AV$1","v":{"v":0,"d":"0%"}},{"$f":"COUNTIF($D182:$AL182,$AU$3)/$AV$1","v":{"v":0,"d":"0%"}},{"$f":"COUNTIF($D182:$AL182,$AU$4)/$AV$1","v":{"v":0,"d":"0%"}},{"$f":"COUNTIF(D182:$AL182,\"NE\")/$AV$1","v":{"v":0,"d":"0%"}},{"$f":"AN182+(AO182*0.66)+(AP182*0.33)","v":{"v":0,"d":"0%"}}]
[null,"PA6","Exprimer ce que l’on perçoit.",{"$nulls":36},{"$f":"COUNTIF($D183:$AL183,$AU$1)/$AV$1","v":{"v":0,"d":"0%"}},{"$f":"COUNTIF($D183:$AL183,$AU$2)/$AV$1","v":{"v":0,"d":"0%"}},{"$f":"COUNTIF($D183:$AL183,$AU$3)/$AV$1","v":{"v":0,"d":"0%"}},{"$f":"COUNTIF($D183:$AL183,$AU$4)/$AV$1","v":{"v":0,"d":"0%"}},{"$f":"COUNTIF(D183:$AL183,\"NE\")/$AV$1","v":{"v":0,"d":"0%"}},{"$f":"AN183+(AO183*0.66)+(AP183*0.33)","v":{"v":0,"d":"0%"}}]
[null,"PA7","Imaginer et évoquer un projet ou une réalisation en utilisant un vocabulaire approprié",{"$nulls":36},{"$f":"COUNTIF($D184:$AL184,$AU$1)/$AV$1","v":{"v":0,"d":"0%"}},{"$f":"COUNTIF($D184:$AL184,$AU$2)/$AV$1","v":{"v":0,"d":"0%"}},{"$f":"COUNTIF($D184:$AL184,$AU$3)/$AV$1","v":{"v":0,"d":"0%"}},{"$f":"COUNTIF($D184:$AL184,$AU$4)/$AV$1","v":{"v":0,"d":"0%"}},{"$f":"COUNTIF(D184:$AL184,\"NE\")/$AV$1","v":{"v":0,"d":"0%"}},{"$f":"AN184+(AO184*0.66)+(AP184*0.33)","v":{"v":0,"d":"0%"}}]
[null,null,"Éducation musicale",{"$f":"COUNTA(D184:D189)*10","v":0},{"$f":"COUNTA(E184:E189)*10","v":0},0,0,0,0,0,0,0,0,0,0,0,0,0,0,0,0,0,0,0,0,0,0,0,0,0,0,0,0,0,0,0,{"$nulls":3},{"$f":"COUNTIF($D185:$AL185,$AU$1)/$AV$1","v":{"v":0,"d":"0%"}},{"$f":"COUNTIF($D185:$AL185,$AU$2)/$AV$1","v":{"v":0,"d":"0%"}},{"$f":"COUNTIF($D185:$AL185,$AU$3)/$AV$1","v":{"v":0,"d":"0%"}},{"$f":"COUNTIF($D185:$AL185,$AU$4)/$AV$1","v":{"v":0,"d":"0%"}},{"$f":"COUNTIF(D185:$AL185,\"NE\")/$AV$1","v":{"v":0,"d":"0%"}},{"$f":"AN185+(AO185*0.66)+(AP185*0.33)","v":{"v":0,"d":"0%"}}]
[null,"PA8","Apprendre une dizaine de comptines ou chansons.",{"$nulls":36},{"$f":"COUNTIF($D186:$AL186,$AU$1)/$AV$1","v":{"v":0,"d":"0%"}},{"$f":"COUNTIF($D186:$AL186,$AU$2)/$AV$1","v":{"v":0,"d":"0%"}},{"$f":"COUNTIF($D186:$AL186,$AU$3)/$AV$1","v":{"v":0,"d":"0%"}},{"$f":"COUNTIF($D186:$AL186,$AU$4)/$AV$1","v":{"v":0,"d":"0%"}},{"$f":"COUNTIF(D186:$AL186,\"NE\")/$AV$1","v":{"v":0,"d":"0%"}},{"$f":"AN186+(AO186*0.66)+(AP186*0.33)","v":{"v":0,"d":"0%"}}]
[null,"PA9","Ecouter des extraits d’oeuvres diverses.",{"$nulls":36},{"$f":"COUNTIF($D187:$AL187,$AU$1)/$AV$1","v":{"v":0,"d":"0%"}},{"$f":"COUNTIF($D187:$AL187,$AU$2)/$AV$1","v":{"v":0,"d":"0%"}},{"$f":"COUNTIF($D187:$AL187,$AU$3)/$AV$1","v":{"v":0,"d":"0%"}},{"$f":"COUNTIF($D187:$AL187,$AU$4)/$AV$1","v":{"v":0,"d":"0%"}},{"$f":"COUNTIF(D187:$AL187,\"NE\")/$AV$1","v":{"v":0,"d":"0%"}},{"$f":"AN187+(AO187*0.66)+(AP187*0.33)","v":{"v":0,"d":"0%"}}]
[null,"PA10","chanter en portant attention à la justesse tonale, à l’exactitude rythmique, à la puissance de la voix, à la respiration et à l’articulation ",{"$nulls":36},{"$f":"COUNTIF($D188:$AL188,$AU$1)/$AV$1","v":{"v":0,"d":"0%"}},{"$f":"COUNTIF($D188:$AL188,$AU$2)/$AV$1","v":{"v":0,"d":"0%"}},{"$f":"COUNTIF($D188:$AL188,$AU$3)/$AV$1","v":{"v":0,"d":"0%"}},{"$f":"COUNTIF($D188:$AL188,$AU$4)/$AV$1","v":{"v":0,"d":"0%"}},{"$f":"COUNTIF(D188:$AL188,\"NE\")/$AV$1","v":{"v":0,"d":"0%"}},{"$f":"AN188+(AO188*0.66)+(AP188*0.33)","v":{"v":0,"d":"0%"}}]
[null,"PA11","Apprendre à respecter les exigences d’une expression musicale collective.",{"$nulls":36},{"$f":"COUNTIF($D189:$AL189,$AU$1)/$AV$1","v":{"v":0,"d":"0%"}},{"$f":"COUNTIF($D189:$AL189,$AU$2)/$AV$1","v":{"v":0,"d":"0%"}},{"$f":"COUNTIF($D189:$AL189,$AU$3)/$AV$1","v":{"v":0,"d":"0%"}},{"$f":"COUNTIF($D189:$AL189,$AU$4)/$AV$1","v":{"v":0,"d":"0%"}},{"$f":"COUNTIF(D189:$AL189,\"NE\")/$AV$1","v":{"v":0,"d":"0%"}},{"$f":"AN189+(AO189*0.66)+(AP189*0.33)","v":{"v":0,"d":"0%"}}]
[null,"PA12","Repérer des éléments musicaux caractéristiques très simples, concernant les thèmes mélodiques, les rythmes et le tempo, les intensités, les timbres",{"$nulls":36},{"$f":"COUNTIF($D190:$AL190,$AU$1)/$AV$1","v":{"v":0,"d":"0%"}},{"$f":"COUNTIF($D190:$AL190,$AU$2)/$AV$1","v":{"v":0,"d":"0%"}},{"$f":"COUNTIF($D190:$AL190,$AU$3)/$AV$1","v":{"v":0,"d":"0%"}},{"$f":"COUNTIF($D190:$AL190,$AU$4)/$AV$1","v":{"v":0,"d":"0%"}},{"$f":"COUNTIF(D190:$AL190,\"NE\")/$AV$1","v":{"v":0,"d":"0%"}},{"$f":"AN190+(AO190*0.66)+(AP190*0.33)","v":{"v":0,"d":"0%"}}]
[null,"PA13","commencent à reconnaître les grandes familles d’instruments.",{"$nulls":36},{"$f":"COUNTIF($D191:$AL191,$AU$1)/$AV$1","v":{"v":0,"d":"0%"}},{"$f":"COUNTIF($D191:$AL191,$AU$2)/$AV$1","v":{"v":0,"d":"0%"}},{"$f":"COUNTIF($D191:$AL191,$AU$3)/$AV$1","v":{"v":0,"d":"0%"}},{"$f":"COUNTIF($D191:$AL191,$AU$4)/$AV$1","v":{"v":0,"d":"0%"}},{"$f":"COUNTIF(D191:$AL191,\"NE\")/$AV$1","v":{"v":0,"d":"0%"}},{"$f":"AN191+(AO191*0.66)+(AP191*0.33)","v":{"v":0,"d":"0%"}}]
[null,null,"LVE",{"$f":"COUNTA(D191:D191)*10","v":0},{"$f":"COUNTA(E191:E191)*10","v":0},0,0,0,0,0,0,0,0,0,0,0,0,0,0,0,0,0,0,0,0,0,0,0,0,0,0,0,0,0,0,0,{"$nulls":3},{"$f":"COUNTIF($D192:$AL192,$AU$1)/$AV$1","v":{"v":0,"d":"0%"}},{"$f":"COUNTIF($D192:$AL192,$AU$2)/$AV$1","v":{"v":0,"d":"0%"}},{"$f":"COUNTIF($D192:$AL192,$AU$3)/$AV$1","v":{"v":0,"d":"0%"}},{"$f":"COUNTIF($D192:$AL192,$AU$4)/$AV$1","v":{"v":0,"d":"0%"}},{"$f":"COUNTIF(D192:$AL192,\"NE\")/$AV$1","v":{"v":0,"d":"0%"}},{"$f":"AN192+(AO192*0.66)+(AP192*0.33)","v":{"v":0,"d":"0%"}}]
[null,"LVE1"," comprendre et utiliser des énoncés simples de la vie quotidienne.",{"$nulls":36},{"$f":"COUNTIF($D193:$AL193,$AU$1)/$AV$1","v":{"v":0,"d":"0%"}},{"$f":"COUNTIF($D193:$AL193,$AU$2)/$AV$1","v":{"v":0,"d":"0%"}},{"$f":"COUNTIF($D193:$AL193,$AU$3)/$AV$1","v":{"v":0,"d":"0%"}},{"$f":"COUNTIF($D193:$AL193,$AU$4)/$AV$1","v":{"v":0,"d":"0%"}},{"$f":"COUNTIF(D193:$AL193,\"NE\")/$AV$1","v":{"v":0,"d":"0%"}},{"$f":"AN193+(AO193*0.66)+(AP193*0.33)","v":{"v":0,"d":"0%"}}]
[null,null,"EDUCATION PHYSIQUE ET SPORTIVE",{"$f":"D193+D196+D201+D205","v":0},{"$f":"E193+E196+E201+E205","v":0},0,0,0,0,0,0,0,0,0,0,0,0,0,0,0,0,0,0,0,0,0,0,0,0,0,0,0,0,0,0,0,{"$nulls":3},{"$f":"COUNTIF($D194:$AL194,$AU$1)/$AV$1","v":{"v":0,"d":"0%"}},{"$f":"COUNTIF($D194:$AL194,$AU$2)/$AV$1","v":{"v":0,"d":"0%"}},{"$f":"COUNTIF($D194:$AL194,$AU$3)/$AV$1","v":{"v":0,"d":"0%"}},{"$f":"COUNTIF($D194:$AL194,$AU$4)/$AV$1","v":{"v":0,"d":"0%"}},{"$f":"COUNTIF(D194:$AL194,\"NE\")/$AV$1","v":{"v":0,"d":"0%"}},{"$f":"AN194+(AO194*0.66)+(AP194*0.33)","v":{"v":0,"d":"0%"}}]
[null,null,"Réaliser une performance mesurée (en distance, en temps)",{"$f":"COUNTA(D194:D195)*10","v":0},{"$f":"COUNTA(E194:E195)*10","v":0},0,0,0,0,0,0,0,0,0,0,0,0,0,0,0,0,0,0,0,0,0,0,0,0,0,0,0,0,0,0,0,{"$nulls":3},{"$f":"COUNTIF($D195:$AL195,$AU$1)/$AV$1","v":{"v":0,"d":"0%"}},{"$f":"COUNTIF($D195:$AL195,$AU$2)/$AV$1","v":{"v":0,"d":"0%"}},{"$f":"COUNTIF($D195:$AL195,$AU$3)/$AV$1","v":{"v":0,"d":"0%"}},{"$f":"COUNTIF($D195:$AL195,$AU$4)/$AV$1","v":{"v":0,"d":"0%"}},{"$f":"COUNTIF(D195:$AL195,\"NE\")/$AV$1","v":{"v":0,"d":"0%"}},{"$f":"AN195+(AO195*0.66)+(AP195*0.33)","v":{"v":0,"d":"0%"}}]
[null,".EPS1","Activités athlétiques : courir vite, longtemps, en franchissant des obstacles, sauter loin et haut, lancer loin.",{"$nulls":36},{"$f":"COUNTIF($D196:$AL196,$AU$1)/$AV$1","v":{"v":0,"d":"0%"}},{"$f":"COUNTIF($D196:$AL196,$AU$2)/$AV$1","v":{"v":0,"d":"0%"}},{"$f":"COUNTIF($D196:$AL196,$AU$3)/$AV$1","v":{"v":0,"d":"0%"}},{"$f":"COUNTIF($D196:$AL196,$AU$4)/$AV$1","v":{"v":0,"d":"0%"}},{"$f":"COUNTIF(D196:$AL196,\"NE\")/$AV$1","v":{"v":0,"d":"0%"}},{"$f":"AN196+(AO196*0.66)+(AP196*0.33)","v":{"v":0,"d":"0%"}}]
[null,".EPS2","Natation : se déplacer sur une quinzaine de mètres.",{"$nulls":36},{"$f":"COUNTIF($D197:$AL197,$AU$1)/$AV$1","v":{"v":0,"d":"0%"}},{"$f":"COUNTIF($D197:$AL197,$AU$2)/$AV$1","v":{"v":0,"d":"0%"}},{"$f":"COUNTIF($D197:$AL197,$AU$3)/$AV$1","v":{"v":0,"d":"0%"}},{"$f":"COUNTIF($D197:$AL197,$AU$4)/$AV$1","v":{"v":0,"d":"0%"}},{"$f":"COUNTIF(D197:$AL197,\"NE\")/$AV$1","v":{"v":0,"d":"0%"}},{"$f":"AN197+(AO197*0.66)+(AP197*0.33)","v":{"v":0,"d":"0%"}}]
[null,null,"Adapter ses déplacements à différents types d’environnement",{"$f":"COUNTA(D197:D200)*10","v":0},{"$f":"COUNTA(E197:E200)*10","v":0},0,0,0,0,0,0,0,0,0,0,0,0,0,0,0,0,0,0,0,0,0,0,0,0,0,0,0,0,0,0,0,{"$nulls":3},{"$f":"COUNTIF($D198:$AL198,$AU$1)/$AV$1","v":{"v":0,"d":"0%"}},{"$f":"COUNTIF($D198:$AL198,$AU$2)/$AV$1","v":{"v":0,"d":"0%"}},{"$f":"COUNTIF($D198:$AL198,$AU$3)/$AV$1","v":{"v":0,"d":"0%"}},{"$f":"COUNTIF($D198:$AL198,$AU$4)/$AV$1","v":{"v":0,"d":"0%"}},{"$f":"COUNTIF(D198:$AL198,\"NE\")/$AV$1","v":{"v":0,"d":"0%"}},{"$f":"AN198+(AO198*0.66)+(AP198*0.33)","v":{"v":0,"d":"0%"}}]
[null,".EPS3","Activités d’escalade : grimper jusqu’à 3 m et redescendre (mur équipé).",{"$nulls":36},{"$f":"COUNTIF($D199:$AL199,$AU$1)/$AV$1","v":{"v":0,"d":"0%"}},{"$f":"COUNTIF($D199:$AL199,$AU$2)/$AV$1","v":{"v":0,"d":"0%"}},{"$f":"COUNTIF($D199:$AL199,$AU$3)/$AV$1","v":{"v":0,"d":"0%"}},{"$f":"COUNTIF($D199:$AL199,$AU$4)/$AV$1","v":{"v":0,"d":"0%"}},{"$f":"COUNTIF(D199:$AL199,\"NE\")/$AV$1","v":{"v":0,"d":"0%"}},{"$f":"AN199+(AO199*0.66)+(AP199*0.33)","v":{"v":0,"d":"0%"}}]
[null,".EPS4","Activités aquatiques et nautiques : s’immerger, se déplacer sous l’eau, se laisser flotter.",{"$nulls":36},{"$f":"COUNTIF($D200:$AL200,$AU$1)/$AV$1","v":{"v":0,"d":"0%"}},{"$f":"COUNTIF($D200:$AL200,$AU$2)/$AV$1","v":{"v":0,"d":"0%"}},{"$f":"COUNTIF($D200:$AL200,$AU$3)/$AV$1","v":{"v":0,"d":"0%"}},{"$f":"COUNTIF($D200:$AL200,$AU$4)/$AV$1","v":{"v":0,"d":"0%"}},{"$f":"COUNTIF(D200:$AL200,\"NE\")/$AV$1","v":{"v":0,"d":"0%"}},{"$f":"AN200+(AO200*0.66)+(AP200*0.33)","v":{"v":0,"d":"0%"}}]
[null,".EPS5","Activités de roule et glisse : réaliser un parcours simple en roller ou en vélo.",{"$nulls":36},{"$f":"COUNTIF($D201:$AL201,$AU$1)/$AV$1","v":{"v":0,"d":"0%"}},{"$f":"COUNTIF($D201:$AL201,$AU$2)/$AV$1","v":{"v":0,"d":"0%"}},{"$f":"COUNTIF($D201:$AL201,$AU$3)/$AV$1","v":{"v":0,"d":"0%"}},{"$f":"COUNTIF($D201:$AL201,$AU$4)/$AV$1","v":{"v":0,"d":"0%"}},{"$f":"COUNTIF(D201:$AL201,\"NE\")/$AV$1","v":{"v":0,"d":"0%"}},{"$f":"AN201+(AO201*0.66)+(AP201*0.33)","v":{"v":0,"d":"0%"}}]
[null,".EPS6","Activités d’orientation : retrouver quelques balises dans un milieu connu.",{"$nulls":36},{"$f":"COUNTIF($D202:$AL202,$AU$1)/$AV$1","v":{"v":0,"d":"0%"}},{"$f":"COUNTIF($D202:$AL202,$AU$2)/$AV$1","v":{"v":0,"d":"0%"}},{"$f":"COUNTIF($D202:$AL202,$AU$3)/$AV$1","v":{"v":0,"d":"0%"}},{"$f":"COUNTIF($D202:$AL202,$AU$4)/$AV$1","v":{"v":0,"d":"0%"}},{"$f":"COUNTIF(D202:$AL202,\"NE\")/$AV$1","v":{"v":0,"d":"0%"}},{"$f":"AN202+(AO202*0.66)+(AP202*0.33)","v":{"v":0,"d":"0%"}}]
[null,null,"Coopérer ou s’opposer individuellement et collectivement",{"$f":"COUNTA(D202:D204)*10","v":0},{"$f":"COUNTA(E202:E204)*10","v":0},0,0,0,0,0,0,0,0,0,0,0,0,0,0,0,0,0,0,0,0,0,0,0,0,0,0,0,0,0,0,0,{"$nulls":3},{"$f":"COUNTIF($D203:$AL203,$AU$1)/$AV$1","v":{"v":0,"d":"0%"}},{"$f":"COUNTIF($D203:$AL203,$AU$2)/$AV$1","v":{"v":0,"d":"0%"}},{"$f":"COUNTIF($D203:$AL203,$AU$3)/$AV$1","v":{"v":0,"d":"0%"}},{"$f":"COUNTIF($D203:$AL203,$AU$4)/$AV$1","v":{"v":0,"d":"0%"}},{"$f":"COUNTIF(D203:$AL203,\"NE\")/$AV$1","v":{"v":0,"d":"0%"}},{"$f":"AN203+(AO203*0.66)+(AP203*0.33)","v":{"v":0,"d":"0%"}}]
[null,"EPS7","Jeux de lutte : agir sur son adversaire pour l’immobiliser.",{"$nulls":36},{"$f":"COUNTIF($D204:$AL204,$AU$1)/$AV$1","v":{"v":0,"d":"0%"}},{"$f":"COUNTIF($D204:$AL204,$AU$2)/$AV$1","v":{"v":0,"d":"0%"}},{"$f":"COUNTIF($D204:$AL204,$AU$3)/$AV$1","v":{"v":0,"d":"0%"}},{"$f":"COUNTIF($D204:$AL204,$AU$4)/$AV$1","v":{"v":0,"d":"0%"}},{"$f":"COUNTIF(D204:$AL204,\"NE\")/$AV$1","v":{"v":0,"d":"0%"}},{"$f":"AN204+(AO204*0.66)+(AP204*0.33)","v":{"v":0,"d":"0%"}}]
[null,"EPS8","Jeux de raquettes : faire quelques échanges.",{"$nulls":36},{"$f":"COUNTIF($D205:$AL205,$AU$1)/$AV$1","v":{"v":0,"d":"0%"}},{"$f":"COUNTIF($D205:$AL205,$AU$2)/$AV$1","v":{"v":0,"d":"0%"}},{"$f":"COUNTIF($D205:$AL205,$AU$3)/$AV$1","v":{"v":0,"d":"0%"}},{"$f":"COUNTIF($D205:$AL205,$AU$4)/$AV$1","v":{"v":0,"d":"0%"}},{"$f":"COUNTIF(D205:$AL205,\"NE\")/$AV$1","v":{"v":0,"d":"0%"}},{"$f":"AN205+(AO205*0.66)+(AP205*0.33)","v":{"v":0,"d":"0%"}}]
[null,".EPS9","Jeux traditionnels et jeux collectifs avec ou sans ballon : coopérer avec ses partenaires pour affronter collectivement des adversaires, en respectant des règles, en assurant des rôles différents (attaquant, défenseur, arbitre).",{"$nulls":36},{"$f":"COUNTIF($D206:$AL206,$AU$1)/$AV$1","v":{"v":0,"d":"0%"}},{"$f":"COUNTIF($D206:$AL206,$AU$2)/$AV$1","v":{"v":0,"d":"0%"}},{"$f":"COUNTIF($D206:$AL206,$AU$3)/$AV$1","v":{"v":0,"d":"0%"}},{"$f":"COUNTIF($D206:$AL206,$AU$4)/$AV$1","v":{"v":0,"d":"0%"}},{"$f":"COUNTIF(D206:$AL206,\"NE\")/$AV$1","v":{"v":0,"d":"0%"}},{"$f":"AN206+(AO206*0.66)+(AP206*0.33)","v":{"v":0,"d":"0%"}}]
[null,null,"Concevoir et réaliser des actions à visées expressive, artistique, esthétique",{"$f":"COUNTA(D206:D207)*10","v":0},{"$f":"COUNTA(E206:E207)*10","v":0},0,0,0,0,0,0,0,0,0,0,0,0,0,0,0,0,0,0,0,0,0,0,0,0,0,0,0,0,0,0,0,{"$nulls":3},{"$f":"COUNTIF($D207:$AL207,$AU$1)/$AV$1","v":{"v":0,"d":"0%"}},{"$f":"COUNTIF($D207:$AL207,$AU$2)/$AV$1","v":{"v":0,"d":"0%"}},{"$f":"COUNTIF($D207:$AL207,$AU$3)/$AV$1","v":{"v":0,"d":"0%"}},{"$f":"COUNTIF($D207:$AL207,$AU$4)/$AV$1","v":{"v":0,"d":"0%"}},{"$f":"COUNTIF(D207:$AL207,\"NE\")/$AV$1","v":{"v":0,"d":"0%"}},{"$f":"AN207+(AO207*0.66)+(AP207*0.33)","v":{"v":0,"d":"0%"}}]
[null,"EPS10","Danse : exprimer corporellement des personnages, des images, des sentiments pour communiquer des émotions en réalisant une petite chorégraphie (3 à 5 éléments), sur des supports sonores divers.",{"$nulls":36},{"$f":"COUNTIF($D208:$AL208,$AU$1)/$AV$1","v":{"v":0,"d":"0%"}},{"$f":"COUNTIF($D208:$AL208,$AU$2)/$AV$1","v":{"v":0,"d":"0%"}},{"$f":"COUNTIF($D208:$AL208,$AU$3)/$AV$1","v":{"v":0,"d":"0%"}},{"$f":"COUNTIF($D208:$AL208,$AU$4)/$AV$1","v":{"v":0,"d":"0%"}},{"$f":"COUNTIF(D208:$AL208,\"NE\")/$AV$1","v":{"v":0,"d":"0%"}},{"$f":"AN208+(AO208*0.66)+(AP208*0.33)","v":{"v":0,"d":"0%"}}]
[null,"EPS11"," Activités gymniques : réaliser un enchaînement de 2 ou 3 actions “acrobatiques” sur des engins variés (barres, plinths, poutres, gros tapis).",{"$nulls":36},{"$f":"COUNTIF($D209:$AL209,$AU$1)/$AV$1","v":{"v":0,"d":"0%"}},{"$f":"COUNTIF($D209:$AL209,$AU$2)/$AV$1","v":{"v":0,"d":"0%"}},{"$f":"COUNTIF($D209:$AL209,$AU$3)/$AV$1","v":{"v":0,"d":"0%"}},{"$f":"COUNTIF($D209:$AL209,$AU$4)/$AV$1","v":{"v":0,"d":"0%"}},{"$f":"COUNTIF(D209:$AL209,\"NE\")/$AV$1","v":{"v":0,"d":"0%"}},{"$f":"AN209+(AO209*0.66)+(AP209*0.33)","v":{"v":0,"d":"0%"}}]
[null,null,"LES COMPETENCES SOCIALES ET CIVIQUES",{"$f":"COUNTA(D209:D215)*10","v":0},{"$f":"COUNTA(E209:E215)*10","v":0},0,0,0,0,0,0,0,0,0,0,0,0,0,0,0,0,0,0,0,0,0,0,0,0,0,0,0,0,0,0,0,{"$nulls":3},{"$f":"COUNTIF($D210:$AL210,$AU$1)/$AV$1","v":{"v":0,"d":"0%"}},{"$f":"COUNTIF($D210:$AL210,$AU$2)/$AV$1","v":{"v":0,"d":"0%"}},{"$f":"COUNTIF($D210:$AL210,$AU$3)/$AV$1","v":{"v":0,"d":"0%"}},{"$f":"COUNTIF($D210:$AL210,$AU$4)/$AV$1","v":{"v":0,"d":"0%"}},{"$f":"COUNTIF(D210:$AL210,\"NE\")/$AV$1","v":{"v":0,"d":"0%"}},{"$f":"AN210+(AO210*0.66)+(AP210*0.33)","v":{"v":0,"d":"0%"}}]
[null,"B2I","commencer à s’approprier un environnement numérique.",{"$nulls":36},{"$f":"COUNTIF($D211:$AL211,$AU$1)/$AV$1","v":{"v":0,"d":"0%"}},{"$f":"COUNTIF($D211:$AL211,$AU$2)/$AV$1","v":{"v":0,"d":"0%"}},{"$f":"COUNTIF($D211:$AL211,$AU$3)/$AV$1","v":{"v":0,"d":"0%"}},{"$f":"COUNTIF($D211:$AL211,$AU$4)/$AV$1","v":{"v":0,"d":"0%"}},{"$f":"COUNTIF(D211:$AL211,\"NE\")/$AV$1","v":{"v":0,"d":"0%"}},{"$f":"AN211+(AO211*0.66)+(AP211*0.33)","v":{"v":0,"d":"0%"}}]
[null,".SC1","reconnaître les emblèmes et les symboles de la République française ",{"$nulls":36},{"$f":"COUNTIF($D212:$AL212,$AU$1)/$AV$1","v":{"v":0,"d":"0%"}},{"$f":"COUNTIF($D212:$AL212,$AU$2)/$AV$1","v":{"v":0,"d":"0%"}},{"$f":"COUNTIF($D212:$AL212,$AU$3)/$AV$1","v":{"v":0,"d":"0%"}},{"$f":"COUNTIF($D212:$AL212,$AU$4)/$AV$1","v":{"v":0,"d":"0%"}},{"$f":"COUNTIF(D212:$AL212,\"NE\")/$AV$1","v":{"v":0,"d":"0%"}},{"$f":"AN212+(AO212*0.66)+(AP212*0.33)","v":{"v":0,"d":"0%"}}]
[null,".SC2","respecter les autres et les règles de la vie collective ",{"$nulls":36},{"$f":"COUNTIF($D213:$AL213,$AU$1)/$AV$1","v":{"v":0,"d":"0%"}},{"$f":"COUNTIF($D213:$AL213,$AU$2)/$AV$1","v":{"v":0,"d":"0%"}},{"$f":"COUNTIF($D213:$AL213,$AU$3)/$AV$1","v":{"v":0,"d":"0%"}},{"$f":"COUNTIF($D213:$AL213,$AU$4)/$AV$1","v":{"v":0,"d":"0%"}},{"$f":"COUNTIF(D213:$AL213,\"NE\")/$AV$1","v":{"v":0,"d":"0%"}},{"$f":"AN213+(AO213*0.66)+(AP213*0.33)","v":{"v":0,"d":"0%"}}]
[null,"SC3","pratiquer un jeu ou un sport collectif en en respectant les règles ",{"$nulls":36},{"$f":"COUNTIF($D214:$AL214,$AU$1)/$AV$1","v":{"v":0,"d":"0%"}},{"$f":"COUNTIF($D214:$AL214,$AU$2)/$AV$1","v":{"v":0,"d":"0%"}},{"$f":"COUNTIF($D214:$AL214,$AU$3)/$AV$1","v":{"v":0,"d":"0%"}},{"$f":"COUNTIF($D214:$AL214,$AU$4)/$AV$1","v":{"v":0,"d":"0%"}},{"$f":"COUNTIF(D214:$AL214,\"NE\")/$AV$1","v":{"v":0,"d":"0%"}},{"$f":"AN214+(AO214*0.66)+(AP214*0.33)","v":{"v":0,"d":"0%"}}]
[null,".SC4"," appliquer les codes de la politesse dans ses relations avec ses camarades, avec les adultes à l’école et hors de l’école, avec le maître au sein de la classe",{"$nulls":36},{"$f":"COUNTIF($D215:$AL215,$AU$1)/$AV$1","v":{"v":0,"d":"0%"}},{"$f":"COUNTIF($D215:$AL215,$AU$2)/$AV$1","v":{"v":0,"d":"0%"}},{"$f":"COUNTIF($D215:$AL215,$AU$3)/$AV$1","v":{"v":0,"d":"0%"}},{"$f":"COUNTIF($D215:$AL215,$AU$4)/$AV$1","v":{"v":0,"d":"0%"}},{"$f":"COUNTIF(D215:$AL215,\"NE\")/$AV$1","v":{"v":0,"d":"0%"}},{"$f":"AN215+(AO215*0.66)+(AP215*0.33)","v":{"v":0,"d":"0%"}}]
[null,".SC5","participer en classe à un échange verbal en respectant les règles de la communication ",{"$nulls":36},{"$f":"COUNTIF($D216:$AL216,$AU$1)/$AV$1","v":{"v":0,"d":"0%"}},{"$f":"COUNTIF($D216:$AL216,$AU$2)/$AV$1","v":{"v":0,"d":"0%"}},{"$f":"COUNTIF($D216:$AL216,$AU$3)/$AV$1","v":{"v":0,"d":"0%"}},{"$f":"COUNTIF($D216:$AL216,$AU$4)/$AV$1","v":{"v":0,"d":"0%"}},{"$f":"COUNTIF(D216:$AL216,\"NE\")/$AV$1","v":{"v":0,"d":"0%"}},{"$f":"AN216+(AO216*0.66)+(AP216*0.33)","v":{"v":0,"d":"0%"}}]
[null,"SC6","appeler les secours ; aller chercher de l’aide auprès d’un adulte.",{"$nulls":36},{"$f":"COUNTIF($D217:$AL217,$AU$1)/$AV$1","v":{"v":0,"d":"0%"}},{"$f":"COUNTIF($D217:$AL217,$AU$2)/$AV$1","v":{"v":0,"d":"0%"}},{"$f":"COUNTIF($D217:$AL217,$AU$3)/$AV$1","v":{"v":0,"d":"0%"}},{"$f":"COUNTIF($D217:$AL217,$AU$4)/$AV$1","v":{"v":0,"d":"0%"}},{"$f":"COUNTIF(D217:$AL217,\"NE\")/$AV$1","v":{"v":0,"d":"0%"}},{"$f":"AN217+(AO217*0.66)+(AP217*0.33)","v":{"v":0,"d":"0%"}}]
[null,null,"L'AUTONOMIE ET L'INITIATIVE",{"$f":"COUNTA(D217:D222)*10","v":0},{"$f":"COUNTA(E217:E222)*10","v":0},0,0,0,0,0,0,0,0,0,0,0,0,0,0,0,0,0,0,0,0,0,0,0,0,0,0,0,0,0,0,0,{"$nulls":3},{"$f":"COUNTIF($D218:$AL218,$AU$1)/$AV$1","v":{"v":0,"d":"0%"}},{"$f":"COUNTIF($D218:$AL218,$AU$2)/$AV$1","v":{"v":0,"d":"0%"}},{"$f":"COUNTIF($D218:$AL218,$AU$3)/$AV$1","v":{"v":0,"d":"0%"}},{"$f":"COUNTIF($D218:$AL218,$AU$4)/$AV$1","v":{"v":0,"d":"0%"}},{"$f":"COUNTIF(D218:$AL218,\"NE\")/$AV$1","v":{"v":0,"d":"0%"}},{"$f":"AN218+(AO218*0.66)+(AP218*0.33)","v":{"v":0,"d":"0%"}}]
[null,"AI1","écouter pour comprendre, interroger, répéter, réaliser un travail ou une activité ",{"$nulls":36},{"$f":"COUNTIF($D219:$AL219,$AU$1)/$AV$1","v":{"v":0,"d":"0%"}},{"$f":"COUNTIF($D219:$AL219,$AU$2)/$AV$1","v":{"v":0,"d":"0%"}},{"$f":"COUNTIF($D219:$AL219,$AU$3)/$AV$1","v":{"v":0,"d":"0%"}},{"$f":"COUNTIF($D219:$AL219,$AU$4)/$AV$1","v":{"v":0,"d":"0%"}},{"$f":"COUNTIF(D219:$AL219,\"NE\")/$AV$1","v":{"v":0,"d":"0%"}},{"$f":"AN219+(AO219*0.66)+(AP219*0.33)","v":{"v":0,"d":"0%"}}]
[null,"AI2","échanger, questionner, justifier un point de vue ",{"$nulls":36},{"$f":"COUNTIF($D220:$AL220,$AU$1)/$AV$1","v":{"v":0,"d":"0%"}},{"$f":"COUNTIF($D220:$AL220,$AU$2)/$AV$1","v":{"v":0,"d":"0%"}},{"$f":"COUNTIF($D220:$AL220,$AU$3)/$AV$1","v":{"v":0,"d":"0%"}},{"$f":"COUNTIF($D220:$AL220,$AU$4)/$AV$1","v":{"v":0,"d":"0%"}},{"$f":"COUNTIF(D220:$AL220,\"NE\")/$AV$1","v":{"v":0,"d":"0%"}},{"$f":"AN220+(AO220*0.66)+(AP220*0.33)","v":{"v":0,"d":"0%"}}]
[null,"AI3","travailler en groupe, s’engager dans un projet ",{"$nulls":36},{"$f":"COUNTIF($D221:$AL221,$AU$1)/$AV$1","v":{"v":0,"d":"0%"}},{"$f":"COUNTIF($D221:$AL221,$AU$2)/$AV$1","v":{"v":0,"d":"0%"}},{"$f":"COUNTIF($D221:$AL221,$AU$3)/$AV$1","v":{"v":0,"d":"0%"}},{"$f":"COUNTIF($D221:$AL221,$AU$4)/$AV$1","v":{"v":0,"d":"0%"}},{"$f":"COUNTIF(D221:$AL221,\"NE\")/$AV$1","v":{"v":0,"d":"0%"}},{"$f":"AN221+(AO221*0.66)+(AP221*0.33)","v":{"v":0,"d":"0%"}}]
[null,"AI4","maîtriser quelques conduites motrices comme courir, sauter, lancer ",{"$nulls":36},{"$f":"COUNTIF($D222:$AL222,$AU$1)/$AV$1","v":{"v":0,"d":"0%"}},{"$f":"COUNTIF($D222:$AL222,$AU$2)/$AV$1","v":{"v":0,"d":"0%"}},{"$f":"COUNTIF($D222:$AL222,$AU$3)/$AV$1","v":{"v":0,"d":"0%"}},{"$f":"COUNTIF($D222:$AL222,$AU$4)/$AV$1","v":{"v":0,"d":"0%"}},{"$f":"COUNTIF(D222:$AL222,\"NE\")/$AV$1","v":{"v":0,"d":"0%"}},{"$f":"AN222+(AO222*0.66)+(AP222*0.33)","v":{"v":0,"d":"0%"}}]
[null,"AI5","se représenter son environnement proche, s’y repérer, s’y déplacer de façon adaptée ",{"$nulls":36},{"$f":"COUNTIF($D223:$AL223,$AU$1)/$AV$1","v":{"v":0,"d":"0%"}},{"$f":"COUNTIF($D223:$AL223,$AU$2)/$AV$1","v":{"v":0,"d":"0%"}},{"$f":"COUNTIF($D223:$AL223,$AU$3)/$AV$1","v":{"v":0,"d":"0%"}},{"$f":"COUNTIF($D223:$AL223,$AU$4)/$AV$1","v":{"v":0,"d":"0%"}},{"$f":"COUNTIF(D223:$AL223,\"NE\")/$AV$1","v":{"v":0,"d":"0%"}},{"$f":"AN223+(AO223*0.66)+(AP223*0.33)","v":{"v":0,"d":"0%"}}]
[null,"AI6","appliquer des règles élémentaires d’hygiène.",{"$nulls":36},{"$f":"COUNTIF($D224:$AL224,$AU$1)/$AV$1","v":{"v":0,"d":"0%"}},{"$f":"COUNTIF($D224:$AL224,$AU$2)/$AV$1","v":{"v":0,"d":"0%"}},{"$f":"COUNTIF($D224:$AL224,$AU$3)/$AV$1","v":{"v":0,"d":"0%"}},{"$f":"COUNTIF($D224:$AL224,$AU$4)/$AV$1","v":{"v":0,"d":"0%"}},{"$f":"COUNTIF(D224:$AL224,\"NE\")/$AV$1","v":{"v":0,"d":"0%"}},{"$f":"AN224+(AO224*0.66)+(AP224*0.33)","v":{"v":0,"d":"0%"}}]

{"sheet":"Bulletin2","index":5,"n_rows":242,"n_cols":7,"rows_kept":242,"hidden":true,"merged":[[5,2,5,3],[6,2,6,3],[7,2,7,3],[11,2,11,3],[240,2,240,4]]}
[{"$nulls":6},1]
[]
[]
[]
[]
[null,null,{"$f":"CONCATENATE(\"Classe \"&classe)","v":"Classe CM1"},{"$f":"CONCATENATE(\"Ville de \"&ville)","v":"Ville de "}]
[null,null,{"$f":"CONCATENATE(\"Ecole \"&ecole&\" \"  &\"- \" &adresse &\" -   \" &ville)","v":"Ecole Léonard de Vinci -  -   "},{"$f":"CONCATENATE(\"Ville de \"&ville)","v":"Ville de "}]
[null,null,{"$f":"CONCATENATE(\"Enseignant : \"&enseignant)","v":"Enseignant : M. DURANT"},{"$f":"CONCATENATE(\"Ville de \"&ville)","v":"Ville de "}]
[null,null,{"$f":"IF(INDEX(NOMS,Nenfant,1)=\"\",0,INDEX(NOMS,Nenfant,1))","v":"Marc  Aurèle"}]
[null,null,{"$f":"IF(E10=\"\",\"\",\"né(e)  le  \" & TEXT(E10,\"jj/mm/aaa\"))","v":"né(e)  le  12/11/1999"},null,{"$f":"IF(INDEX(date,Nenfant,1)=\"\",0,INDEX(date,Nenfant,1))","v":36476}]
[]
[null,null,{"$f":"CONCATENATE(\"Année scolaire: \"&annee)","v":"Année scolaire: 2013  2014"}]
[null,null,{"$f":"CONCATENATE(\"Circonscription  \"&IEN)","v":"Circonscription  "}]
[{"$nulls":4},{"$f":"IF(F11<>0,G11,(IF(F11<>0,G11,0)))","v":0},{"$f":"IF(INDEX(periode3,NEVAL,Nenfant)=\"\",0,INDEX(periode3,NEVAL,Nenfant))","v":{"$error":"#NAME?"}},{"$f":"IF(INDEX(periode4,NEVAL,Nenfant)=\"\",0,INDEX(periode4,NEVAL,Nenfant))","v":{"$error":"#NAME?"}}]
[5,null,"LANGAGE ORAL",null,{"$f":"IF(G15<>0,G15,(IF(F15<>0,F15,0)))","v":{"$error":"#NAME?"}},{"$f":"IF(INDEX(periode3,NEVAL,Nenfant)=\"\",0,INDEX(periode3,NEVAL,Nenfant))","v":{"$error":"#NAME?"}},{"$f":"IF(INDEX(periode4,NEVAL,Nenfant)=\"\",0,INDEX(periode4,NEVAL,Nenfant))","v":{"$error":"#NAME?"}}]
[6,null,"S’exprimer de façon correcte : prononcer les sons et les mots avec exactitude, respecter l’organisation de la phrase, formuler correctement des questions."]
[7,null,"Rapporter clairement un événement ou une information très simple : exprimer les relations de causalité, les circonstances temporelles et spatiales, utiliser de manière adéquate les temps verbaux (présent, futur, imparfait, passé composé).",null,{"$error":"#NAME?"},{"$f":"IF(INDEX(periode3,NEVAL,Nenfant)=\"\",0,INDEX(periode3,NEVAL,Nenfant))","v":{"$error":"#NAME?"}},{"$f":"IF(INDEX(periode4,NEVAL,Nenfant)=\"\",0,INDEX(periode4,NEVAL,Nenfant))","v":{"$error":"#NAME?"}}]
[8,null,"Manifester sa compréhension d’un récit ou d’un texte documentaire lu par un tiers en répondant à des questions le concernant : reformuler le contenu d’un paragraphe ou d’un texte, identifier les personnages principaux d’un récit. ",null,{"$error":"#NAME?"},{"$f":"IF(INDEX(periode3,NEVAL,Nenfant)=\"\",0,INDEX(periode3,NEVAL,Nenfant))","v":{"$error":"#NAME?"}},{"$f":"IF(INDEX(periode4,NEVAL,Nenfant)=\"\",0,INDEX(periode4,NEVAL,Nenfant))","v":{"$error":"#NAME?"}}]
[9,null,"Raconter une histoire déjà entendue en s’appuyant sur des illustrations.",null,{"$error":"#NAME?"},{"$f":"IF(INDEX(periode3,NEVAL,Nenfant)=\"\",0,INDEX(periode3,NEVAL,Nenfant))","v":{"$error":"#NAME?"}},{"$f":"IF(INDEX(periode4,NEVAL,Nenfant)=\"\",0,INDEX(periode4,NEVAL,Nenfant))","v":{"$error":"#NAME?"}}]
[10,null,"Décrire des images (illustrations, photographies…). ",null,{"$error":"#NAME?"},{"$f":"IF(INDEX(periode3,NEVAL,Nenfant)=\"\",0,INDEX(periode3,NEVAL,Nenfant))","v":{"$error":"#NAME?"}},{"$f":"IF(INDEX(periode4,NEVAL,Nenfant)=\"\",0,INDEX(periode4,NEVAL,Nenfant))","v":{"$error":"#NAME?"}}]
[11,null,"Raconter une histoire déjà entendue en s’appuyant sur des illustrations.",null,{"$error":"#NAME?"},{"$f":"IF(INDEX(periode3,NEVAL,Nenfant)=\"\",0,INDEX(periode3,NEVAL,Nenfant))","v":{"$error":"#NAME?"}},{"$f":"IF(INDEX(periode4,NEVAL,Nenfant)=\"\",0,INDEX(periode4,NEVAL,Nenfant))","v":{"$error":"#NAME?"}}]
[12,null,"Reformuler une consigne.",null,{"$error":"#NAME?"},{"$f":"IF(INDEX(periode3,NEVAL,Nenfant)=\"\",0,INDEX(periode3,NEVAL,Nenfant))","v":{"$error":"#NAME?"}},{"$f":"IF(INDEX(periode4,NEVAL,Nenfant)=\"\",0,INDEX(periode4,NEVAL,Nenfant))","v":{"$error":"#NAME?"}}]
[13,null,"Prendre part à des échanges verbaux tout en sachant écouter les autres ; poser des questions."]
[14,null,"Réciter des comptines ou de courts poèmes (une dizaine) en ménageant des respirations, et sans commettre d’erreur (sans oubli ou substitution).  "]
[15,null,"Faire un récit structuré (relations causales, circonstances temporelles et spatiales précises) et compréhensible pour un tiers ignorant des faits rapportés ou de l’histoire racontée."]
[16,null,"S’exprimer avec précision pour se faire comprendre dans les activités scolaires."]
[17,null,"Présenter à la classe un travail individuel ou collectif."]
[18,null,"Participer à un échange : questionner, apporter des réponses, écouter et donner un point de vue en respectant les règles de la communication."]
[19,null,"Réciter des textes en prose ou des poèmes (une dizaine), en les interprétant par l’intonation",null,{"$error":"#NAME?"},{"$f":"IF(INDEX(periode3,NEVAL,Nenfant)=\"\",0,INDEX(periode3,NEVAL,Nenfant))","v":{"$error":"#NAME?"}},{"$f":"IF(INDEX(periode4,NEVAL,Nenfant)=\"\",0,INDEX(periode4,NEVAL,Nenfant))","v":{"$error":"#NAME?"}}]
[20,null,"LECTURE",null,{"$error":"#NAME?"},{"$f":"IF(INDEX(periode3,NEVAL,Nenfant)=\"\",0,INDEX(periode3,NEVAL,Nenfant))","v":{"$error":"#NAME?"}},{"$f":"IF(INDEX(periode4,NEVAL,Nenfant)=\"\",0,INDEX(periode4,NEVAL,Nenfant))","v":{"$error":"#NAME?"}}]
[21,null,"Connaître le nom des lettres et l’ordre alphabétique.",null,{"$error":"#NAME?"},{"$f":"IF(INDEX(periode3,NEVAL,Nenfant)=\"\",0,INDEX(periode3,NEVAL,Nenfant))","v":{"$error":"#NAME?"}},{"$f":"IF(INDEX(periode4,NEVAL,Nenfant)=\"\",0,INDEX(periode4,NEVAL,Nenfant))","v":{"$error":"#NAME?"}}]
[22,null,"Distinguer entre la lettre et le son qu’elle transcrit ; connaître les correspondances entre les lettres et les sons dans les graphies simples (ex. f ; o) et complexes (ex. ph ; au, eau).",null,{"$error":"#NAME?"},{"$f":"IF(INDEX(periode3,NEVAL,Nenfant)=\"\",0,INDEX(periode3,NEVAL,Nenfant))","v":{"$error":"#NAME?"}},{"$f":"IF(INDEX(periode4,NEVAL,Nenfant)=\"\",0,INDEX(periode4,NEVAL,Nenfant))","v":{"$error":"#NAME?"}}]
[23,null,"Savoir qu'une syllabe est composée d'une ou plusieurs graphies, qu'un mot est composé d'une ou plusieurs syllabes ; être capable de repérer ces éléments (graphies, syllabes) dans un mot.",null,{"$error":"#NAME?"},{"$f":"IF(INDEX(periode3,NEVAL,Nenfant)=\"\",0,INDEX(periode3,NEVAL,Nenfant))","v":{"$error":"#NAME?"}},{"$f":"IF(INDEX(periode4,NEVAL,Nenfant)=\"\",0,INDEX(periode4,NEVAL,Nenfant))","v":{"$error":"#NAME?"}}]
[24,null,"Connaître les correspondances entre minuscules et majuscules d’imprimerie, minuscules et majuscules cursives.",null,{"$error":"#NAME?"},{"$f":"IF(INDEX(periode3,NEVAL,Nenfant)=\"\",0,INDEX(periode3,NEVAL,Nenfant))","v":{"$error":"#NAME?"}},{"$f":"IF(INDEX(periode4,NEVAL,Nenfant)=\"\",0,INDEX(periode4,NEVAL,Nenfant))","v":{"$error":"#NAME?"}}]
[25,null,"Lire aisément les mots étudiés. ",null,{"$error":"#NAME?"},{"$f":"IF(INDEX(periode3,NEVAL,Nenfant)=\"\",0,INDEX(periode3,NEVAL,Nenfant))","v":{"$error":"#NAME?"}},{"$f":"IF(INDEX(periode4,NEVAL,Nenfant)=\"\",0,INDEX(periode4,NEVAL,Nenfant))","v":{"$error":"#NAME?"}}]
[26,null,"Déchiffrer des mots réguliers inconnus."]
[27,null,"Lire aisément les mots les plus fréquemment rencontrés (dits mots-outils).",null,{"$error":"#NAME?"},{"$f":"IF(INDEX(periode3,NEVAL,Nenfant)=\"\",0,INDEX(periode3,NEVAL,Nenfant))","v":{"$error":"#NAME?"}},{"$f":"IF(INDEX(periode4,NEVAL,Nenfant)=\"\",0,INDEX(periode4,NEVAL,Nenfant))","v":{"$error":"#NAME?"}}]
[28,null,"Lire à haute voix un texte court dont les mots ont été étudiés, en articulant correctement et en respectant la ponctuation.",null,{"$error":"#NAME?"},{"$f":"IF(INDEX(periode3,NEVAL,Nenfant)=\"\",0,INDEX(periode3,NEVAL,Nenfant))","v":{"$error":"#NAME?"}},{"$f":"IF(INDEX(periode4,NEVAL,Nenfant)=\"\",0,INDEX(periode4,NEVAL,Nenfant))","v":{"$error":"#NAME?"}}]
[29,null,"Connaître et utiliser le vocabulaire spécifique de la lecture d’un texte : le livre, la couverture, la page, la ligne ; l’auteur, le titre ; le texte, la phrase, le mot ; le début, la fin, le personnage, l’histoire.",null,{"$error":"#NAME?"},{"$f":"IF(INDEX(periode3,NEVAL,Nenfant)=\"\",0,INDEX(periode3,NEVAL,Nenfant))","v":{"$error":"#NAME?"}},{"$f":"IF(INDEX(periode4,NEVAL,Nenfant)=\"\",0,INDEX(periode4,NEVAL,Nenfant))","v":{"$error":"#NAME?"}}]
[30,null,"Dire de qui ou de quoi parle le texte lu ; trouver dans le texte ou son illustration la réponse à des questions concernant le texte lu ; reformuler son sens.",null,{"$error":"#NAME?"},{"$f":"IF(INDEX(periode3,NEVAL,Nenfant)=\"\",0,INDEX(periode3,NEVAL,Nenfant))","v":{"$error":"#NAME?"}},{"$f":"IF(INDEX(periode4,NEVAL,Nenfant)=\"\",0,INDEX(periode4,NEVAL,Nenfant))","v":{"$error":"#NAME?"}}]
[31,null,"Ecouter lire des œuvres intégrales, notamment de littérature de jeunesse.",null,{"$error":"#NAME?"},{"$f":"IF(INDEX(periode3,NEVAL,Nenfant)=\"\",0,INDEX(periode3,NEVAL,Nenfant))","v":{"$error":"#NAME?"}},{"$f":"IF(INDEX(periode4,NEVAL,Nenfant)=\"\",0,INDEX(periode4,NEVAL,Nenfant))","v":{"$error":"#NAME?"}}]
[32,null,"Lire silencieusement un texte en déchiffrant les mots inconnus et manifester sa compréhension dans un résumé, une reformulation, des réponses à des questions.",null,{"$error":"#NAME?"},{"$f":"IF(INDEX(periode3,NEVAL,Nenfant)=\"\",0,INDEX(periode3,NEVAL,Nenfant))","v":{"$error":"#NAME?"}},{"$f":"IF(INDEX(periode4,NEVAL,Nenfant)=\"\",0,INDEX(periode4,NEVAL,Nenfant))","v":{"$error":"#NAME?"}}]
[33,null,"Lire silencieusement un énoncé, une consigne, et comprendre ce qui est attendu.",null,{"$error":"#NAME?"},{"$f":"IF(INDEX(periode3,NEVAL,Nenfant)=\"\",0,INDEX(periode3,NEVAL,Nenfant))","v":{"$error":"#NAME?"}},{"$f":"IF(INDEX(periode4,NEVAL,Nenfant)=\"\",0,INDEX(periode4,NEVAL,Nenfant))","v":{"$error":"#NAME?"}}]
[34,null,"Participer à une lecture dialoguée : articulation correcte, fluidité, respect de la ponctuation, intonation appropriée.",null,{"$error":"#NAME?"},{"$f":"IF(INDEX(periode3,NEVAL,Nenfant)=\"\",0,INDEX(periode3,NEVAL,Nenfant))","v":{"$error":"#NAME?"}},{"$f":"IF(INDEX(periode4,NEVAL,Nenfant)=\"\",0,INDEX(periode4,NEVAL,Nenfant))","v":{"$error":"#NAME?"}}]
[35,null,"Ecouter et lire des œuvres intégrales courtes ou de larges extraits d’œuvres plus longues.",null,{"$error":"#NAME?"},{"$f":"IF(INDEX(periode3,NEVAL,Nenfant)=\"\",0,INDEX(periode3,NEVAL,Nenfant))","v":{"$error":"#NAME?"}},{"$f":"IF(INDEX(periode4,NEVAL,Nenfant)=\"\",0,INDEX(periode4,NEVAL,Nenfant))","v":{"$error":"#NAME?"}}]
[36,null,"Identifier les personnages, les événements et les circonstances temporelles et spatiales d’un récit qu’on a lu.",null,{"$error":"#NAME?"},{"$f":"IF(INDEX(periode3,NEVAL,Nenfant)=\"\",0,INDEX(periode3,NEVAL,Nenfant))","v":{"$error":"#NAME?"}},{"$f":"IF(INDEX(periode4,NEVAL,Nenfant)=\"\",0,INDEX(periode4,NEVAL,Nenfant))","v":{"$error":"#NAME?"}}]
[37,null,"Comparer un texte nouvellement entendu ou lu avec un ou des textes connus (thèmes, personnages, événements, fin).",null,{"$error":"#NAME?"},{"$f":"IF(INDEX(periode3,NEVAL,Nenfant)=\"\",0,INDEX(periode3,NEVAL,Nenfant))","v":{"$error":"#NAME?"}},{"$f":"IF(INDEX(periode4,NEVAL,Nenfant)=\"\",0,INDEX(periode4,NEVAL,Nenfant))","v":{"$error":"#NAME?"}}]
[38,null,"Lire ou écouter lire des œuvres intégrales, notamment de littérature de jeunesse et rendre compte de sa lecture.",null,{"$error":"#NAME?"},{"$f":"IF(INDEX(periode3,NEVAL,Nenfant)=\"\",0,INDEX(periode3,NEVAL,Nenfant))","v":{"$error":"#NAME?"}},{"$f":"IF(INDEX(periode4,NEVAL,Nenfant)=\"\",0,INDEX(periode4,NEVAL,Nenfant))","v":{"$error":"#NAME?"}}]
[39,null,"ECRITURE",null,{"$error":"#NAME?"},{"$f":"IF(INDEX(periode3,NEVAL,Nenfant)=\"\",0,INDEX(periode3,NEVAL,Nenfant))","v":{"$error":"#NAME?"}},{"$f":"IF(INDEX(periode4,NEVAL,Nenfant)=\"\",0,INDEX(periode4,NEVAL,Nenfant))","v":{"$error":"#NAME?"}}]
[40,null,"Copier un texte très court dans une écriture cursive lisible, sur des lignes, non lettre à lettre mais mot par mot (en prenant appui sur les syllabes qui le composent), en respectant les liaisons entre les lettres, les accents, les espaces entre les mots, les signes de ponctuation, les majuscules.",null,{"$error":"#NAME?"},{"$f":"IF(INDEX(periode3,NEVAL,Nenfant)=\"\",0,INDEX(periode3,NEVAL,Nenfant))","v":{"$error":"#NAME?"}},{"$f":"IF(INDEX(periode4,NEVAL,Nenfant)=\"\",0,INDEX(periode4,NEVAL,Nenfant))","v":{"$error":"#NAME?"}}]
[41,null,"Écrire sans erreur, sous la dictée, des syllabes, des mots et de courtes phrases dont les graphies ont été étudiées.",null,{"$error":"#NAME?"},{"$f":"IF(INDEX(periode3,NEVAL,Nenfant)=\"\",0,INDEX(periode3,NEVAL,Nenfant))","v":{"$error":"#NAME?"}},{"$f":"IF(INDEX(periode4,NEVAL,Nenfant)=\"\",0,INDEX(periode4,NEVAL,Nenfant))","v":{"$error":"#NAME?"}}]
[42,null,"Choisir et écrire de manière autonome des mots simples en respectant les correspondances entre lettres et sons.",null,{"$error":"#NAME?"},{"$f":"IF(INDEX(periode3,NEVAL,Nenfant)=\"\",0,INDEX(periode3,NEVAL,Nenfant))","v":{"$error":"#NAME?"}},{"$f":"IF(INDEX(periode4,NEVAL,Nenfant)=\"\",0,INDEX(periode4,NEVAL,Nenfant))","v":{"$error":"#NAME?"}}]
[43,null,"Concevoir et écrire collectivement avec l’aide du maître une phrase simple cohérente, puis plusieurs. ",null,{"$error":"#NAME?"},{"$f":"IF(INDEX(periode3,NEVAL,Nenfant)=\"\",0,INDEX(periode3,NEVAL,Nenfant))","v":{"$error":"#NAME?"}},{"$f":"IF(INDEX(periode4,NEVAL,Nenfant)=\"\",0,INDEX(periode4,NEVAL,Nenfant))","v":{"$error":"#NAME?"}}]
[44,null,"Comparer sa production écrite à un modèle et rectifier ses erreurs.",null,{"$error":"#NAME?"},{"$f":"IF(INDEX(periode3,NEVAL,Nenfant)=\"\",0,INDEX(periode3,NEVAL,Nenfant))","v":{"$error":"#NAME?"}},{"$f":"IF(INDEX(periode4,NEVAL,Nenfant)=\"\",0,INDEX(periode4,NEVAL,Nenfant))","v":{"$error":"#NAME?"}}]
[45,null,"Produire un travail écrit soigné ; maîtriser son attitude et son geste pour écrire avec aisance ; prendre soin des outils du travail scolaire. ",null,{"$error":"#NAME?"},{"$f":"IF(INDEX(periode3,NEVAL,Nenfant)=\"\",0,INDEX(periode3,NEVAL,Nenfant))","v":{"$error":"#NAME?"}},{"$f":"IF(INDEX(periode4,NEVAL,Nenfant)=\"\",0,INDEX(periode4,NEVAL,Nenfant))","v":{"$error":"#NAME?"}}]
[46,null," Copier un court texte (par mots entiers ou groupes de mots) en respectant l’orthographe, la ponctuation, les majuscules et en soignant la présentation.",null,{"$error":"#NAME?"},{"$f":"IF(INDEX(periode3,NEVAL,Nenfant)=\"\",0,INDEX(periode3,NEVAL,Nenfant))","v":{"$error":"#NAME?"}},{"$f":"IF(INDEX(periode4,NEVAL,Nenfant)=\"\",0,INDEX(periode4,NEVAL,Nenfant))","v":{"$error":"#NAME?"}}]
[47,null,"En particulier, copier avec soin, en respectant la mise en page, un texte en prose ou poème appris en récitation ; réaliser un dessin pour l’illustrer.",null,{"$error":"#NAME?"},{"$f":"IF(INDEX(periode3,NEVAL,Nenfant)=\"\",0,INDEX(periode3,NEVAL,Nenfant))","v":{"$error":"#NAME?"}},{"$f":"IF(INDEX(periode4,NEVAL,Nenfant)=\"\",0,INDEX(periode4,NEVAL,Nenfant))","v":{"$error":"#NAME?"}}]
[48,null,"Écrire sans erreur, sous la dictée, des phrases ou un court texte (5 lignes), préparés ou non, en utilisant ses connaissances orthographiques et grammaticales, ",null,{"$error":"#NAME?"},{"$f":"IF(INDEX(periode3,NEVAL,Nenfant)=\"\",0,INDEX(periode3,NEVAL,Nenfant))","v":{"$error":"#NAME?"}},{"$f":"IF(INDEX(periode4,NEVAL,Nenfant)=\"\",0,INDEX(periode4,NEVAL,Nenfant))","v":{"$error":"#NAME?"}}]
[49,null,"Concevoir et écrire de manière autonome une phrase simple cohérente, puis plusieurs, puis un texte narratif ou explicatif de 5 à 10 lignes.",null,{"$error":"#NAME?"},{"$f":"IF(INDEX(periode3,NEVAL,Nenfant)=\"\",0,INDEX(periode3,NEVAL,Nenfant))","v":{"$error":"#NAME?"}},{"$f":"IF(INDEX(periode4,NEVAL,Nenfant)=\"\",0,INDEX(periode4,NEVAL,Nenfant))","v":{"$error":"#NAME?"}}]
[50,null,"Rédiger différents types de textes d’au moins deux paragraphes en veillant à leur cohérence  , en évitant les répétitions, et en respectant les contraintes syntaxiques et orthographiques ainsi que la ponctuation.",null,{"$error":"#NAME?"},{"$f":"IF(INDEX(periode3,NEVAL,Nenfant)=\"\",0,INDEX(periode3,NEVAL,Nenfant))","v":{"$error":"#NAME?"}},{"$f":"IF(INDEX(periode4,NEVAL,Nenfant)=\"\",0,INDEX(periode4,NEVAL,Nenfant))","v":{"$error":"#NAME?"}}]
[51,null,"Ecrire un texte de type poétique en obéissant à une ou plusieurs consignes précises.",null,{"$error":"#NAME?"},{"$f":"IF(INDEX(periode3,NEVAL,Nenfant)=\"\",0,INDEX(periode3,NEVAL,Nenfant))","v":{"$error":"#NAME?"}},{"$f":"IF(INDEX(periode4,NEVAL,Nenfant)=\"\",0,INDEX(periode4,NEVAL,Nenfant))","v":{"$error":"#NAME?"}}]
[52,null,"VOCABULAIRE",null,{"$f":"IF(G62<>0,G62,(IF(F62<>0,F62,0)))","v":{"$error":"#NAME?"}},{"$f":"IF(INDEX(periode3,NEVAL,Nenfant)=\"\",0,INDEX(periode3,NEVAL,Nenfant))","v":{"$error":"#NAME?"}},{"$f":"IF(INDEX(periode4,NEVAL,Nenfant)=\"\",0,INDEX(periode4,NEVAL,Nenfant))","v":{"$error":"#NAME?"}}]
[53,null,"Utiliser des mots précis pour s’exprimer",null,{"$error":"#NAME?"},{"$f":"IF(INDEX(periode3,NEVAL,Nenfant)=\"\",0,INDEX(periode3,NEVAL,Nenfant))","v":{"$error":"#NAME?"}},{"$f":"IF(INDEX(periode4,NEVAL,Nenfant)=\"\",0,INDEX(periode4,NEVAL,Nenfant))","v":{"$error":"#NAME?"}}]
[54,null,"Commencer à classer les noms par catégories sémantiques larges (noms de personnes, noms d’animaux, noms de choses) ou plus étroites et se référant au monde concret (ex. : noms de fruits).",null,{"$error":"#NAME?"},{"$f":"IF(INDEX(periode3,NEVAL,Nenfant)=\"\",0,INDEX(periode3,NEVAL,Nenfant))","v":{"$error":"#NAME?"}},{"$f":"IF(INDEX(periode4,NEVAL,Nenfant)=\"\",0,INDEX(periode4,NEVAL,Nenfant))","v":{"$error":"#NAME?"}}]
[55,null,"Trouver un ou des noms appartenant à une catégorie donnée (ex. un nom d’arbre, un nom de commerçant). ",null,{"$error":"#NAME?"},{"$f":"IF(INDEX(periode3,NEVAL,Nenfant)=\"\",0,INDEX(periode3,NEVAL,Nenfant))","v":{"$error":"#NAME?"}},{"$f":"IF(INDEX(periode4,NEVAL,Nenfant)=\"\",0,INDEX(periode4,NEVAL,Nenfant))","v":{"$error":"#NAME?"}}]
[56,null,"Trouver un mot de sens opposé pour un adjectif qualificatif ou un verbe d’action. ",null,{"$error":"#NAME?"},{"$f":"IF(INDEX(periode3,NEVAL,Nenfant)=\"\",0,INDEX(periode3,NEVAL,Nenfant))","v":{"$error":"#NAME?"}},{"$f":"IF(INDEX(periode4,NEVAL,Nenfant)=\"\",0,INDEX(periode4,NEVAL,Nenfant))","v":{"$error":"#NAME?"}}]
[57,null,"Ranger des mots par ordre alphabétique.",null,{"$error":"#NAME?"},{"$f":"IF(INDEX(periode3,NEVAL,Nenfant)=\"\",0,INDEX(periode3,NEVAL,Nenfant))","v":{"$error":"#NAME?"}},{"$f":"IF(INDEX(periode4,NEVAL,Nenfant)=\"\",0,INDEX(periode4,NEVAL,Nenfant))","v":{"$error":"#NAME?"}}]
[58,null,"Donner des synonymes (par exemple pour reformuler le sens d’un texte ou pour améliorer une expression orale ou écrite).",null,{"$error":"#NAME?"},{"$f":"IF(INDEX(periode3,NEVAL,Nenfant)=\"\",0,INDEX(periode3,NEVAL,Nenfant))","v":{"$error":"#NAME?"}},{"$f":"IF(INDEX(periode4,NEVAL,Nenfant)=\"\",0,INDEX(periode4,NEVAL,Nenfant))","v":{"$error":"#NAME?"}}]
[59,null,"Trouver un mot de sens opposé pour un adjectif qualificatif, un verbe d’action ou pour un nom  ",null,{"$error":"#NAME?"},{"$f":"IF(INDEX(periode3,NEVAL,Nenfant)=\"\",0,INDEX(periode3,NEVAL,Nenfant))","v":{"$error":"#NAME?"}},{"$f":"IF(INDEX(periode4,NEVAL,Nenfant)=\"\",0,INDEX(periode4,NEVAL,Nenfant))","v":{"$error":"#NAME?"}}]
[60,null,"Regrouper des mots par familles ; trouver un ou des mots d’une famille donnée.",null,{"$error":"#NAME?"},{"$f":"IF(INDEX(periode3,NEVAL,Nenfant)=\"\",0,INDEX(periode3,NEVAL,Nenfant))","v":{"$error":"#NAME?"}},{"$f":"IF(INDEX(periode4,NEVAL,Nenfant)=\"\",0,INDEX(periode4,NEVAL,Nenfant))","v":{"$error":"#NAME?"}}]
[61,null,"Commencer à utiliser l’ordre alphabétique pour vérifier dans un dictionnaire l’écriture d’un mot ou en chercher le sens.",null,{"$error":"#NAME?"},{"$f":"IF(INDEX(periode3,NEVAL,Nenfant)=\"\",0,INDEX(periode3,NEVAL,Nenfant))","v":{"$error":"#NAME?"}},{"$f":"IF(INDEX(periode4,NEVAL,Nenfant)=\"\",0,INDEX(periode4,NEVAL,Nenfant))","v":{"$error":"#NAME?"}}]
[62,null," GRAMMAIRE",null,{"$error":"#NAME?"},{"$f":"IF(INDEX(periode3,NEVAL,Nenfant)=\"\",0,INDEX(periode3,NEVAL,Nenfant))","v":{"$error":"#NAME?"}},{"$f":"IF(INDEX(periode4,NEVAL,Nenfant)=\"\",0,INDEX(periode4,NEVAL,Nenfant))","v":{"$error":"#NAME?"}}]
[63,null,"La phrase",null,{"$error":"#NAME?"},{"$f":"IF(INDEX(periode3,NEVAL,Nenfant)=\"\",0,INDEX(periode3,NEVAL,Nenfant))","v":{"$error":"#NAME?"}},{"$f":"IF(INDEX(periode4,NEVAL,Nenfant)=\"\",0,INDEX(periode4,NEVAL,Nenfant))","v":{"$error":"#NAME?"}}]
[64,null,"identifier les phrases d’un texte en s’appuyant sur la ponctuation (point et majuscule). ",null,{"$error":"#NAME?"},{"$f":"IF(INDEX(periode3,NEVAL,Nenfant)=\"\",0,INDEX(periode3,NEVAL,Nenfant))","v":{"$error":"#NAME?"}},{"$f":"IF(INDEX(periode4,NEVAL,Nenfant)=\"\",0,INDEX(periode4,NEVAL,Nenfant))","v":{"$error":"#NAME?"}}]
[65,null,"approche des formes et types de phrase : savoir transposer oralement une phrase affirmative en phrase négative ou interrogative.",null,{"$error":"#NAME?"},{"$f":"IF(INDEX(periode3,NEVAL,Nenfant)=\"\",0,INDEX(periode3,NEVAL,Nenfant))","v":{"$error":"#NAME?"}},{"$f":"IF(INDEX(periode4,NEVAL,Nenfant)=\"\",0,INDEX(periode4,NEVAL,Nenfant))","v":{"$error":"#NAME?"}}]
[66,null,"Les classes de mots",null,{"$error":"#NAME?"},{"$f":"IF(INDEX(periode3,NEVAL,Nenfant)=\"\",0,INDEX(periode3,NEVAL,Nenfant))","v":{"$error":"#NAME?"}},{"$f":"IF(INDEX(periode4,NEVAL,Nenfant)=\"\",0,INDEX(periode4,NEVAL,Nenfant))","v":{"$error":"#NAME?"}}]
[67,null,"reconnaître les noms et les verbes et les distinguer des autres mots ",null,{"$error":"#NAME?"},{"$f":"IF(INDEX(periode3,NEVAL,Nenfant)=\"\",0,INDEX(periode3,NEVAL,Nenfant))","v":{"$error":"#NAME?"}},{"$f":"IF(INDEX(periode4,NEVAL,Nenfant)=\"\",0,INDEX(periode4,NEVAL,Nenfant))","v":{"$error":"#NAME?"}}]
[68,null,"distinguer le nom et l’article qui le précède ; identifier l’article ",null,{"$error":"#NAME?"},{"$f":"IF(INDEX(periode3,NEVAL,Nenfant)=\"\",0,INDEX(periode3,NEVAL,Nenfant))","v":{"$error":"#NAME?"}},{"$f":"IF(INDEX(periode4,NEVAL,Nenfant)=\"\",0,INDEX(periode4,NEVAL,Nenfant))","v":{"$error":"#NAME?"}}]
[69,null,"approche du pronom : savoir utiliser oralement les pronoms personnels sujets.",null,{"$error":"#NAME?"},{"$f":"IF(INDEX(periode3,NEVAL,Nenfant)=\"\",0,INDEX(periode3,NEVAL,Nenfant))","v":{"$error":"#NAME?"}},{"$f":"IF(INDEX(periode4,NEVAL,Nenfant)=\"\",0,INDEX(periode4,NEVAL,Nenfant))","v":{"$error":"#NAME?"}}]
[70,null,"- distinguer selon leur nature : les verbes, les noms, les articles, les pronoms personnels (formes sujet), les adjectifs qualificatifs ;",null,{"$error":"#NAME?"},{"$f":"IF(INDEX(periode3,NEVAL,Nenfant)=\"\",0,INDEX(periode3,NEVAL,Nenfant))","v":{"$error":"#NAME?"}},{"$f":"IF(INDEX(periode4,NEVAL,Nenfant)=\"\",0,INDEX(periode4,NEVAL,Nenfant))","v":{"$error":"#NAME?"}}]
[71,null,"- le nom : distinguer nom propre et nom commun ;",null,{"$error":"#NAME?"},{"$f":"IF(INDEX(periode3,NEVAL,Nenfant)=\"\",0,INDEX(periode3,NEVAL,Nenfant))","v":{"$error":"#NAME?"}},{"$f":"IF(INDEX(periode4,NEVAL,Nenfant)=\"\",0,INDEX(periode4,NEVAL,Nenfant))","v":{"$error":"#NAME?"}}]
[72,null,"- l’article : commencer à repérer les articles élidés (l’) et contractés (du, au, aux) ;"]
[73,null,"- manipuler d’autres déterminants ;"]
[74,null,"- approche de l’adverbe : modifier le sens d’un verbe en ajoutant un adverbe.",null,{"$error":"#NAME?"},{"$f":"IF(INDEX(periode3,NEVAL,Nenfant)=\"\",0,INDEX(periode3,NEVAL,Nenfant))","v":{"$error":"#NAME?"}},{"$f":"IF(INDEX(periode4,NEVAL,Nenfant)=\"\",0,INDEX(periode4,NEVAL,Nenfant))","v":{"$error":"#NAME?"}}]
[75,null,"Les fonctions",null,{"$error":"#NAME?"},{"$f":"IF(INDEX(periode3,NEVAL,Nenfant)=\"\",0,INDEX(periode3,NEVAL,Nenfant))","v":{"$error":"#NAME?"}},{"$f":"IF(INDEX(periode4,NEVAL,Nenfant)=\"\",0,INDEX(periode4,NEVAL,Nenfant))","v":{"$error":"#NAME?"}}]
[76,null,"dans la phrase simple où l’ordre syntaxique régulier sujet-verbe est respecté, identifier le verbe et son sujet (sous la forme d’un nom propre, d’un pronom, ou d’un groupe nominal) ;",null,{"$error":"#NAME?"},{"$f":"IF(INDEX(periode3,NEVAL,Nenfant)=\"\",0,INDEX(periode3,NEVAL,Nenfant))","v":{"$error":"#NAME?"}},{"$f":"IF(INDEX(periode4,NEVAL,Nenfant)=\"\",0,INDEX(periode4,NEVAL,Nenfant))","v":{"$error":"#NAME?"}}]
[77,null,"approche de la notion de circonstance : savoir répondre oralement aux questions où ?, quand ?, pourquoi ?, comment ? ",null,{"$f":"IF(G87<>0,G87,(IF(F87<>0,F87,0)))","v":{"$error":"#NAME?"}},{"$f":"IF(INDEX(periode3,NEVAL,Nenfant)=\"\",0,INDEX(periode3,NEVAL,Nenfant))","v":{"$error":"#NAME?"}},{"$f":"IF(INDEX(periode4,NEVAL,Nenfant)=\"\",0,INDEX(periode4,NEVAL,Nenfant))","v":{"$error":"#NAME?"}}]
[78,null,"Les genres et nombres",null,{"$error":"#NAME?"},{"$f":"IF(INDEX(periode3,NEVAL,Nenfant)=\"\",0,INDEX(periode3,NEVAL,Nenfant))","v":{"$error":"#NAME?"}},{"$f":"IF(INDEX(periode4,NEVAL,Nenfant)=\"\",0,INDEX(periode4,NEVAL,Nenfant))","v":{"$error":"#NAME?"}}]
[79,null,"repérer et justifier des marques du genre et du nombre : les du pluriel des noms, le e du féminin de l’adjectif, les terminaisons –nt des verbes du 1er groupe au présent de l’indicatif. ",null,{"$error":"#NAME?"},{"$f":"IF(INDEX(periode3,NEVAL,Nenfant)=\"\",0,INDEX(periode3,NEVAL,Nenfant))","v":{"$error":"#NAME?"}},{"$f":"IF(INDEX(periode4,NEVAL,Nenfant)=\"\",0,INDEX(periode4,NEVAL,Nenfant))","v":{"$error":"#NAME?"}}]
[80,null,"connaître et appliquer les notions de masculin/féminin, singulier/pluriel ;"]
[81,null,"connaître et appliquer la règle de l’accord du verbe avec son sujet, et, dans le groupe nominal, la règle de l’accord entre le déterminant et le nom qu’il détermine, entre l’adjectif qualificatif et le nom qu’il qualifie.",null,{"$error":"#NAME?"},{"$f":"IF(INDEX(periode3,NEVAL,Nenfant)=\"\",0,INDEX(periode3,NEVAL,Nenfant))","v":{"$error":"#NAME?"}},{"$f":"IF(INDEX(periode4,NEVAL,Nenfant)=\"\",0,INDEX(periode4,NEVAL,Nenfant))","v":{"$error":"#NAME?"}}]
[82,null,"Le verbe",null,{"$error":"#NAME?"},{"$f":"IF(INDEX(periode3,NEVAL,Nenfant)=\"\",0,INDEX(periode3,NEVAL,Nenfant))","v":{"$error":"#NAME?"}},{"$f":"IF(INDEX(periode4,NEVAL,Nenfant)=\"\",0,INDEX(periode4,NEVAL,Nenfant))","v":{"$error":"#NAME?"}}]
[83,null,"utiliser à l’oral, le présent, le futur et le passé composé.",null,{"$error":"#NAME?"},{"$f":"IF(INDEX(periode3,NEVAL,Nenfant)=\"\",0,INDEX(periode3,NEVAL,Nenfant))","v":{"$error":"#NAME?"}},{"$f":"IF(INDEX(periode4,NEVAL,Nenfant)=\"\",0,INDEX(periode4,NEVAL,Nenfant))","v":{"$error":"#NAME?"}}]
[84,null,"comprendre la correspondance entre les temps verbaux (passé, présent,   futur) et les notions d’action déjà faite, action en train de se faire, action non encore faite.",null,{"$error":"#NAME?"},{"$f":"IF(INDEX(periode3,NEVAL,Nenfant)=\"\",0,INDEX(periode3,NEVAL,Nenfant))","v":{"$error":"#NAME?"}},{"$f":"IF(INDEX(periode4,NEVAL,Nenfant)=\"\",0,INDEX(periode4,NEVAL,Nenfant))","v":{"$error":"#NAME?"}}]
[85,null,"identifier le présent, futur, imparfait et passé composé de l’indicatif des verbes étudiés ; trouver leur infinitif ; ",null,{"$error":"#NAME?"},{"$f":"IF(INDEX(periode3,NEVAL,Nenfant)=\"\",0,INDEX(periode3,NEVAL,Nenfant))","v":{"$error":"#NAME?"}},{"$f":"IF(INDEX(periode4,NEVAL,Nenfant)=\"\",0,INDEX(periode4,NEVAL,Nenfant))","v":{"$error":"#NAME?"}}]
[86,null,"conjuguer les verbes du premier groupe, être et avoir, au présent, au futur, au passé composé de l’indicatif ;",null,{"$error":"#NAME?"},{"$f":"IF(INDEX(periode3,NEVAL,Nenfant)=\"\",0,INDEX(periode3,NEVAL,Nenfant))","v":{"$error":"#NAME?"}},{"$f":"IF(INDEX(periode4,NEVAL,Nenfant)=\"\",0,INDEX(periode4,NEVAL,Nenfant))","v":{"$error":"#NAME?"}}]
[87,null,"conjuguer les verbes faire, aller, dire, venir  au présent de l’indicatif..",null,{"$error":"#NAME?"},{"$f":"IF(INDEX(periode3,NEVAL,Nenfant)=\"\",0,INDEX(periode3,NEVAL,Nenfant))","v":{"$error":"#NAME?"}},{"$f":"IF(INDEX(periode4,NEVAL,Nenfant)=\"\",0,INDEX(periode4,NEVAL,Nenfant))","v":{"$error":"#NAME?"}}]
[88,null,"ORTHOGRAPHE",null,{"$error":"#NAME?"},{"$f":"IF(INDEX(periode3,NEVAL,Nenfant)=\"\",0,INDEX(periode3,NEVAL,Nenfant))","v":{"$error":"#NAME?"}},{"$f":"IF(INDEX(periode4,NEVAL,Nenfant)=\"\",0,INDEX(periode4,NEVAL,Nenfant))","v":{"$error":"#NAME?"}}]
[89,null,"Écrire sans erreur des mots appris.",null,{"$error":"#NAME?"},{"$f":"IF(INDEX(periode3,NEVAL,Nenfant)=\"\",0,INDEX(periode3,NEVAL,Nenfant))","v":{"$error":"#NAME?"}},{"$f":"IF(INDEX(periode4,NEVAL,Nenfant)=\"\",0,INDEX(periode4,NEVAL,Nenfant))","v":{"$error":"#NAME?"}}]
[90,null,"Ecrire sans erreur de manière autonome des mots simples en respectant les correspondances entre lettres et sons.",null,{"$error":"#NAME?"},{"$f":"IF(INDEX(periode3,NEVAL,Nenfant)=\"\",0,INDEX(periode3,NEVAL,Nenfant))","v":{"$error":"#NAME?"}},{"$f":"IF(INDEX(periode4,NEVAL,Nenfant)=\"\",0,INDEX(periode4,NEVAL,Nenfant))","v":{"$error":"#NAME?"}}]
[91,null,"Recopier sans erreur un texte court (2 à 5 lignes).",null,{"$error":"#NAME?"},{"$f":"IF(INDEX(periode3,NEVAL,Nenfant)=\"\",0,INDEX(periode3,NEVAL,Nenfant))","v":{"$error":"#NAME?"}},{"$f":"IF(INDEX(periode4,NEVAL,Nenfant)=\"\",0,INDEX(periode4,NEVAL,Nenfant))","v":{"$error":"#NAME?"}}]
[92,null,"Commencer à utiliser de manière autonome les marques du genre et du nombre (pluriel du nom, féminin de l’adjectif, terminaison –nt des verbes du 1er groupe).",null,{"$error":"#NAME?"},{"$f":"IF(INDEX(periode3,NEVAL,Nenfant)=\"\",0,INDEX(periode3,NEVAL,Nenfant))","v":{"$error":"#NAME?"}},{"$f":"IF(INDEX(periode4,NEVAL,Nenfant)=\"\",0,INDEX(periode4,NEVAL,Nenfant))","v":{"$error":"#NAME?"}}]
[93,null,"Commencer à utiliser correctement la majuscule (débuts de phrase, noms propres de personne). ",null,{"$error":"#NAME?"},{"$f":"IF(INDEX(periode3,NEVAL,Nenfant)=\"\",0,INDEX(periode3,NEVAL,Nenfant))","v":{"$error":"#NAME?"}},{"$f":"IF(INDEX(periode4,NEVAL,Nenfant)=\"\",0,INDEX(periode4,NEVAL,Nenfant))","v":{"$error":"#NAME?"}}]
[94,null,"Écrire sans erreur, sous la dictée, des phrases ou un court texte (5 lignes), préparés ou non, en utilisant ses connaissances lexicales, orthographiques et grammaticales. ",null,{"$error":"#NAME?"},{"$f":"IF(INDEX(periode3,NEVAL,Nenfant)=\"\",0,INDEX(periode3,NEVAL,Nenfant))","v":{"$error":"#NAME?"}},{"$f":"IF(INDEX(periode4,NEVAL,Nenfant)=\"\",0,INDEX(periode4,NEVAL,Nenfant))","v":{"$error":"#NAME?"}}]
[95,null,"Dans les productions dictées et autonomes :",null,{"$error":"#NAME?"},{"$f":"IF(INDEX(periode3,NEVAL,Nenfant)=\"\",0,INDEX(periode3,NEVAL,Nenfant))","v":{"$error":"#NAME?"}},{"$f":"IF(INDEX(periode4,NEVAL,Nenfant)=\"\",0,INDEX(periode4,NEVAL,Nenfant))","v":{"$error":"#NAME?"}}]
[96,null,"respecter les correspondances entre lettres et sons,",null,{"$error":"#NAME?"},{"$f":"IF(INDEX(periode3,NEVAL,Nenfant)=\"\",0,INDEX(periode3,NEVAL,Nenfant))","v":{"$error":"#NAME?"}},{"$f":"IF(INDEX(periode4,NEVAL,Nenfant)=\"\",0,INDEX(periode4,NEVAL,Nenfant))","v":{"$error":"#NAME?"}}]
[97,null,"en particulier, respecter les règles relatives à la valeur des lettres en fonction des voyelles placées à proximité (c/ç, c/qu, g/gu/ge, s/ss),",null,{"$error":"#NAME?"},{"$f":"IF(INDEX(periode3,NEVAL,Nenfant)=\"\",0,INDEX(periode3,NEVAL,Nenfant))","v":{"$error":"#NAME?"}},{"$f":"IF(INDEX(periode4,NEVAL,Nenfant)=\"\",0,INDEX(periode4,NEVAL,Nenfant))","v":{"$error":"#NAME?"}}]
[98,null,"orthographier sans erreur les mots invariables les plus fréquemment rencontrés ainsi que les mots-outils appris au CP, ",null,{"$error":"#NAME?"},{"$f":"IF(INDEX(periode3,NEVAL,Nenfant)=\"\",0,INDEX(periode3,NEVAL,Nenfant))","v":{"$error":"#NAME?"}},{"$f":"IF(INDEX(periode4,NEVAL,Nenfant)=\"\",0,INDEX(periode4,NEVAL,Nenfant))","v":{"$error":"#NAME?"}}]
[99,null,"marquer l’accord entre le sujet et le verbe dans les phrases où l’ordre sujet-verbe est respecté,",null,{"$error":"#NAME?"},{"$f":"IF(INDEX(periode3,NEVAL,Nenfant)=\"\",0,INDEX(periode3,NEVAL,Nenfant))","v":{"$error":"#NAME?"}},{"$f":"IF(INDEX(periode4,NEVAL,Nenfant)=\"\",0,INDEX(periode4,NEVAL,Nenfant))","v":{"$error":"#NAME?"}}]
[100,null,"dans le groupe nominal simple, marquer l’accord de l’adjectif qualificatif avec le nom qu’il qualifie,",null,{"$error":"#NAME?"},{"$f":"IF(INDEX(periode3,NEVAL,Nenfant)=\"\",0,INDEX(periode3,NEVAL,Nenfant))","v":{"$error":"#NAME?"}},{"$f":"IF(INDEX(periode4,NEVAL,Nenfant)=\"\",0,INDEX(periode4,NEVAL,Nenfant))","v":{"$error":"#NAME?"}}]
[101,null,"orthographier sans erreur les formes conjuguées apprises,",null,{"$error":"#NAME?"},{"$f":"IF(INDEX(periode3,NEVAL,Nenfant)=\"\",0,INDEX(periode3,NEVAL,Nenfant))","v":{"$error":"#NAME?"}},{"$f":"IF(INDEX(periode4,NEVAL,Nenfant)=\"\",0,INDEX(periode4,NEVAL,Nenfant))","v":{"$error":"#NAME?"}}]
[102,null,"utiliser à bon escient le point, la majuscule, ainsi que la virgule dans le cas de l’énumération.",null,{"$error":"#NAME?"},{"$f":"IF(INDEX(periode3,NEVAL,Nenfant)=\"\",0,INDEX(periode3,NEVAL,Nenfant))","v":{"$error":"#NAME?"}},{"$f":"IF(INDEX(periode4,NEVAL,Nenfant)=\"\",0,INDEX(periode4,NEVAL,Nenfant))","v":{"$error":"#NAME?"}}]
[103,null," NOMBRE ET CALCUL",null,{"$f":"IF(G113<>0,G113,(IF(F113<>0,F113,0)))","v":{"$error":"#NAME?"}},{"$f":"IF(INDEX(periode3,NEVAL,Nenfant)=\"\",0,INDEX(periode3,NEVAL,Nenfant))","v":{"$error":"#NAME?"}},{"$f":"IF(INDEX(periode4,NEVAL,Nenfant)=\"\",0,INDEX(periode4,NEVAL,Nenfant))","v":{"$error":"#NAME?"}}]
[104,null,"Connaître (savoir écrire et nommer) les nombres entiers naturels inférieurs à 100.",null,{"$error":"#NAME?"},{"$f":"IF(INDEX(periode3,NEVAL,Nenfant)=\"\",0,INDEX(periode3,NEVAL,Nenfant))","v":{"$error":"#NAME?"}},{"$f":"IF(INDEX(periode4,NEVAL,Nenfant)=\"\",0,INDEX(periode4,NEVAL,Nenfant))","v":{"$error":"#NAME?"}}]
[105,null,"Produire et reconnaître les décompositions additives des nombres inférieurs à 20 (« table d’addition »).",null,{"$error":"#NAME?"},{"$f":"IF(INDEX(periode3,NEVAL,Nenfant)=\"\",0,INDEX(periode3,NEVAL,Nenfant))","v":{"$error":"#NAME?"}},{"$f":"IF(INDEX(periode4,NEVAL,Nenfant)=\"\",0,INDEX(periode4,NEVAL,Nenfant))","v":{"$error":"#NAME?"}}]
[106,null,"Comparer, ranger, encadrer ces nombres.",null,{"$error":"#NAME?"},{"$f":"IF(INDEX(periode3,NEVAL,Nenfant)=\"\",0,INDEX(periode3,NEVAL,Nenfant))","v":{"$error":"#NAME?"}},{"$f":"IF(INDEX(periode4,NEVAL,Nenfant)=\"\",0,INDEX(periode4,NEVAL,Nenfant))","v":{"$error":"#NAME?"}}]
[107,null,"Écrire une suite de nombres dans l’ordre croissant ou décroissant.",null,{"$error":"#NAME?"},{"$f":"IF(INDEX(periode3,NEVAL,Nenfant)=\"\",0,INDEX(periode3,NEVAL,Nenfant))","v":{"$error":"#NAME?"}},{"$f":"IF(INDEX(periode4,NEVAL,Nenfant)=\"\",0,INDEX(periode4,NEVAL,Nenfant))","v":{"$error":"#NAME?"}}]
[108,null,"Connaître les doubles des nombres inférieurs à 10 et les moitiés des nombres pairs inférieurs à 20.",null,{"$error":"#NAME?"},{"$f":"IF(INDEX(periode3,NEVAL,Nenfant)=\"\",0,INDEX(periode3,NEVAL,Nenfant))","v":{"$error":"#NAME?"}},{"$f":"IF(INDEX(periode4,NEVAL,Nenfant)=\"\",0,INDEX(periode4,NEVAL,Nenfant))","v":{"$error":"#NAME?"}}]
[109,null,"Connaître la table de multiplication par 2.",null,{"$error":"#NAME?"},{"$f":"IF(INDEX(periode3,NEVAL,Nenfant)=\"\",0,INDEX(periode3,NEVAL,Nenfant))","v":{"$error":"#NAME?"}},{"$f":"IF(INDEX(periode4,NEVAL,Nenfant)=\"\",0,INDEX(periode4,NEVAL,Nenfant))","v":{"$error":"#NAME?"}}]
[110,null,"Calculer mentalement des sommes et des différences.",null,{"$error":"#NAME?"},{"$f":"IF(INDEX(periode3,NEVAL,Nenfant)=\"\",0,INDEX(periode3,NEVAL,Nenfant))","v":{"$error":"#NAME?"}},{"$f":"IF(INDEX(periode4,NEVAL,Nenfant)=\"\",0,INDEX(periode4,NEVAL,Nenfant))","v":{"$error":"#NAME?"}}]
[111,null,"Calculer en ligne des sommes, des différences, des opérations à trous.",null,{"$error":"#NAME?"},{"$f":"IF(INDEX(periode3,NEVAL,Nenfant)=\"\",0,INDEX(periode3,NEVAL,Nenfant))","v":{"$error":"#NAME?"}},{"$f":"IF(INDEX(periode4,NEVAL,Nenfant)=\"\",0,INDEX(periode4,NEVAL,Nenfant))","v":{"$error":"#NAME?"}}]
[112,null,"Connaître et utiliser les techniques opératoires de l’addition et commencer à utliser celles de la soustraction (sur les nombres inférieurs à 100).",null,{"$error":"#NAME?"},{"$f":"IF(INDEX(periode3,NEVAL,Nenfant)=\"\",0,INDEX(periode3,NEVAL,Nenfant))","v":{"$error":"#NAME?"}},{"$f":"IF(INDEX(periode4,NEVAL,Nenfant)=\"\",0,INDEX(periode4,NEVAL,Nenfant))","v":{"$error":"#NAME?"}}]
[113,null,"Résoudre des problèmes simples à une opération. ",null,{"$error":"#NAME?"},{"$f":"IF(INDEX(periode3,NEVAL,Nenfant)=\"\",0,INDEX(periode3,NEVAL,Nenfant))","v":{"$error":"#NAME?"}},{"$f":"IF(INDEX(periode4,NEVAL,Nenfant)=\"\",0,INDEX(periode4,NEVAL,Nenfant))","v":{"$error":"#NAME?"}}]
[114,null,"Connaître (savoir écrire et nommer) les nombres entiers naturels inférieurs à 1 000.",null,{"$error":"#NAME?"},{"$f":"IF(INDEX(periode3,NEVAL,Nenfant)=\"\",0,INDEX(periode3,NEVAL,Nenfant))","v":{"$error":"#NAME?"}},{"$f":"IF(INDEX(periode4,NEVAL,Nenfant)=\"\",0,INDEX(periode4,NEVAL,Nenfant))","v":{"$error":"#NAME?"}}]
[115,null,"Repérer et placer ces nombres sur une droite graduée, les comparer, les ranger, les encadrer.",null,{"$error":"#NAME?"},{"$f":"IF(INDEX(periode3,NEVAL,Nenfant)=\"\",0,INDEX(periode3,NEVAL,Nenfant))","v":{"$error":"#NAME?"}},{"$f":"IF(INDEX(periode4,NEVAL,Nenfant)=\"\",0,INDEX(periode4,NEVAL,Nenfant))","v":{"$error":"#NAME?"}}]
[116,null,"Écrire ou dire des suites de nombres de 10 en 10, de 100 en 100, etc.",null,{"$error":"#NAME?"},{"$f":"IF(INDEX(periode3,NEVAL,Nenfant)=\"\",0,INDEX(periode3,NEVAL,Nenfant))","v":{"$error":"#NAME?"}},{"$f":"IF(INDEX(periode4,NEVAL,Nenfant)=\"\",0,INDEX(periode4,NEVAL,Nenfant))","v":{"$error":"#NAME?"}}]
[117,null,"Connaître les doubles et moitiés de nombres d’usage courant.",null,{"$error":"#NAME?"},{"$f":"IF(INDEX(periode3,NEVAL,Nenfant)=\"\",0,INDEX(periode3,NEVAL,Nenfant))","v":{"$error":"#NAME?"}},{"$f":"IF(INDEX(periode4,NEVAL,Nenfant)=\"\",0,INDEX(periode4,NEVAL,Nenfant))","v":{"$error":"#NAME?"}}]
[118,null,"Mémoriser les tables de multiplication par 2, 3, 4 et 5.",null,{"$error":"#NAME?"},{"$f":"IF(INDEX(periode3,NEVAL,Nenfant)=\"\",0,INDEX(periode3,NEVAL,Nenfant))","v":{"$error":"#NAME?"}},{"$f":"IF(INDEX(periode4,NEVAL,Nenfant)=\"\",0,INDEX(periode4,NEVAL,Nenfant))","v":{"$error":"#NAME?"}}]
[119,null,"Connaître et utiliser des procédures de calcul mental pour calculer des sommes, des différences et des produits.",null,{"$error":"#NAME?"},{"$f":"IF(INDEX(periode3,NEVAL,Nenfant)=\"\",0,INDEX(periode3,NEVAL,Nenfant))","v":{"$error":"#NAME?"}},{"$f":"IF(INDEX(periode4,NEVAL,Nenfant)=\"\",0,INDEX(periode4,NEVAL,Nenfant))","v":{"$error":"#NAME?"}}]
[120,null,"Calculer en ligne des suites d’opérations.",null,{"$error":"#NAME?"},{"$f":"IF(INDEX(periode3,NEVAL,Nenfant)=\"\",0,INDEX(periode3,NEVAL,Nenfant))","v":{"$error":"#NAME?"}},{"$f":"IF(INDEX(periode4,NEVAL,Nenfant)=\"\",0,INDEX(periode4,NEVAL,Nenfant))","v":{"$error":"#NAME?"}}]
[121,null,"Connaître et utiliser les techniques opératoires de l’addition et de la soustraction (sur les nombres inférieurs à 1 000).",null,{"$error":"#NAME?"},{"$f":"IF(INDEX(periode3,NEVAL,Nenfant)=\"\",0,INDEX(periode3,NEVAL,Nenfant))","v":{"$error":"#NAME?"}},{"$f":"IF(INDEX(periode4,NEVAL,Nenfant)=\"\",0,INDEX(periode4,NEVAL,Nenfant))","v":{"$error":"#NAME?"}}]
[122,null,"Connaître une technique opératoire de la multiplication et l’utiliser pour effectuer des multiplications par un nombre à un chiffre.",null,{"$error":"#NAME?"},{"$f":"IF(INDEX(periode3,NEVAL,Nenfant)=\"\",0,INDEX(periode3,NEVAL,Nenfant))","v":{"$error":"#NAME?"}},{"$f":"IF(INDEX(periode4,NEVAL,Nenfant)=\"\",0,INDEX(periode4,NEVAL,Nenfant))","v":{"$error":"#NAME?"}}]
[123,null,"Diviser par 2 ou 5 des nombres inférieurs à 100 (quotient exact entier).",null,{"$error":"#NAME?"},{"$f":"IF(INDEX(periode3,NEVAL,Nenfant)=\"\",0,INDEX(periode3,NEVAL,Nenfant))","v":{"$error":"#NAME?"}},{"$f":"IF(INDEX(periode4,NEVAL,Nenfant)=\"\",0,INDEX(periode4,NEVAL,Nenfant))","v":{"$error":"#NAME?"}}]
[124,null,"Résoudre des problèmes relevant de l’addition, de la soustraction et de la multiplication.",null,{"$error":"#NAME?"},{"$f":"IF(INDEX(periode3,NEVAL,Nenfant)=\"\",0,INDEX(periode3,NEVAL,Nenfant))","v":{"$error":"#NAME?"}},{"$f":"IF(INDEX(periode4,NEVAL,Nenfant)=\"\",0,INDEX(periode4,NEVAL,Nenfant))","v":{"$error":"#NAME?"}}]
[125,null,"Approcher la division de deux nombres entiers à partir d’un problème de partage ou de groupements.",null,{"$error":"#NAME?"},{"$f":"IF(INDEX(periode3,NEVAL,Nenfant)=\"\",0,INDEX(periode3,NEVAL,Nenfant))","v":{"$error":"#NAME?"}},{"$f":"IF(INDEX(periode4,NEVAL,Nenfant)=\"\",0,INDEX(periode4,NEVAL,Nenfant))","v":{"$error":"#NAME?"}}]
[126,null,"Utiliser les fonctions de base de la calculatrice. ",null,{"$error":"#NAME?"},{"$f":"IF(INDEX(periode3,NEVAL,Nenfant)=\"\",0,INDEX(periode3,NEVAL,Nenfant))","v":{"$error":"#NAME?"}},{"$f":"IF(INDEX(periode4,NEVAL,Nenfant)=\"\",0,INDEX(periode4,NEVAL,Nenfant))","v":{"$error":"#NAME?"}}]
[127,null,"Problèmes ",null,{"$error":"#NAME?"},{"$f":"IF(INDEX(periode3,NEVAL,Nenfant)=\"\",0,INDEX(periode3,NEVAL,Nenfant))","v":{"$error":"#NAME?"}},{"$f":"IF(INDEX(periode4,NEVAL,Nenfant)=\"\",0,INDEX(periode4,NEVAL,Nenfant))","v":{"$error":"#NAME?"}}]
[128,{"$nulls":3},{"$error":"#NAME?"},{"$f":"IF(INDEX(periode3,NEVAL,Nenfant)=\"\",0,INDEX(periode3,NEVAL,Nenfant))","v":{"$error":"#NAME?"}},{"$f":"IF(INDEX(periode4,NEVAL,Nenfant)=\"\",0,INDEX(periode4,NEVAL,Nenfant))","v":{"$error":"#NAME?"}}]
[129,{"$nulls":3},{"$error":"#NAME?"},{"$f":"IF(INDEX(periode3,NEVAL,Nenfant)=\"\",0,INDEX(periode3,NEVAL,Nenfant))","v":{"$error":"#NAME?"}},{"$f":"IF(INDEX(periode4,NEVAL,Nenfant)=\"\",0,INDEX(periode4,NEVAL,Nenfant))","v":{"$error":"#NAME?"}}]
[130,{"$nulls":3},{"$error":"#NAME?"},{"$f":"IF(INDEX(periode3,NEVAL,Nenfant)=\"\",0,INDEX(periode3,NEVAL,Nenfant))","v":{"$error":"#NAME?"}},{"$f":"IF(INDEX(periode4,NEVAL,Nenfant)=\"\",0,INDEX(periode4,NEVAL,Nenfant))","v":{"$error":"#NAME?"}}]
[131,null,"GEOMETRIE",null,{"$error":"#NAME?"},{"$f":"IF(INDEX(periode3,NEVAL,Nenfant)=\"\",0,INDEX(periode3,NEVAL,Nenfant))","v":{"$error":"#NAME?"}},{"$f":"IF(INDEX(periode4,NEVAL,Nenfant)=\"\",0,INDEX(periode4,NEVAL,Nenfant))","v":{"$error":"#NAME?"}}]
[132,null,"Situer un objet et utiliser le vocabulaire permettant de définir des positions (devant, derrière, à gauche de, à droite de…).",null,{"$error":"#NAME?"},{"$f":"IF(INDEX(periode3,NEVAL,Nenfant)=\"\",0,INDEX(periode3,NEVAL,Nenfant))","v":{"$error":"#NAME?"}},{"$f":"IF(INDEX(periode4,NEVAL,Nenfant)=\"\",0,INDEX(periode4,NEVAL,Nenfant))","v":{"$error":"#NAME?"}}]
[133,null,"Reconnaître et nommer un carré, un rectangle, un triangle.",null,{"$error":"#NAME?"},{"$f":"IF(INDEX(periode3,NEVAL,Nenfant)=\"\",0,INDEX(periode3,NEVAL,Nenfant))","v":{"$error":"#NAME?"}},{"$f":"IF(INDEX(periode4,NEVAL,Nenfant)=\"\",0,INDEX(periode4,NEVAL,Nenfant))","v":{"$error":"#NAME?"}}]
[134,null,"Reproduire des figures géométriques simples à l’aide d’instruments ou de techniques : règle, quadrillage, papier calque.",null,{"$error":"#NAME?"},{"$f":"IF(INDEX(periode3,NEVAL,Nenfant)=\"\",0,INDEX(periode3,NEVAL,Nenfant))","v":{"$error":"#NAME?"}},{"$f":"IF(INDEX(periode4,NEVAL,Nenfant)=\"\",0,INDEX(periode4,NEVAL,Nenfant))","v":{"$error":"#NAME?"}}]
[135,null,"Reconnaître et nommer le cube et le pavé droit.",null,{"$error":"#NAME?"},{"$f":"IF(INDEX(periode3,NEVAL,Nenfant)=\"\",0,INDEX(periode3,NEVAL,Nenfant))","v":{"$error":"#NAME?"}},{"$f":"IF(INDEX(periode4,NEVAL,Nenfant)=\"\",0,INDEX(periode4,NEVAL,Nenfant))","v":{"$error":"#NAME?"}}]
[136,null,"S’initier au vocabulaire géométrique.",null,{"$error":"#NAME?"},{"$f":"IF(INDEX(periode3,NEVAL,Nenfant)=\"\",0,INDEX(periode3,NEVAL,Nenfant))","v":{"$error":"#NAME?"}},{"$f":"IF(INDEX(periode4,NEVAL,Nenfant)=\"\",0,INDEX(periode4,NEVAL,Nenfant))","v":{"$error":"#NAME?"}}]
[137,null,"Décrire, reproduire, tracer un carré,  un rectangle, un triangle rectangle.",null,{"$error":"#NAME?"},{"$f":"IF(INDEX(periode3,NEVAL,Nenfant)=\"\",0,INDEX(periode3,NEVAL,Nenfant))","v":{"$error":"#NAME?"}},{"$f":"IF(INDEX(periode4,NEVAL,Nenfant)=\"\",0,INDEX(periode4,NEVAL,Nenfant))","v":{"$error":"#NAME?"}}]
[138,null,"Utiliser des instruments pour réaliser des tracés : règle, équerre ou gabarit de l’angle droit.",null,{"$f":"IF(G148<>0,G148,(IF(F148<>0,F148,0)))","v":{"$error":"#NAME?"}},{"$f":"IF(INDEX(periode3,NEVAL,Nenfant)=\"\",0,INDEX(periode3,NEVAL,Nenfant))","v":{"$error":"#NAME?"}},{"$f":"IF(INDEX(periode4,NEVAL,Nenfant)=\"\",0,INDEX(periode4,NEVAL,Nenfant))","v":{"$error":"#NAME?"}}]
[139,null,"Percevoir et reconnaître quelques relations et propriétés géométriques : alignement, angle droit, axe de symétrie, égalité de longueurs.",null,{"$error":"#NAME?"},{"$f":"IF(INDEX(periode3,NEVAL,Nenfant)=\"\",0,INDEX(periode3,NEVAL,Nenfant))","v":{"$error":"#NAME?"}},{"$f":"IF(INDEX(periode4,NEVAL,Nenfant)=\"\",0,INDEX(periode4,NEVAL,Nenfant))","v":{"$error":"#NAME?"}}]
[140,null,"Repérer des cases, des nœuds d’un quadrillage.",null,{"$error":"#NAME?"},{"$f":"IF(INDEX(periode3,NEVAL,Nenfant)=\"\",0,INDEX(periode3,NEVAL,Nenfant))","v":{"$error":"#NAME?"}},{"$f":"IF(INDEX(periode4,NEVAL,Nenfant)=\"\",0,INDEX(periode4,NEVAL,Nenfant))","v":{"$error":"#NAME?"}}]
[141,null,"Connaître et utiliser un vocabulaire géométrique élémentaire approprié.",null,{"$error":"#NAME?"},{"$f":"IF(INDEX(periode3,NEVAL,Nenfant)=\"\",0,INDEX(periode3,NEVAL,Nenfant))","v":{"$error":"#NAME?"}},{"$f":"IF(INDEX(periode4,NEVAL,Nenfant)=\"\",0,INDEX(periode4,NEVAL,Nenfant))","v":{"$error":"#NAME?"}}]
[142,null," Reconnaître, décrire, nommer quelques solides  droits : cube, pavé..",null,{"$error":"#NAME?"},{"$f":"IF(INDEX(periode3,NEVAL,Nenfant)=\"\",0,INDEX(periode3,NEVAL,Nenfant))","v":{"$error":"#NAME?"}},{"$f":"IF(INDEX(periode4,NEVAL,Nenfant)=\"\",0,INDEX(periode4,NEVAL,Nenfant))","v":{"$error":"#NAME?"}}]
[143,null," Résoudre des problèmes géométriques",null,{"$error":"#NAME?"},{"$f":"IF(INDEX(periode3,NEVAL,Nenfant)=\"\",0,INDEX(periode3,NEVAL,Nenfant))","v":{"$error":"#NAME?"}},{"$f":"IF(INDEX(periode4,NEVAL,Nenfant)=\"\",0,INDEX(periode4,NEVAL,Nenfant))","v":{"$error":"#NAME?"}}]
[144,null," GRANDEURS ET MESURE",null,{"$error":"#NAME?"},{"$f":"IF(INDEX(periode3,NEVAL,Nenfant)=\"\",0,INDEX(periode3,NEVAL,Nenfant))","v":{"$error":"#NAME?"}},{"$f":"IF(INDEX(periode4,NEVAL,Nenfant)=\"\",0,INDEX(periode4,NEVAL,Nenfant))","v":{"$error":"#NAME?"}}]
[145,null,"Repérer des évènements de la journée en utilisant les heures et les demi heures.",null,{"$error":"#NAME?"},{"$f":"IF(INDEX(periode3,NEVAL,Nenfant)=\"\",0,INDEX(periode3,NEVAL,Nenfant))","v":{"$error":"#NAME?"}},{"$f":"IF(INDEX(periode4,NEVAL,Nenfant)=\"\",0,INDEX(periode4,NEVAL,Nenfant))","v":{"$error":"#NAME?"}}]
[146,null,"Comparer et classer des objets selon leur longueur et leur masse.",null,{"$error":"#NAME?"},{"$f":"IF(INDEX(periode3,NEVAL,Nenfant)=\"\",0,INDEX(periode3,NEVAL,Nenfant))","v":{"$error":"#NAME?"}},{"$f":"IF(INDEX(periode4,NEVAL,Nenfant)=\"\",0,INDEX(periode4,NEVAL,Nenfant))","v":{"$error":"#NAME?"}}]
[147,null,"Utiliser la règle graduée pour tracer des segments, comparer des longueurs ",null,{"$error":"#NAME?"},{"$f":"IF(INDEX(periode3,NEVAL,Nenfant)=\"\",0,INDEX(periode3,NEVAL,Nenfant))","v":{"$error":"#NAME?"}},{"$f":"IF(INDEX(periode4,NEVAL,Nenfant)=\"\",0,INDEX(periode4,NEVAL,Nenfant))","v":{"$error":"#NAME?"}}]
[148,null,"Connaître et utiliser l’euro.",null,{"$error":"#NAME?"},{"$f":"IF(INDEX(periode3,NEVAL,Nenfant)=\"\",0,INDEX(periode3,NEVAL,Nenfant))","v":{"$error":"#NAME?"}},{"$f":"IF(INDEX(periode4,NEVAL,Nenfant)=\"\",0,INDEX(periode4,NEVAL,Nenfant))","v":{"$error":"#NAME?"}}]
[149,null,"Résoudre des problèmes de vie courante.",null,{"$error":"#NAME?"},{"$f":"IF(INDEX(periode3,NEVAL,Nenfant)=\"\",0,INDEX(periode3,NEVAL,Nenfant))","v":{"$error":"#NAME?"}},{"$f":"IF(INDEX(periode4,NEVAL,Nenfant)=\"\",0,INDEX(periode4,NEVAL,Nenfant))","v":{"$error":"#NAME?"}}]
[150,null," Utiliser un calendrier pour comparer des durées.",null,{"$error":"#NAME?"},{"$f":"IF(INDEX(periode3,NEVAL,Nenfant)=\"\",0,INDEX(periode3,NEVAL,Nenfant))","v":{"$error":"#NAME?"}},{"$f":"IF(INDEX(periode4,NEVAL,Nenfant)=\"\",0,INDEX(periode4,NEVAL,Nenfant))","v":{"$error":"#NAME?"}}]
[151,null,"Connaître la relation entre heure et minute, mètre et centimètre, kilomètre et mètre, kilogramme et gramme, euro et centimes d’euro.",null,{"$error":"#NAME?"},{"$f":"IF(INDEX(periode3,NEVAL,Nenfant)=\"\",0,INDEX(periode3,NEVAL,Nenfant))","v":{"$error":"#NAME?"}},{"$f":"IF(INDEX(periode4,NEVAL,Nenfant)=\"\",0,INDEX(periode4,NEVAL,Nenfant))","v":{"$error":"#NAME?"}}]
[152,null,"Mesurer des segments, des distances.",null,{"$error":"#NAME?"},{"$f":"IF(INDEX(periode3,NEVAL,Nenfant)=\"\",0,INDEX(periode3,NEVAL,Nenfant))","v":{"$error":"#NAME?"}},{"$f":"IF(INDEX(periode4,NEVAL,Nenfant)=\"\",0,INDEX(periode4,NEVAL,Nenfant))","v":{"$error":"#NAME?"}}]
[153,null,"Résoudre des problèmes de longueur et de masse.",null,{"$error":"#NAME?"},{"$f":"IF(INDEX(periode3,NEVAL,Nenfant)=\"\",0,INDEX(periode3,NEVAL,Nenfant))","v":{"$error":"#NAME?"}},{"$f":"IF(INDEX(periode4,NEVAL,Nenfant)=\"\",0,INDEX(periode4,NEVAL,Nenfant))","v":{"$error":"#NAME?"}}]
[154,null," ORGANISATION ET GESTION DES DONNEES",null,{"$error":"#NAME?"},{"$f":"IF(INDEX(periode3,NEVAL,Nenfant)=\"\",0,INDEX(periode3,NEVAL,Nenfant))","v":{"$error":"#NAME?"}},{"$f":"IF(INDEX(periode4,NEVAL,Nenfant)=\"\",0,INDEX(periode4,NEVAL,Nenfant))","v":{"$error":"#NAME?"}}]
[155,null,"Lire ou compléter un tableau dans des situations concrètes simples.",null,{"$error":"#NAME?"},{"$f":"IF(INDEX(periode3,NEVAL,Nenfant)=\"\",0,INDEX(periode3,NEVAL,Nenfant))","v":{"$error":"#NAME?"}},{"$f":"IF(INDEX(periode4,NEVAL,Nenfant)=\"\",0,INDEX(periode4,NEVAL,Nenfant))","v":{"$error":"#NAME?"}}]
[156,null,"Utiliser un tableau, un graphique.",null,{"$error":"#NAME?"},{"$f":"IF(INDEX(periode3,NEVAL,Nenfant)=\"\",0,INDEX(periode3,NEVAL,Nenfant))","v":{"$error":"#NAME?"}},{"$f":"IF(INDEX(periode4,NEVAL,Nenfant)=\"\",0,INDEX(periode4,NEVAL,Nenfant))","v":{"$error":"#NAME?"}}]
[157,null,"Organiser les informations d’un énoncé",null,{"$error":"#NAME?"},{"$f":"IF(INDEX(periode3,NEVAL,Nenfant)=\"\",0,INDEX(periode3,NEVAL,Nenfant))","v":{"$error":"#NAME?"}},{"$f":"IF(INDEX(periode4,NEVAL,Nenfant)=\"\",0,INDEX(periode4,NEVAL,Nenfant))","v":{"$error":"#NAME?"}}]
[158,null,"DECOUVERTE DU MONDE",null,{"$error":"#NAME?"},{"$f":"IF(INDEX(periode3,NEVAL,Nenfant)=\"\",0,INDEX(periode3,NEVAL,Nenfant))","v":{"$error":"#NAME?"}},{"$f":"IF(INDEX(periode4,NEVAL,Nenfant)=\"\",0,INDEX(periode4,NEVAL,Nenfant))","v":{"$error":"#NAME?"}}]
[159,null,"Se répérer dans l'espace et le temps",null,{"$f":"IF(G169<>0,G169,(IF(F169<>0,F169,0)))","v":{"$error":"#NAME?"}},{"$f":"IF(INDEX(periode3,NEVAL,Nenfant)=\"\",0,INDEX(periode3,NEVAL,Nenfant))","v":{"$error":"#NAME?"}},{"$f":"IF(INDEX(periode4,NEVAL,Nenfant)=\"\",0,INDEX(periode4,NEVAL,Nenfant))","v":{"$error":"#NAME?"}}]
[160,null,"Elaborer des représentations simples de l’espace familier : la classe, l’école, le quartier, le village, la ville. ",null,{"$error":"#NAME?"},{"$f":"IF(INDEX(periode3,NEVAL,Nenfant)=\"\",0,INDEX(periode3,NEVAL,Nenfant))","v":{"$error":"#NAME?"}},{"$f":"IF(INDEX(periode4,NEVAL,Nenfant)=\"\",0,INDEX(periode4,NEVAL,Nenfant))","v":{"$error":"#NAME?"}}]
[161,null,"Comparer ces milieux familiers avec d’autres milieux et espaces plus lointains. Ils découvrent des formes usuelles de représentation de l’espace (photographies, cartes, mappemondes, planisphères, globe).",null,{"$error":"#NAME?"},{"$f":"IF(INDEX(periode3,NEVAL,Nenfant)=\"\",0,INDEX(periode3,NEVAL,Nenfant))","v":{"$error":"#NAME?"}},{"$f":"IF(INDEX(periode4,NEVAL,Nenfant)=\"\",0,INDEX(periode4,NEVAL,Nenfant))","v":{"$error":"#NAME?"}}]
[162,null,"Découvrir des formes usuelles de représentation de l’espace (photographies, cartes, mappemondes, planisphères, globe).",null,{"$error":"#NAME?"},{"$f":"IF(INDEX(periode3,NEVAL,Nenfant)=\"\",0,INDEX(periode3,NEVAL,Nenfant))","v":{"$error":"#NAME?"}},{"$f":"IF(INDEX(periode4,NEVAL,Nenfant)=\"\",0,INDEX(periode4,NEVAL,Nenfant))","v":{"$error":"#NAME?"}}]
[163,null,"Repérer l’alternance jour-nuit, les semaines, les mois, les saisons. "]
[164,null,"Utiliser des outils de repérage et de mesure du temps : le calendrier, l’horloge.",null,{"$error":"#NAME?"},{"$f":"IF(INDEX(periode3,NEVAL,Nenfant)=\"\",0,INDEX(periode3,NEVAL,Nenfant))","v":{"$error":"#NAME?"}},{"$f":"IF(INDEX(periode4,NEVAL,Nenfant)=\"\",0,INDEX(periode4,NEVAL,Nenfant))","v":{"$error":"#NAME?"}}]
[165,null,"Découvrir le monde du vivant, de la matière et des objets ",null,{"$error":"#NAME?"},{"$f":"IF(INDEX(periode3,NEVAL,Nenfant)=\"\",0,INDEX(periode3,NEVAL,Nenfant))","v":{"$error":"#NAME?"}},{"$f":"IF(INDEX(periode4,NEVAL,Nenfant)=\"\",0,INDEX(periode4,NEVAL,Nenfant))","v":{"$error":"#NAME?"}}]
[166,null,"Repérer des caractéristiques du vivant : naissance, croissance et reproduction ; nutrition et régimes alimentaires des animaux.",null,{"$error":"#NAME?"},{"$f":"IF(INDEX(periode3,NEVAL,Nenfant)=\"\",0,INDEX(periode3,NEVAL,Nenfant))","v":{"$error":"#NAME?"}},{"$f":"IF(INDEX(periode4,NEVAL,Nenfant)=\"\",0,INDEX(periode4,NEVAL,Nenfant))","v":{"$error":"#NAME?"}}]
[167,null,"Apprendre quelques règles d’hygiène et de sécurité personnelles et collectives.",null,{"$error":"#NAME?"},{"$f":"IF(INDEX(periode3,NEVAL,Nenfant)=\"\",0,INDEX(periode3,NEVAL,Nenfant))","v":{"$error":"#NAME?"}},{"$f":"IF(INDEX(periode4,NEVAL,Nenfant)=\"\",0,INDEX(periode4,NEVAL,Nenfant))","v":{"$error":"#NAME?"}}]
[168,null,"Comprendre les interactions entre les êtres vivants et leur environnement ",null,{"$error":"#NAME?"},{"$f":"IF(INDEX(periode3,NEVAL,Nenfant)=\"\",0,INDEX(periode3,NEVAL,Nenfant))","v":{"$error":"#NAME?"}},{"$f":"IF(INDEX(periode4,NEVAL,Nenfant)=\"\",0,INDEX(periode4,NEVAL,Nenfant))","v":{"$error":"#NAME?"}}]
[169,null,"Respecter l’environnement.",null,{"$error":"#NAME?"},{"$f":"IF(INDEX(periode3,NEVAL,Nenfant)=\"\",0,INDEX(periode3,NEVAL,Nenfant))","v":{"$error":"#NAME?"}},{"$f":"IF(INDEX(periode4,NEVAL,Nenfant)=\"\",0,INDEX(periode4,NEVAL,Nenfant))","v":{"$error":"#NAME?"}}]
[170,null,"Distinguer les solides et les liquides.",null,{"$error":"#NAME?"},{"$f":"IF(INDEX(periode3,NEVAL,Nenfant)=\"\",0,INDEX(periode3,NEVAL,Nenfant))","v":{"$error":"#NAME?"}},{"$f":"IF(INDEX(periode4,NEVAL,Nenfant)=\"\",0,INDEX(periode4,NEVAL,Nenfant))","v":{"$error":"#NAME?"}}]
[171,null,"Percevoir les changements d’états de la matière.",null,{"$error":"#NAME?"},{"$f":"IF(INDEX(periode3,NEVAL,Nenfant)=\"\",0,INDEX(periode3,NEVAL,Nenfant))","v":{"$error":"#NAME?"}},{"$f":"IF(INDEX(periode4,NEVAL,Nenfant)=\"\",0,INDEX(periode4,NEVAL,Nenfant))","v":{"$error":"#NAME?"}}]
[172,null,"Réaliser des maquettes élémentaires",null,{"$error":"#NAME?"},{"$f":"IF(INDEX(periode3,NEVAL,Nenfant)=\"\",0,INDEX(periode3,NEVAL,Nenfant))","v":{"$error":"#NAME?"}},{"$f":"IF(INDEX(periode4,NEVAL,Nenfant)=\"\",0,INDEX(periode4,NEVAL,Nenfant))","v":{"$error":"#NAME?"}}]
[173,null,"Réaliser des circuits électriques simples pour comprendre le fonctionnement d’un appareil. ",null,{"$error":"#NAME?"},{"$f":"IF(INDEX(periode3,NEVAL,Nenfant)=\"\",0,INDEX(periode3,NEVAL,Nenfant))","v":{"$error":"#NAME?"}},{"$f":"IF(INDEX(periode4,NEVAL,Nenfant)=\"\",0,INDEX(periode4,NEVAL,Nenfant))","v":{"$error":"#NAME?"}}]
[174,null,"PRATIQUES ARTISTIQUES ET HISTOIRE DE L'ART",null,{"$f":"IF(G184<>0,G184,(IF(F184<>0,F184,0)))","v":{"$error":"#NAME?"}},{"$f":"IF(INDEX(periode3,NEVAL,Nenfant)=\"\",0,INDEX(periode3,NEVAL,Nenfant))","v":{"$error":"#NAME?"}},{"$f":"IF(INDEX(periode4,NEVAL,Nenfant)=\"\",0,INDEX(periode4,NEVAL,Nenfant))","v":{"$error":"#NAME?"}}]
[175,null,"Arts visuels",null,{"$error":"#NAME?"},{"$f":"IF(INDEX(periode3,NEVAL,Nenfant)=\"\",0,INDEX(periode3,NEVAL,Nenfant))","v":{"$error":"#NAME?"}},{"$f":"IF(INDEX(periode4,NEVAL,Nenfant)=\"\",0,INDEX(periode4,NEVAL,Nenfant))","v":{"$error":"#NAME?"}}]
[176,null,"Utiliser des techniques traditionnelles : peinture, dessin",null,{"$error":"#NAME?"},{"$f":"IF(INDEX(periode3,NEVAL,Nenfant)=\"\",0,INDEX(periode3,NEVAL,Nenfant))","v":{"$error":"#NAME?"}},{"$f":"IF(INDEX(periode4,NEVAL,Nenfant)=\"\",0,INDEX(periode4,NEVAL,Nenfant))","v":{"$error":"#NAME?"}}]
[177,null,"Utiliser des techniques contemporaines : phto numérique, cinéma, vidéo, infographie",null,{"$error":"#NAME?"},{"$f":"IF(INDEX(periode3,NEVAL,Nenfant)=\"\",0,INDEX(periode3,NEVAL,Nenfant))","v":{"$error":"#NAME?"}},{"$f":"IF(INDEX(periode4,NEVAL,Nenfant)=\"\",0,INDEX(periode4,NEVAL,Nenfant))","v":{"$error":"#NAME?"}}]
[178,null,"Utiliser des procédures simples mais combinées : recouvrement, tracés, montage",null,{"$error":"#NAME?"},{"$f":"IF(INDEX(periode3,NEVAL,Nenfant)=\"\",0,INDEX(periode3,NEVAL,Nenfant))","v":{"$error":"#NAME?"}},{"$f":"IF(INDEX(periode4,NEVAL,Nenfant)=\"\",0,INDEX(periode4,NEVAL,Nenfant))","v":{"$error":"#NAME?"}}]
[179,null,"Savoir travailler autant en surface qu’en volume.",null,{"$error":"#NAME?"},{"$f":"IF(INDEX(periode3,NEVAL,Nenfant)=\"\",0,INDEX(periode3,NEVAL,Nenfant))","v":{"$error":"#NAME?"}},{"$f":"IF(INDEX(periode4,NEVAL,Nenfant)=\"\",0,INDEX(periode4,NEVAL,Nenfant))","v":{"$error":"#NAME?"}}]
[180,null,"Savoir utiliser des instruments, des gestes techniques, des médiums et des supports variés."]
[181,null,"Exprimer ce que l’on perçoit."]
[182,null,"Imaginer et évoquer un projet ou une réalisation en utilisant un vocabulaire approprié",null,{"$error":"#NAME?"},{"$f":"IF(INDEX(periode3,NEVAL,Nenfant)=\"\",0,INDEX(periode3,NEVAL,Nenfant))","v":{"$error":"#NAME?"}},{"$f":"IF(INDEX(periode4,NEVAL,Nenfant)=\"\",0,INDEX(periode4,NEVAL,Nenfant))","v":{"$error":"#NAME?"}}]
[183,null,"Éducation musicale",null,{"$error":"#NAME?"},{"$f":"IF(INDEX(periode3,NEVAL,Nenfant)=\"\",0,INDEX(periode3,NEVAL,Nenfant))","v":{"$error":"#NAME?"}},{"$f":"IF(INDEX(periode4,NEVAL,Nenfant)=\"\",0,INDEX(periode4,NEVAL,Nenfant))","v":{"$error":"#NAME?"}}]
[184,null,"Apprendre une dizaine de comptines ou chansons.",null,{"$error":"#NAME?"},{"$f":"IF(INDEX(periode3,NEVAL,Nenfant)=\"\",0,INDEX(periode3,NEVAL,Nenfant))","v":{"$error":"#NAME?"}},{"$f":"IF(INDEX(periode4,NEVAL,Nenfant)=\"\",0,INDEX(periode4,NEVAL,Nenfant))","v":{"$error":"#NAME?"}}]
[185,null,"Ecouter des extraits d’oeuvres diverses.",null,{"$error":"#NAME?"},{"$f":"IF(INDEX(periode3,NEVAL,Nenfant)=\"\",0,INDEX(periode3,NEVAL,Nenfant))","v":{"$error":"#NAME?"}},{"$f":"IF(INDEX(periode4,NEVAL,Nenfant)=\"\",0,INDEX(periode4,NEVAL,Nenfant))","v":{"$error":"#NAME?"}}]
[186,null,"chanter en portant attention à la justesse tonale, à l’exactitude rythmique, à la puissance de la voix, à la respiration et à l’articulation ",null,{"$error":"#NAME?"},{"$f":"IF(INDEX(periode3,NEVAL,Nenfant)=\"\",0,INDEX(periode3,NEVAL,Nenfant))","v":{"$error":"#NAME?"}},{"$f":"IF(INDEX(periode4,NEVAL,Nenfant)=\"\",0,INDEX(periode4,NEVAL,Nenfant))","v":{"$error":"#NAME?"}}]
[187,null,"Apprendre à respecter les exigences d’une expression musicale collective."]
[188,null,"Repérer des éléments musicaux caractéristiques très simples, concernant les thèmes mélodiques, les rythmes et le tempo, les intensités, les timbres"]
[189,null,"commencent à reconnaître les grandes familles d’instruments.",null,{"$error":"#NAME?"},{"$f":"IF(INDEX(periode3,NEVAL,Nenfant)=\"\",0,INDEX(periode3,NEVAL,Nenfant))","v":{"$error":"#NAME?"}},{"$f":"IF(INDEX(periode4,NEVAL,Nenfant)=\"\",0,INDEX(periode4,NEVAL,Nenfant))","v":{"$error":"#NAME?"}}]
[190,null,"LVE",null,{"$f":"IF(G200<>0,G200,(IF(F200<>0,F200,0)))","v":{"$error":"#NAME?"}},{"$f":"IF(INDEX(periode3,NEVAL,Nenfant)=\"\",0,INDEX(periode3,NEVAL,Nenfant))","v":{"$error":"#NAME?"}},{"$f":"IF(INDEX(periode4,NEVAL,Nenfant)=\"\",0,INDEX(periode4,NEVAL,Nenfant))","v":{"$error":"#NAME?"}}]
[191,null," comprendre et utiliser des énoncés simples de la vie quotidienne.",null,{"$error":"#NAME?"},{"$f":"IF(INDEX(periode3,NEVAL,Nenfant)=\"\",0,INDEX(periode3,NEVAL,Nenfant))","v":{"$error":"#NAME?"}},{"$f":"IF(INDEX(periode4,NEVAL,Nenfant)=\"\",0,INDEX(periode4,NEVAL,Nenfant))","v":{"$error":"#NAME?"}}]
[192,null,"EDUCATION PHYSIQUE ET SPORTIVE",null,{"$error":"#NAME?"},{"$f":"IF(INDEX(periode3,NEVAL,Nenfant)=\"\",0,INDEX(periode3,NEVAL,Nenfant))","v":{"$error":"#NAME?"}},{"$f":"IF(INDEX(periode4,NEVAL,Nenfant)=\"\",0,INDEX(periode4,NEVAL,Nenfant))","v":{"$error":"#NAME?"}}]
[193,null,"Réaliser une performance mesurée (en distance, en temps)",null,{"$error":"#NAME?"},{"$f":"IF(INDEX(periode3,NEVAL,Nenfant)=\"\",0,INDEX(periode3,NEVAL,Nenfant))","v":{"$error":"#NAME?"}},{"$f":"IF(INDEX(periode4,NEVAL,Nenfant)=\"\",0,INDEX(periode4,NEVAL,Nenfant))","v":{"$error":"#NAME?"}}]
[194,null,"Activités athlétiques : courir vite, longtemps, en franchissant des obstacles, sauter loin et haut, lancer loin.",null,{"$error":"#NAME?"},{"$f":"IF(INDEX(periode3,NEVAL,Nenfant)=\"\",0,INDEX(periode3,NEVAL,Nenfant))","v":{"$error":"#NAME?"}},{"$f":"IF(INDEX(periode4,NEVAL,Nenfant)=\"\",0,INDEX(periode4,NEVAL,Nenfant))","v":{"$error":"#NAME?"}}]
[195,null,"Natation : se déplacer sur une quinzaine de mètres.",null,{"$error":"#NAME?"},{"$f":"IF(INDEX(periode3,NEVAL,Nenfant)=\"\",0,INDEX(periode3,NEVAL,Nenfant))","v":{"$error":"#NAME?"}},{"$f":"IF(INDEX(periode4,NEVAL,Nenfant)=\"\",0,INDEX(periode4,NEVAL,Nenfant))","v":{"$error":"#NAME?"}}]
[196,null,"Adapter ses déplacements à différents types d’environnement",null,{"$error":"#NAME?"},{"$f":"IF(INDEX(periode3,NEVAL,Nenfant)=\"\",0,INDEX(periode3,NEVAL,Nenfant))","v":{"$error":"#NAME?"}},{"$f":"IF(INDEX(periode4,NEVAL,Nenfant)=\"\",0,INDEX(periode4,NEVAL,Nenfant))","v":{"$error":"#NAME?"}}]
[197,null,"Activités d’escalade : grimper jusqu’à 3 m et redescendre (mur équipé).",null,{"$error":"#NAME?"},{"$f":"IF(INDEX(periode3,NEVAL,Nenfant)=\"\",0,INDEX(periode3,NEVAL,Nenfant))","v":{"$error":"#NAME?"}},{"$f":"IF(INDEX(periode4,NEVAL,Nenfant)=\"\",0,INDEX(periode4,NEVAL,Nenfant))","v":{"$error":"#NAME?"}}]
[198,null,"Activités aquatiques et nautiques : s’immerger, se déplacer sous l’eau, se laisser flotter.",null,{"$error":"#NAME?"},{"$f":"IF(INDEX(periode3,NEVAL,Nenfant)=\"\",0,INDEX(periode3,NEVAL,Nenfant))","v":{"$error":"#NAME?"}},{"$f":"IF(INDEX(periode4,NEVAL,Nenfant)=\"\",0,INDEX(periode4,NEVAL,Nenfant))","v":{"$error":"#NAME?"}}]
[199,null,"Activités de roule et glisse : réaliser un parcours simple en roller ou en vélo.",null,{"$error":"#NAME?"},{"$f":"IF(INDEX(periode3,NEVAL,Nenfant)=\"\",0,INDEX(periode3,NEVAL,Nenfant))","v":{"$error":"#NAME?"}},{"$f":"IF(INDEX(periode4,NEVAL,Nenfant)=\"\",0,INDEX(periode4,NEVAL,Nenfant))","v":{"$error":"#NAME?"}}]
[200,null,"Activités d’orientation : retrouver quelques balises dans un milieu connu.",null,{"$error":"#NAME?"},{"$f":"IF(INDEX(periode3,NEVAL,Nenfant)=\"\",0,INDEX(periode3,NEVAL,Nenfant))","v":{"$error":"#NAME?"}},{"$f":"IF(INDEX(periode4,NEVAL,Nenfant)=\"\",0,INDEX(periode4,NEVAL,Nenfant))","v":{"$error":"#NAME?"}}]
[201,null,"Coopérer ou s’opposer individuellement et collectivement",null,{"$error":"#NAME?"},{"$f":"IF(INDEX(periode3,NEVAL,Nenfant)=\"\",0,INDEX(periode3,NEVAL,Nenfant))","v":{"$error":"#NAME?"}},{"$f":"IF(INDEX(periode4,NEVAL,Nenfant)=\"\",0,INDEX(periode4,NEVAL,Nenfant))","v":{"$error":"#NAME?"}}]
[202,null,"Jeux de lutte : agir sur son adversaire pour l’immobiliser.",null,{"$error":"#NAME?"},{"$f":"IF(INDEX(periode3,NEVAL,Nenfant)=\"\",0,INDEX(periode3,NEVAL,Nenfant))","v":{"$error":"#NAME?"}},{"$f":"IF(INDEX(periode4,NEVAL,Nenfant)=\"\",0,INDEX(periode4,NEVAL,Nenfant))","v":{"$error":"#NAME?"}}]
[203,null,"Jeux de raquettes : faire quelques échanges.",null,{"$error":"#NAME?"},{"$f":"IF(INDEX(periode3,NEVAL,Nenfant)=\"\",0,INDEX(periode3,NEVAL,Nenfant))","v":{"$error":"#NAME?"}},{"$f":"IF(INDEX(periode4,NEVAL,Nenfant)=\"\",0,INDEX(periode4,NEVAL,Nenfant))","v":{"$error":"#NAME?"}}]
[204,null,"Jeux traditionnels et jeux collectifs avec ou sans ballon : coopérer avec ses partenaires pour affronter collectivement des adversaires, en respectant des règles, en assurant des rôles différents (attaquant, défenseur, arbitre).",null,{"$f":"IF(G214<>0,G214,(IF(F214<>0,F214,0)))","v":{"$error":"#NAME?"}},{"$f":"IF(INDEX(periode3,NEVAL,Nenfant)=\"\",0,INDEX(periode3,NEVAL,Nenfant))","v":{"$error":"#NAME?"}},{"$f":"IF(INDEX(periode4,NEVAL,Nenfant)=\"\",0,INDEX(periode4,NEVAL,Nenfant))","v":{"$error":"#NAME?"}}]
[205,null,"Concevoir et réaliser des actions à visées expressive, artistique, esthétique",null,{"$error":"#NAME?"},{"$f":"IF(INDEX(periode3,NEVAL,Nenfant)=\"\",0,INDEX(periode3,NEVAL,Nenfant))","v":{"$error":"#NAME?"}},{"$f":"IF(INDEX(periode4,NEVAL,Nenfant)=\"\",0,INDEX(periode4,NEVAL,Nenfant))","v":{"$error":"#NAME?"}}]
[206,null,"Danse : exprimer corporellement des personnages, des images, des sentiments pour communiquer des émotions en réalisant une petite chorégraphie (3 à 5 éléments), sur des supports sonores divers.",null,{"$error":"#NAME?"},{"$f":"IF(INDEX(periode3,NEVAL,Nenfant)=\"\",0,INDEX(periode3,NEVAL,Nenfant))","v":{"$error":"#NAME?"}},{"$f":"IF(INDEX(periode4,NEVAL,Nenfant)=\"\",0,INDEX(periode4,NEVAL,Nenfant))","v":{"$error":"#NAME?"}}]
[207,null," Activités gymniques : réaliser un enchaînement de 2 ou 3 actions “acrobatiques” sur des engins variés (barres, plinths, poutres, gros tapis).",null,{"$error":"#NAME?"},{"$f":"IF(INDEX(periode3,NEVAL,Nenfant)=\"\",0,INDEX(periode3,NEVAL,Nenfant))","v":{"$error":"#NAME?"}},{"$f":"IF(INDEX(periode4,NEVAL,Nenfant)=\"\",0,INDEX(periode4,NEVAL,Nenfant))","v":{"$error":"#NAME?"}}]
[208,null,"LES COMPETENCES SOCIALES ET CIVIQUES",null,{"$error":"#NAME?"},{"$f":"IF(INDEX(periode3,NEVAL,Nenfant)=\"\",0,INDEX(periode3,NEVAL,Nenfant))","v":{"$error":"#NAME?"}},{"$f":"IF(INDEX(periode4,NEVAL,Nenfant)=\"\",0,INDEX(periode4,NEVAL,Nenfant))","v":{"$error":"#NAME?"}}]
[209,null,"commencer à s’approprier un environnement numérique.",null,{"$error":"#NAME?"},{"$f":"IF(INDEX(periode3,NEVAL,Nenfant)=\"\",0,INDEX(periode3,NEVAL,Nenfant))","v":{"$error":"#NAME?"}},{"$f":"IF(INDEX(periode4,NEVAL,Nenfant)=\"\",0,INDEX(periode4,NEVAL,Nenfant))","v":{"$error":"#NAME?"}}]
[210,null,"reconnaître les emblèmes et les symboles de la République française "]
[211,null,"respecter les autres et les règles de la vie collective "]
[212,null,"pratiquer un jeu ou un sport collectif en en respectant les règles ",null,{"$error":"#NAME?"},{"$f":"IF(INDEX(periode3,NEVAL,Nenfant)=\"\",0,INDEX(periode3,NEVAL,Nenfant))","v":{"$error":"#NAME?"}},{"$f":"IF(INDEX(periode4,NEVAL,Nenfant)=\"\",0,INDEX(periode4,NEVAL,Nenfant))","v":{"$error":"#NAME?"}}]
[213,null," appliquer les codes de la politesse dans ses relations avec ses camarades, avec les adultes à l’école et hors de l’école, avec le maître au sein de la classe",null,{"$error":"#NAME?"},{"$f":"IF(INDEX(periode3,NEVAL,Nenfant)=\"\",0,INDEX(periode3,NEVAL,Nenfant))","v":{"$error":"#NAME?"}},{"$f":"IF(INDEX(periode4,NEVAL,Nenfant)=\"\",0,INDEX(periode4,NEVAL,Nenfant))","v":{"$error":"#NAME?"}}]
[214,null,"participer en classe à un échange verbal en respectant les règles de la communication ",null,{"$error":"#NAME?"},{"$f":"IF(INDEX(periode3,NEVAL,Nenfant)=\"\",0,INDEX(periode3,NEVAL,Nenfant))","v":{"$error":"#NAME?"}},{"$f":"IF(INDEX(periode4,NEVAL,Nenfant)=\"\",0,INDEX(periode4,NEVAL,Nenfant))","v":{"$error":"#NAME?"}}]
[215,null,"appeler les secours ; aller chercher de l’aide auprès d’un adulte.",null,{"$error":"#NAME?"},{"$f":"IF(INDEX(periode3,NEVAL,Nenfant)=\"\",0,INDEX(periode3,NEVAL,Nenfant))","v":{"$error":"#NAME?"}},{"$f":"IF(INDEX(periode4,NEVAL,Nenfant)=\"\",0,INDEX(periode4,NEVAL,Nenfant))","v":{"$error":"#NAME?"}}]
[216,null,"L'AUTONOMIE ET L'INITIATIVE",null,{"$error":"#NAME?"},{"$f":"IF(INDEX(periode3,NEVAL,Nenfant)=\"\",0,INDEX(periode3,NEVAL,Nenfant))","v":{"$error":"#NAME?"}},{"$f":"IF(INDEX(periode4,NEVAL,Nenfant)=\"\",0,INDEX(periode4,NEVAL,Nenfant))","v":{"$error":"#NAME?"}}]
[217,null,"écouter pour comprendre, interroger, répéter, réaliser un travail ou une activité ",null,{"$error":"#NAME?"},{"$f":"IF(INDEX(periode3,NEVAL,Nenfant)=\"\",0,INDEX(periode3,NEVAL,Nenfant))","v":{"$error":"#NAME?"}},{"$f":"IF(INDEX(periode4,NEVAL,Nenfant)=\"\",0,INDEX(periode4,NEVAL,Nenfant))","v":{"$error":"#NAME?"}}]
[218,null,"échanger, questionner, justifier un point de vue ",null,{"$error":"#NAME?"},{"$f":"IF(INDEX(periode3,NEVAL,Nenfant)=\"\",0,INDEX(periode3,NEVAL,Nenfant))","v":{"$error":"#NAME?"}},{"$f":"IF(INDEX(periode4,NEVAL,Nenfant)=\"\",0,INDEX(periode4,NEVAL,Nenfant))","v":{"$error":"#NAME?"}}]
[219,null,"travailler en groupe, s’engager dans un projet ",null,{"$error":"#NAME?"},{"$f":"IF(INDEX(periode3,NEVAL,Nenfant)=\"\",0,INDEX(periode3,NEVAL,Nenfant))","v":{"$error":"#NAME?"}},{"$f":"IF(INDEX(periode4,NEVAL,Nenfant)=\"\",0,INDEX(periode4,NEVAL,Nenfant))","v":{"$error":"#NAME?"}}]
[220,null,"maîtriser quelques conduites motrices comme courir, sauter, lancer ",null,{"$error":"#NAME?"},{"$f":"IF(INDEX(periode3,NEVAL,Nenfant)=\"\",0,INDEX(periode3,NEVAL,Nenfant))","v":{"$error":"#NAME?"}},{"$f":"IF(INDEX(periode4,NEVAL,Nenfant)=\"\",0,INDEX(periode4,NEVAL,Nenfant))","v":{"$error":"#NAME?"}}]
[221,null,"se représenter son environnement proche, s’y repérer, s’y déplacer de façon adaptée "]
[222,null,"appliquer des règles élémentaires d’hygiène.",null,{"$error":"#NAME?"},{"$f":"IF(INDEX(periode3,NEVAL,Nenfant)=\"\",0,INDEX(periode3,NEVAL,Nenfant))","v":{"$error":"#NAME?"}},{"$f":"IF(INDEX(periode4,NEVAL,Nenfant)=\"\",0,INDEX(periode4,NEVAL,Nenfant))","v":{"$error":"#NAME?"}}]
[]
[null,null,"Appréciations"]
[]
[null,null,"Nombre d'absence",null,{"$f":"absences","v":0}]
[{"$nulls":4},{"$f":"absences","v":0}]
[null,null,"Décision du conseil de cycle",null,{"$f":"passage","v":0}]
[{"$nulls":4},{"$f":"passage","v":0}]
[]
[null,null,"A : acquis   B : à renforcer   C : en cours d'acquisition   D : non acquis   NE : non évalué"]
[null,null,"Signatures"]

{"sheet":"Bulletin","index":6,"n_rows":242,"n_cols":7,"rows_kept":242,"hidden":true,"merged":[[5,2,5,3],[6,2,6,3],[7,2,7,3],[11,2,11,3],[240,2,240,4]]}
[{"$nulls":6},2]
[]
[]
[]
[]
[null,null,{"$f":"CONCATENATE(\"Classe \"&classe)","v":"Classe CM1"},{"$f":"CONCATENATE(\"Ville de \"&ville)","v":"Ville de "}]
[null,null,{"$f":"CONCATENATE(\"Ecole \"&ecole&\" \"  &\"- \" &adresse &\" -   \" &ville)","v":"Ecole Léonard de Vinci -  -   "},{"$f":"CONCATENATE(\"Ville de \"&ville)","v":"Ville de "}]
[null,null,{"$f":"CONCATENATE(\"Enseignant : \"&enseignant)","v":"Enseignant : M. DURANT"},{"$f":"CONCATENATE(\"Ville de \"&ville)","v":"Ville de "}]
[null,null,{"$f":"IF(INDEX(NOMS,Nenfant,1)=\"\",0,INDEX(NOMS,Nenfant,1))","v":"Jérôme  Lenoir"}]
[null,null,{"$f":"IF(E10=\"\",\"\",\"né(e)  le  \" & TEXT(E10,\"jj/mm/aaa\"))","v":"né(e)  le  04/07/1998"},null,{"$f":"IF(INDEX(date,Nenfant,1)=\"\",0,INDEX(date,Nenfant,1))","v":35980}]
[null,null,"BULLETIN PERIODE 1 "]
[null,null,{"$f":"CONCATENATE(\"Année scolaire: \"&annee)","v":"Année scolaire: 2013  2014"}]
[null,null,{"$f":"CONCATENATE(\"Circonscription  \"&IEN)","v":"Circonscription  "}]
[]
[5,null,"LANGAGE ORAL"]
[6,null,"S’exprimer de façon correcte : prononcer les sons et les mots avec exactitude, respecter l’organisation de la phrase, formuler correctement des questions."]
[7,null,"Rapporter clairement un événement ou une information très simple : exprimer les relations de causalité, les circonstances temporelles et spatiales, utiliser de manière adéquate les temps verbaux (présent, futur, imparfait, passé composé)."]
[8,null,"Manifester sa compréhension d’un récit ou d’un texte documentaire lu par un tiers en répondant à des questions le concernant : reformuler le contenu d’un paragraphe ou d’un texte, identifier les personnages principaux d’un récit. "]
[9,null,"Raconter une histoire déjà entendue en s’appuyant sur des illustrations."]
[10,null,"Décrire des images (illustrations, photographies…). "]
[11,null,"Raconter une histoire déjà entendue en s’appuyant sur des illustrations."]
[12,null,"Reformuler une consigne."]
[13,null,"Prendre part à des échanges verbaux tout en sachant écouter les autres ; poser des questions."]
[14,null,"Réciter des comptines ou de courts poèmes (une dizaine) en ménageant des respirations, et sans commettre d’erreur (sans oubli ou substitution).  "]
[15,null,"Faire un récit structuré (relations causales, circonstances temporelles et spatiales précises) et compréhensible pour un tiers ignorant des faits rapportés ou de l’histoire racontée."]
[16,null,"S’exprimer avec précision pour se faire comprendre dans les activités scolaires."]
[17,null,"Présenter à la classe un travail individuel ou collectif."]
[18,null,"Participer à un échange : questionner, apporter des réponses, écouter et donner un point de vue en respectant les règles de la communication."]
[19,null,"Réciter des textes en prose ou des poèmes (une dizaine), en les interprétant par l’intonation"]
[20,null,"LECTURE"]
[21,null,"Connaître le nom des lettres et l’ordre alphabétique."]
[22,null,"Distinguer entre la lettre et le son qu’elle transcrit ; connaître les correspondances entre les lettres et les sons dans les graphies simples (ex. f ; o) et complexes (ex. ph ; au, eau)."]
[23,null,"Savoir qu'une syllabe est composée d'une ou plusieurs graphies, qu'un mot est composé d'une ou plusieurs syllabes ; être capable de repérer ces éléments (graphies, syllabes) dans un mot."]
[24,null,"Connaître les correspondances entre minuscules et majuscules d’imprimerie, minuscules et majuscules cursives."]
[25,null,"Lire aisément les mots étudiés. "]
[26,null,"Déchiffrer des mots réguliers inconnus."]
[27,null,"Lire aisément les mots les plus fréquemment rencontrés (dits mots-outils)."]
[28,null,"Lire à haute voix un texte court dont les mots ont été étudiés, en articulant correctement et en respectant la ponctuation."]
[29,null,"Connaître et utiliser le vocabulaire spécifique de la lecture d’un texte : le livre, la couverture, la page, la ligne ; l’auteur, le titre ; le texte, la phrase, le mot ; le début, la fin, le personnage, l’histoire."]
[30,null,"Dire de qui ou de quoi parle le texte lu ; trouver dans le texte ou son illustration la réponse à des questions concernant le texte lu ; reformuler son sens."]
[31,null,"Ecouter lire des œuvres intégrales, notamment de littérature de jeunesse."]
[32,null,"Lire silencieusement un texte en déchiffrant les mots inconnus et manifester sa compréhension dans un résumé, une reformulation, des réponses à des questions."]
[33,null,"Lire silencieusement un énoncé, une consigne, et comprendre ce qui est attendu."]
[34,null,"Participer à une lecture dialoguée : articulation correcte, fluidité, respect de la ponctuation, intonation appropriée."]
[35,null,"Ecouter et lire des œuvres intégrales courtes ou de larges extraits d’œuvres plus longues."]
[36,null,"Identifier les personnages, les événements et les circonstances temporelles et spatiales d’un récit qu’on a lu."]
[37,null,"Comparer un texte nouvellement entendu ou lu avec un ou des textes connus (thèmes, personnages, événements, fin)."]
[38,null,"Lire ou écouter lire des œuvres intégrales, notamment de littérature de jeunesse et rendre compte de sa lecture."]
[39,null,"ECRITURE"]
[40,null,"Copier un texte très court dans une écriture cursive lisible, sur des lignes, non lettre à lettre mais mot par mot (en prenant appui sur les syllabes qui le composent), en respectant les liaisons entre les lettres, les accents, les espaces entre les mots, les signes de ponctuation, les majuscules."]
[41,null,"Écrire sans erreur, sous la dictée, des syllabes, des mots et de courtes phrases dont les graphies ont été étudiées."]
[42,null,"Choisir et écrire de manière autonome des mots simples en respectant les correspondances entre lettres et sons."]
[43,null,"Concevoir et écrire collectivement avec l’aide du maître une phrase simple cohérente, puis plusieurs. "]
[44,null,"Comparer sa production écrite à un modèle et rectifier ses erreurs."]
[45,null,"Produire un travail écrit soigné ; maîtriser son attitude et son geste pour écrire avec aisance ; prendre soin des outils du travail scolaire. "]
[46,null," Copier un court texte (par mots entiers ou groupes de mots) en respectant l’orthographe, la ponctuation, les majuscules et en soignant la présentation."]
[47,null,"En particulier, copier avec soin, en respectant la mise en page, un texte en prose ou poème appris en récitation ; réaliser un dessin pour l’illustrer."]
[48,null,"Écrire sans erreur, sous la dictée, des phrases ou un court texte (5 lignes), préparés ou non, en utilisant ses connaissances orthographiques et grammaticales, "]
[49,null,"Concevoir et écrire de manière autonome une phrase simple cohérente, puis plusieurs, puis un texte narratif ou explicatif de 5 à 10 lignes."]
[50,null,"Rédiger différents types de textes d’au moins deux paragraphes en veillant à leur cohérence  , en évitant les répétitions, et en respectant les contraintes syntaxiques et orthographiques ainsi que la ponctuation."]
[51,null,"Ecrire un texte de type poétique en obéissant à une ou plusieurs consignes précises."]
[52,null,"VOCABULAIRE"]
[53,null,"Utiliser des mots précis pour s’exprimer"]
[54,null,"Commencer à classer les noms par catégories sémantiques larges (noms de personnes, noms d’animaux, noms de choses) ou plus étroites et se référant au monde concret (ex. : noms de fruits)."]
[55,null,"Trouver un ou des noms appartenant à une catégorie donnée (ex. un nom d’arbre, un nom de commerçant). "]
[56,null,"Trouver un mot de sens opposé pour un adjectif qualificatif ou un verbe d’action. "]
[57,null,"Ranger des mots par ordre alphabétique."]
[58,null,"Donner des synonymes (par exemple pour reformuler le sens d’un texte ou pour améliorer une expression orale ou écrite)."]
[59,null,"Trouver un mot de sens opposé pour un adjectif qualificatif, un verbe d’action ou pour un nom  "]
[60,null,"Regrouper des mots par familles ; trouver un ou des mots d’une famille donnée."]
[61,null,"Commencer à utiliser l’ordre alphabétique pour vérifier dans un dictionnaire l’écriture d’un mot ou en chercher le sens."]
[62,null," GRAMMAIRE"]
[63,null,"La phrase"]
[64,null,"identifier les phrases d’un texte en s’appuyant sur la ponctuation (point et majuscule). "]
[65,null,"approche des formes et types de phrase : savoir transposer oralement une phrase affirmative en phrase négative ou interrogative."]
[66,null,"Les classes de mots"]
[67,null,"reconnaître les noms et les verbes et les distinguer des autres mots "]
[68,null,"distinguer le nom et l’article qui le précède ; identifier l’article "]
[69,null,"approche du pronom : savoir utiliser oralement les pronoms personnels sujets."]
[70,null,"- distinguer selon leur nature : les verbes, les noms, les articles, les pronoms personnels (formes sujet), les adjectifs qualificatifs ;"]
[71,null,"- le nom : distinguer nom propre et nom commun ;"]
[72,null,"- l’article : commencer à repérer les articles élidés (l’) et contractés (du, au, aux) ;"]
[73,null,"- manipuler d’autres déterminants ;"]
[74,null,"- approche de l’adverbe : modifier le sens d’un verbe en ajoutant un adverbe."]
[75,null,"Les fonctions"]
[76,null,"dans la phrase simple où l’ordre syntaxique régulier sujet-verbe est respecté, identifier le verbe et son sujet (sous la forme d’un nom propre, d’un pronom, ou d’un groupe nominal) ;"]
[77,null,"approche de la notion de circonstance : savoir répondre oralement aux questions où ?, quand ?, pourquoi ?, comment ? "]
[78,null,"Les genres et nombres"]
[79,null,"repérer et justifier des marques du genre et du nombre : les du pluriel des noms, le e du féminin de l’adjectif, les terminaisons –nt des verbes du 1er groupe au présent de l’indicatif. "]
[80,null,"connaître et appliquer les notions de masculin/féminin, singulier/pluriel ;"]
[81,null,"connaître et appliquer la règle de l’accord du verbe avec son sujet, et, dans le groupe nominal, la règle de l’accord entre le déterminant et le nom qu’il détermine, entre l’adjectif qualificatif et le nom qu’il qualifie."]
[82,null,"Le verbe"]
[83,null,"utiliser à l’oral, le présent, le futur et le passé composé."]
[84,null,"comprendre la correspondance entre les temps verbaux (passé, présent,   futur) et les notions d’action déjà faite, action en train de se faire, action non encore faite."]
[85,null,"identifier le présent, futur, imparfait et passé composé de l’indicatif des verbes étudiés ; trouver leur infinitif ; "]
[86,null,"conjuguer les verbes du premier groupe, être et avoir, au présent, au futur, au passé composé de l’indicatif ;"]
[87,null,"conjuguer les verbes faire, aller, dire, venir  au présent de l’indicatif.."]
[88,null,"ORTHOGRAPHE"]
[89,null,"Écrire sans erreur des mots appris."]
[90,null,"Ecrire sans erreur de manière autonome des mots simples en respectant les correspondances entre lettres et sons."]
[91,null,"Recopier sans erreur un texte court (2 à 5 lignes)."]
[92,null,"Commencer à utiliser de manière autonome les marques du genre et du nombre (pluriel du nom, féminin de l’adjectif, terminaison –nt des verbes du 1er groupe)."]
[93,null,"Commencer à utiliser correctement la majuscule (débuts de phrase, noms propres de personne). "]
[94,null,"Écrire sans erreur, sous la dictée, des phrases ou un court texte (5 lignes), préparés ou non, en utilisant ses connaissances lexicales, orthographiques et grammaticales. "]
[95,null,"Dans les productions dictées et autonomes :"]
[96,null,"respecter les correspondances entre lettres et sons,"]
[97,null,"en particulier, respecter les règles relatives à la valeur des lettres en fonction des voyelles placées à proximité (c/ç, c/qu, g/gu/ge, s/ss),"]
[98,null,"orthographier sans erreur les mots invariables les plus fréquemment rencontrés ainsi que les mots-outils appris au CP, "]
[99,null,"marquer l’accord entre le sujet et le verbe dans les phrases où l’ordre sujet-verbe est respecté,"]
[100,null,"dans le groupe nominal simple, marquer l’accord de l’adjectif qualificatif avec le nom qu’il qualifie,"]
[101,null,"orthographier sans erreur les formes conjuguées apprises,"]
[102,null,"utiliser à bon escient le point, la majuscule, ainsi que la virgule dans le cas de l’énumération."]
[103,null," NOMBRE ET CALCUL"]
[104,null,"Connaître (savoir écrire et nommer) les nombres entiers naturels inférieurs à 100."]
[105,null,"Produire et reconnaître les décompositions additives des nombres inférieurs à 20 (« table d’addition »)."]
[106,null,"Comparer, ranger, encadrer ces nombres."]
[107,null,"Écrire une suite de nombres dans l’ordre croissant ou décroissant."]
[108,null,"Connaître les doubles des nombres inférieurs à 10 et les moitiés des nombres pairs inférieurs à 20."]
[109,null,"Connaître la table de multiplication par 2."]
[110,null,"Calculer mentalement des sommes et des différences."]
[111,null,"Calculer en ligne des sommes, des différences, des opérations à trous."]
[112,null,"Connaître et utiliser les techniques opératoires de l’addition et commencer à utliser celles de la soustraction (sur les nombres inférieurs à 100)."]
[113,null,"Résoudre des problèmes simples à une opération. "]
[114,null,"Connaître (savoir écrire et nommer) les nombres entiers naturels inférieurs à 1 000."]
[115,null,"Repérer et placer ces nombres sur une droite graduée, les comparer, les ranger, les encadrer."]
[116,null,"Écrire ou dire des suites de nombres de 10 en 10, de 100 en 100, etc."]
[117,null,"Connaître les doubles et moitiés de nombres d’usage courant."]
[118,null,"Mémoriser les tables de multiplication par 2, 3, 4 et 5."]
[119,null,"Connaître et utiliser des procédures de calcul mental pour calculer des sommes, des différences et des produits."]
[120,null,"Calculer en ligne des suites d’opérations."]
[121,null,"Connaître et utiliser les techniques opératoires de l’addition et de la soustraction (sur les nombres inférieurs à 1 000)."]
[122,null,"Connaître une technique opératoire de la multiplication et l’utiliser pour effectuer des multiplications par un nombre à un chiffre."]
[123,null,"Diviser par 2 ou 5 des nombres inférieurs à 100 (quotient exact entier)."]
[124,null,"Résoudre des problèmes relevant de l’addition, de la soustraction et de la multiplication."]
[125,null,"Approcher la division de deux nombres entiers à partir d’un problème de partage ou de groupements."]
[126,null,"Utiliser les fonctions de base de la calculatrice. "]
[127,null,"Problèmes "]
[128]
[129]
[130]
[131,null,"GEOMETRIE"]
[132,null,"Situer un objet et utiliser le vocabulaire permettant de définir des positions (devant, derrière, à gauche de, à droite de…)."]
[133,null,"Reconnaître et nommer un carré, un rectangle, un triangle."]
[134,null,"Reproduire des figures géométriques simples à l’aide d’instruments ou de techniques : règle, quadrillage, papier calque."]
[135,null,"Reconnaître et nommer le cube et le pavé droit."]
[136,null,"S’initier au vocabulaire géométrique."]
[137,null,"Décrire, reproduire, tracer un carré,  un rectangle, un triangle rectangle."]
[138,null,"Utiliser des instruments pour réaliser des tracés : règle, équerre ou gabarit de l’angle droit."]
[139,null,"Percevoir et reconnaître quelques relations et propriétés géométriques : alignement, angle droit, axe de symétrie, égalité de longueurs."]
[140,null,"Repérer des cases, des nœuds d’un quadrillage."]
[141,null,"Connaître et utiliser un vocabulaire géométrique élémentaire approprié."]
[142,null," Reconnaître, décrire, nommer quelques solides  droits : cube, pavé.."]
[143,null," Résoudre des problèmes géométriques"]
[144,null," GRANDEURS ET MESURE"]
[145,null,"Repérer des évènements de la journée en utilisant les heures et les demi heures."]
[146,null,"Comparer et classer des objets selon leur longueur et leur masse."]
[147,null,"Utiliser la règle graduée pour tracer des segments, comparer des longueurs "]
[148,null,"Connaître et utiliser l’euro."]
[149,null,"Résoudre des problèmes de vie courante."]
[150,null," Utiliser un calendrier pour comparer des durées."]
[151,null,"Connaître la relation entre heure et minute, mètre et centimètre, kilomètre et mètre, kilogramme et gramme, euro et centimes d’euro."]
[152,null,"Mesurer des segments, des distances."]
[153,null,"Résoudre des problèmes de longueur et de masse."]
[154,null," ORGANISATION ET GESTION DES DONNEES"]
[155,null,"Lire ou compléter un tableau dans des situations concrètes simples."]
[156,null,"Utiliser un tableau, un graphique."]
[157,null,"Organiser les informations d’un énoncé"]
[158,null,"DECOUVERTE DU MONDE"]
[159,null,"Se répérer dans l'espace et le temps"]
[160,null,"Elaborer des représentations simples de l’espace familier : la classe, l’école, le quartier, le village, la ville. "]
[161,null,"Comparer ces milieux familiers avec d’autres milieux et espaces plus lointains. Ils découvrent des formes usuelles de représentation de l’espace (photographies, cartes, mappemondes, planisphères, globe)."]
[162,null,"Découvrir des formes usuelles de représentation de l’espace (photographies, cartes, mappemondes, planisphères, globe)."]
[163,null,"Repérer l’alternance jour-nuit, les semaines, les mois, les saisons. "]
[164,null,"Utiliser des outils de repérage et de mesure du temps : le calendrier, l’horloge."]
[165,null,"Découvrir le monde du vivant, de la matière et des objets "]
[166,null,"Repérer des caractéristiques du vivant : naissance, croissance et reproduction ; nutrition et régimes alimentaires des animaux."]
[167,null,"Apprendre quelques règles d’hygiène et de sécurité personnelles et collectives."]
[168,null,"Comprendre les interactions entre les êtres vivants et leur environnement "]
[169,null,"Respecter l’environnement."]
[170,null,"Distinguer les solides et les liquides."]
[171,null,"Percevoir les changements d’états de la matière."]
[172,null,"Réaliser des maquettes élémentaires"]
[173,null,"Réaliser des circuits électriques simples pour comprendre le fonctionnement d’un appareil. "]
[174,null,"PRATIQUES ARTISTIQUES ET HISTOIRE DE L'ART"]
[175,null,"Arts visuels"]
[176,null,"Utiliser des techniques traditionnelles : peinture, dessin"]
[177,null,"Utiliser des techniques contemporaines : phto numérique, cinéma, vidéo, infographie"]
[178,null,"Utiliser des procédures simples mais combinées : recouvrement, tracés, montage"]
[179,null,"Savoir travailler autant en surface qu’en volume."]
[180,null,"Savoir utiliser des instruments, des gestes techniques, des médiums et des supports variés."]
[181,null,"Exprimer ce que l’on perçoit."]
[182,null,"Imaginer et évoquer un projet ou une réalisation en utilisant un vocabulaire approprié"]
[183,null,"Éducation musicale"]
[184,null,"Apprendre une dizaine de comptines ou chansons."]
[185,null,"Ecouter des extraits d’oeuvres diverses."]
[186,null,"chanter en portant attention à la justesse tonale, à l’exactitude rythmique, à la puissance de la voix, à la respiration et à l’articulation "]
[187,null,"Apprendre à respecter les exigences d’une expression musicale collective."]
[188,null,"Repérer des éléments musicaux caractéristiques très simples, concernant les thèmes mélodiques, les rythmes et le tempo, les intensités, les timbres"]
[189,null,"commencent à reconnaître les grandes familles d’instruments."]
[190,null,"LVE"]
[191,null," comprendre et utiliser des énoncés simples de la vie quotidienne."]
[192,null,"EDUCATION PHYSIQUE ET SPORTIVE"]
[193,null,"Réaliser une performance mesurée (en distance, en temps)"]
[194,null,"Activités athlétiques : courir vite, longtemps, en franchissant des obstacles, sauter loin et haut, lancer loin."]
[195,null,"Natation : se déplacer sur une quinzaine de mètres."]
[196,null,"Adapter ses déplacements à différents types d’environnement"]
[197,null,"Activités d’escalade : grimper jusqu’à 3 m et redescendre (mur équipé)."]
[198,null,"Activités aquatiques et nautiques : s’immerger, se déplacer sous l’eau, se laisser flotter."]
[199,null,"Activités de roule et glisse : réaliser un parcours simple en roller ou en vélo."]
[200,null,"Activités d’orientation : retrouver quelques balises dans un milieu connu."]
[201,null,"Coopérer ou s’opposer individuellement et collectivement"]
[202,null,"Jeux de lutte : agir sur son adversaire pour l’immobiliser."]
[203,null,"Jeux de raquettes : faire quelques échanges."]
[204,null,"Jeux traditionnels et jeux collectifs avec ou sans ballon : coopérer avec ses partenaires pour affronter collectivement des adversaires, en respectant des règles, en assurant des rôles différents (attaquant, défenseur, arbitre)."]
[205,null,"Concevoir et réaliser des actions à visées expressive, artistique, esthétique"]
[206,null,"Danse : exprimer corporellement des personnages, des images, des sentiments pour communiquer des émotions en réalisant une petite chorégraphie (3 à 5 éléments), sur des supports sonores divers."]
[207,null," Activités gymniques : réaliser un enchaînement de 2 ou 3 actions “acrobatiques” sur des engins variés (barres, plinths, poutres, gros tapis)."]
[208,null,"LES COMPETENCES SOCIALES ET CIVIQUES"]
[209,null,"commencer à s’approprier un environnement numérique."]
[210,null,"reconnaître les emblèmes et les symboles de la République française "]
[211,null,"respecter les autres et les règles de la vie collective "]
[212,null,"pratiquer un jeu ou un sport collectif en en respectant les règles "]
[213,null," appliquer les codes de la politesse dans ses relations avec ses camarades, avec les adultes à l’école et hors de l’école, avec le maître au sein de la classe"]
[214,null,"participer en classe à un échange verbal en respectant les règles de la communication "]
[215,null,"appeler les secours ; aller chercher de l’aide auprès d’un adulte."]
[216,null,"L'AUTONOMIE ET L'INITIATIVE"]
[217,null,"écouter pour comprendre, interroger, répéter, réaliser un travail ou une activité "]
[218,null,"échanger, questionner, justifier un point de vue "]
[219,null,"travailler en groupe, s’engager dans un projet "]
[220,null,"maîtriser quelques conduites motrices comme courir, sauter, lancer "]
[221,null,"se représenter son environnement proche, s’y repérer, s’y déplacer de façon adaptée "]
[222,null,"appliquer des règles élémentaires d’hygiène."]
[]
[null,null,"Appréciations"]
[]
[null,null,"Nombre d'absence",null,{"$f":"absences","v":0}]
[{"$nulls":4},{"$f":"absences","v":0}]
[null,null,"Décision du conseil de cycle",null,{"$f":"passage","v":0}]
[{"$nulls":4},{"$f":"passage","v":0}]
[]
[null,null,"A : acquis   B : à renforcer   C : en cours d'acquisition   D : non acquis   NE : non évalué"]
[null,null,"Signatures"]

{"sheet":"Formules","index":7,"n_rows":800,"n_cols":45,"rows_kept":800,"hidden":true}
["notes",{"$f":"IF(INDEX(periode1,NEVAL,Nenfant)=\"\",0,INDEX(periode1,NEVAL,Nenfant))","v":{"$error":"#NAME?"}},{"$f":"IF(INDEX(periode1,NEVAL,Nenfant)=\"\",0,INDEX(periode1,NEVAL,Nenfant))","v":{"$error":"#NAME?"}},{"$f":"IF(INDEX(periode2,NEVAL,Nenfant)=\"\",0,INDEX(periode2,NEVAL,Nenfant))","v":{"$error":"#NAME?"}},{"$f":"IF(INDEX(periode3,NEVAL,Nenfant)=\"\",0,INDEX(periode3,NEVAL,Nenfant))","v":{"$error":"#NAME?"}},{"$f":"IF(INDEX(periode4,NEVAL,Nenfant)=\"\",0,INDEX(periode4,NEVAL,Nenfant))","v":{"$error":"#NAME?"}},{"$f":"IF(INDEX(periode5,NEVAL,Nenfant)=\"\",0,INDEX(periode5,NEVAL,Nenfant))","v":{"$error":"#NAME?"}},{"$f":"IF(INDEX(periode6,NEVAL,Nenfant)=\"\",0,INDEX(periode6,NEVAL,Nenfant))","v":{"$error":"#NAME?"}},{"$nulls":31},"Compétences"]
["appreciations",null,{"$f":"IF(INDEX(appreciations1,Nenfant,1)=\"\",0,INDEX(appreciations1,Nenfant,1))","v":"appréciation lenoir P1"},{"$f":"IF(INDEX(appreciations2,Nenfant,1)=\"\",0,INDEX(appreciations2,Nenfant,1))","v":"appréciation lenoir P2"},{"$f":"IF(INDEX(appreciations3,Nenfant,1)=\"\",0,INDEX(appreciations3,Nenfant,1))","v":"appréciation lenoir P3"},{"$f":"IF(INDEX(appreciations4,Nenfant,1)=\"\",0,INDEX(appreciations4,Nenfant,1))","v":"appréciation lenoir P4"},{"$f":"IF(INDEX(appreciations5,Nenfant,1)=\"\",0,INDEX(appreciations5,Nenfant,1))","v":"appréciation lenoir P5"}]
["absences",null,{"$f":"IF(INDEX(absences1,Nenfant,1)=\"\",0,INDEX(absences1,Nenfant,1))","v":0},{"$f":"IF(INDEX(absences2,Nenfant,1)=\"\",0,INDEX(absences2,Nenfant,1))","v":0},{"$f":"IF(INDEX(absences3,Nenfant,1)=\"\",0,INDEX(absences3,Nenfant,1))","v":0},{"$f":"IF(INDEX(absences4,Nenfant,1)=\"\",0,INDEX(absences4,Nenfant,1))","v":0},{"$f":"IF(INDEX(absences5,Nenfant,1)=\"\",0,INDEX(absences5,Nenfant,1))","v":0},{"$f":"IF(INDEX(absencesA,Nenfant,1)=\"\",0,INDEX(absencesA,Nenfant,1))","v":0},{"$f":"IF(INDEX(decision,Nenfant,1)=\"\",0,INDEX(decision,Nenfant,1))","v":0}]
[{"$nulls":18},"prog6bf"]
[5,null,"A",1,"A",{"$f":"Renseignements!I20","v":0},{"$nulls":12},{"$f":"IF(COUNTIF(I5:Q5,\"X\"),\"X\",\"\")","v":""},{"$nulls":4},{"$f":"Programmation!I5","v":"x"},{"$f":"Programmation!K5","v":"x"},{"$f":"Programmation!M5","v":0},{"$f":"Programmation!O5","v":0},{"$f":"Programmation!Q5","v":0},{"$f":"Programmation!S5","v":"X"}]
[6,null,"B",2,"AR",{"$f":"Renseignements!J20","v":0},{"$nulls":12},{"$f":"IF(COUNTIF(I6:Q6,\"X\"),\"X\",\"\")","v":""},{"$nulls":4},{"$f":"Programmation!#REF!","v":{"$error":"#REF!"}},{"$f":"ProgrammationJ6","v":{"$error":"#NAME?"}},{"$f":"Programmation!#REF!","v":{"$error":"#REF!"}},{"$f":"Programmation!#REF!","v":{"$error":"#REF!"}},{"$f":"Programmation!#REF!","v":{"$error":"#REF!"}},{"$nulls":11},{"$f":"COUNTIF($D6:$AL6,$AU$1)/$AV$1","v":{"$error":"#DIV/0!"}},{"$f":"COUNTIF($D6:$AL6,$AU$2)/$AV$1","v":{"$error":"#DIV/0!"}},{"$f":"COUNTIF($D6:$AL6,$AU$3)/$AV$1","v":{"$error":"#DIV/0!"}},{"$f":"COUNTIF($D6:$AL6,$AU$4)/$AV$1","v":{"$error":"#DIV/0!"}},{"$f":"COUNTIF(D6:$AL6,\"NE\")/$AV$1","v":{"$error":"#DIV/0!"}},{"$f":"AN6+(AO6*0.66)+(AP6*0.33)","v":{"$error":"#DIV/0!"}}]
[7,null,"C",3,"ECA",{"$f":"Renseignements!K20","v":0},{"$nulls":33},{"$error":"#DIV/0!"},{"$error":"#DIV/0!"},{"$error":"#DIV/0!"},{"$error":"#DIV/0!"},{"$f":"COUNTIF(D7:$AL7,\"NE\")/$AV$1","v":{"$error":"#DIV/0!"}},{"$f":"AN7+(AO7*0.66)+(AP7*0.33)","v":{"$error":"#DIV/0!"}}]
[8,null,"D",4,"NA",{"$f":"Renseignements!L20","v":0},{"$nulls":33},{"$error":"#DIV/0!"},{"$error":"#DIV/0!"},{"$error":"#DIV/0!"},{"$error":"#DIV/0!"},{"$f":"COUNTIF(D8:$AL8,\"NE\")/$AV$1","v":{"$error":"#DIV/0!"}},{"$error":"#DIV/0!"}]
[9,null,"NE","NE","NE",{"$f":"Renseignements!M20","v":"NE"},{"$nulls":33},{"$error":"#DIV/0!"},{"$error":"#DIV/0!"},{"$error":"#DIV/0!"},{"$error":"#DIV/0!"},{"$f":"COUNTIF(D9:$AL9,\"NE\")/$AV$1","v":{"$error":"#DIV/0!"}},{"$error":"#DIV/0!"}]
[10,{"$nulls":38},{"$error":"#DIV/0!"},{"$error":"#DIV/0!"},{"$error":"#DIV/0!"},{"$error":"#DIV/0!"},{"$f":"COUNTIF(D10:$AL10,\"NE\")/$AV$1","v":{"$error":"#DIV/0!"}},{"$error":"#DIV/0!"}]
[11,{"$nulls":4},{"$f":"CONCATENATE(F5,\": acquis\",\"  \",F6,\": à renforcer\",\"  \",\"\",F7,\": en cours d'acquisition\",\"  \",F8,\": non acquis\",\"  NE: non évalué\")","v":"0: acquis  0: à renforcer  0: en cours d'acquisition  0: non acquis  NE: non évalué"},{"$nulls":33},{"$error":"#DIV/0!"},{"$error":"#DIV/0!"},{"$error":"#DIV/0!"},{"$error":"#DIV/0!"},{"$f":"COUNTIF(D11:$AL11,\"NE\")/$AV$1","v":{"$error":"#DIV/0!"}},{"$error":"#DIV/0!"}]
[12,{"$nulls":38},{"$error":"#DIV/0!"},{"$error":"#DIV/0!"},{"$error":"#DIV/0!"},{"$error":"#DIV/0!"},{"$f":"COUNTIF(D12:$AL12,\"NE\")/$AV$1","v":{"$error":"#DIV/0!"}},{"$error":"#DIV/0!"}]
[13,{"$nulls":38},{"$error":"#DIV/0!"},{"$error":"#DIV/0!"},{"$error":"#DIV/0!"},{"$error":"#DIV/0!"},{"$f":"COUNTIF(D13:$AL13,\"NE\")/$AV$1","v":{"$error":"#DIV/0!"}},{"$error":"#DIV/0!"}]
[14,{"$nulls":3},{"$f":"IF(G14<>0,G14,(IF(F14<>0,F14,0)))","v":0},{"$nulls":34},{"$error":"#DIV/0!"},{"$error":"#DIV/0!"},{"$error":"#DIV/0!"},{"$error":"#DIV/0!"},{"$f":"COUNTIF(D14:$AL14,\"NE\")/$AV$1","v":{"$error":"#DIV/0!"}},{"$error":"#DIV/0!"}]
[15,{"$nulls":38},{"$error":"#DIV/0!"},{"$error":"#DIV/0!"},{"$error":"#DIV/0!"},{"$error":"#DIV/0!"},{"$f":"COUNTIF(D15:$AL15,\"NE\")/$AV$1","v":{"$error":"#DIV/0!"}},{"$error":"#DIV/0!"}]
[16,{"$nulls":38},{"$error":"#DIV/0!"},{"$error":"#DIV/0!"},{"$error":"#DIV/0!"},{"$error":"#DIV/0!"},{"$f":"COUNTIF(D16:$AL16,\"NE\")/$AV$1","v":{"$error":"#DIV/0!"}},{"$error":"#DIV/0!"}]
[17,{"$nulls":38},{"$error":"#DIV/0!"},{"$error":"#DIV/0!"},{"$error":"#DIV/0!"},{"$error":"#DIV/0!"},{"$f":"COUNTIF(D17:$AL17,\"NE\")/$AV$1","v":{"$error":"#DIV/0!"}},{"$error":"#DIV/0!"}]
[18,{"$nulls":38},{"$error":"#DIV/0!"},{"$error":"#DIV/0!"},{"$error":"#DIV/0!"},{"$error":"#DIV/0!"},{"$f":"COUNTIF(D18:$AL18,\"NE\")/$AV$1","v":{"$error":"#DIV/0!"}},{"$error":"#DIV/0!"}]
[19,{"$nulls":38},{"$error":"#DIV/0!"},{"$error":"#DIV/0!"},{"$error":"#DIV/0!"},{"$error":"#DIV/0!"},{"$f":"COUNTIF(D19:$AL19,\"NE\")/$AV$1","v":{"$error":"#DIV/0!"}},{"$error":"#DIV/0!"}]
[20,{"$nulls":38},{"$error":"#DIV/0!"},{"$error":"#DIV/0!"},{"$error":"#DIV/0!"},{"$error":"#DIV/0!"},{"$f":"COUNTIF(D20:$AL20,\"NE\")/$AV$1","v":{"$error":"#DIV/0!"}},{"$error":"#DIV/0!"}]
[21,{"$nulls":38},{"$error":"#DIV/0!"},{"$error":"#DIV/0!"},{"$error":"#DIV/0!"},{"$error":"#DIV/0!"},{"$f":"COUNTIF(D21:$AL21,\"NE\")/$AV$1","v":{"$error":"#DIV/0!"}},{"$error":"#DIV/0!"}]
[22,{"$nulls":38},{"$error":"#DIV/0!"},{"$error":"#DIV/0!"},{"$error":"#DIV/0!"},{"$error":"#DIV/0!"},{"$f":"COUNTIF(D22:$AL22,\"NE\")/$AV$1","v":{"$error":"#DIV/0!"}},{"$error":"#DIV/0!"}]
[23,{"$nulls":38},{"$error":"#DIV/0!"},{"$error":"#DIV/0!"},{"$error":"#DIV/0!"},{"$error":"#DIV/0!"},{"$f":"COUNTIF(D23:$AL23,\"NE\")/$AV$1","v":{"$error":"#DIV/0!"}},{"$error":"#DIV/0!"}]
[24,{"$nulls":38},{"$error":"#DIV/0!"},{"$error":"#DIV/0!"},{"$error":"#DIV/0!"},{"$error":"#DIV/0!"},{"$f":"COUNTIF(D24:$AL24,\"NE\")/$AV$1","v":{"$error":"#DIV/0!"}},{"$error":"#DIV/0!"}]
[25,{"$nulls":38},{"$error":"#DIV/0!"},{"$error":"#DIV/0!"},{"$error":"#DIV/0!"},{"$error":"#DIV/0!"},{"$f":"COUNTIF(D25:$AL25,\"NE\")/$AV$1","v":{"$error":"#DIV/0!"}},{"$error":"#DIV/0!"}]
[26,{"$nulls":38},{"$error":"#DIV/0!"},{"$error":"#DIV/0!"},{"$error":"#DIV/0!"},{"$error":"#DIV/0!"},{"$f":"COUNTIF(D26:$AL26,\"NE\")/$AV$1","v":{"$error":"#DIV/0!"}},{"$error":"#DIV/0!"}]
[27,{"$nulls":38},{"$error":"#DIV/0!"},{"$error":"#DIV/0!"},{"$error":"#DIV/0!"},{"$error":"#DIV/0!"},{"$f":"COUNTIF(D27:$AL27,\"NE\")/$AV$1","v":{"$error":"#DIV/0!"}},{"$error":"#DIV/0!"}]
[28,{"$nulls":38},{"$error":"#DIV/0!"},{"$error":"#DIV/0!"},{"$error":"#DIV/0!"},{"$error":"#DIV/0!"},{"$f":"COUNTIF(D28:$AL28,\"NE\")/$AV$1","v":{"$error":"#DIV/0!"}},{"$error":"#DIV/0!"}]
[29,{"$nulls":38},{"$error":"#DIV/0!"},{"$error":"#DIV/0!"},{"$error":"#DIV/0!"},{"$error":"#DIV/0!"},{"$f":"COUNTIF(D29:$AL29,\"NE\")/$AV$1","v":{"$error":"#DIV/0!"}},{"$error":"#DIV/0!"}]
[30,{"$nulls":38},{"$error":"#DIV/0!"},{"$error":"#DIV/0!"},{"$error":"#DIV/0!"},{"$error":"#DIV/0!"},{"$f":"COUNTIF(D30:$AL30,\"NE\")/$AV$1","v":{"$error":"#DIV/0!"}},{"$error":"#DIV/0!"}]
[{"$f":"A30+1","v":31},{"$nulls":38},{"$error":"#DIV/0!"},{"$error":"#DIV/0!"},{"$error":"#DIV/0!"},{"$error":"#DIV/0!"},{"$f":"COUNTIF(D31:$AL31,\"NE\")/$AV$1","v":{"$error":"#DIV/0!"}},{"$error":"#DIV/0!"}]
[32,{"$nulls":38},{"$error":"#DIV/0!"},{"$error":"#DIV/0!"},{"$error":"#DIV/0!"},{"$error":"#DIV/0!"},{"$f":"COUNTIF(D32:$AL32,\"NE\")/$AV$1","v":{"$error":"#DIV/0!"}},{"$error":"#DIV/0!"}]
[33,{"$nulls":38},{"$error":"#DIV/0!"},{"$error":"#DIV/0!"},{"$error":"#DIV/0!"},{"$error":"#DIV/0!"},{"$f":"COUNTIF(D33:$AL33,\"NE\")/$AV$1","v":{"$error":"#DIV/0!"}},{"$error":"#DIV/0!"}]
[34,{"$nulls":38},{"$error":"#DIV/0!"},{"$error":"#DIV/0!"},{"$error":"#DIV/0!"},{"$error":"#DIV/0!"},{"$f":"COUNTIF(D34:$AL34,\"NE\")/$AV$1","v":{"$error":"#DIV/0!"}},{"$error":"#DIV/0!"}]
[35,{"$nulls":38},{"$error":"#DIV/0!"},{"$error":"#DIV/0!"},{"$error":"#DIV/0!"},{"$error":"#DIV/0!"},{"$f":"COUNTIF(D35:$AL35,\"NE\")/$AV$1","v":{"$error":"#DIV/0!"}},{"$error":"#DIV/0!"}]
[36,{"$nulls":38},{"$error":"#DIV/0!"},{"$error":"#DIV/0!"},{"$error":"#DIV/0!"},{"$error":"#DIV/0!"},{"$f":"COUNTIF(D36:$AL36,\"NE\")/$AV$1","v":{"$error":"#DIV/0!"}},{"$error":"#DIV/0!"}]
[37,{"$nulls":38},{"$error":"#DIV/0!"},{"$error":"#DIV/0!"},{"$error":"#DIV/0!"},{"$error":"#DIV/0!"},{"$f":"COUNTIF(D37:$AL37,\"NE\")/$AV$1","v":{"$error":"#DIV/0!"}},{"$error":"#DIV/0!"}]
[38,{"$nulls":38},{"$error":"#DIV/0!"},{"$error":"#DIV/0!"},{"$error":"#DIV/0!"},{"$error":"#DIV/0!"},{"$f":"COUNTIF(D38:$AL38,\"NE\")/$AV$1","v":{"$error":"#DIV/0!"}},{"$error":"#DIV/0!"}]
[39,{"$nulls":38},{"$error":"#DIV/0!"},{"$error":"#DIV/0!"},{"$error":"#DIV/0!"},{"$error":"#DIV/0!"},{"$f":"COUNTIF(D39:$AL39,\"NE\")/$AV$1","v":{"$error":"#DIV/0!"}},{"$error":"#DIV/0!"}]
[40,{"$nulls":38},{"$error":"#DIV/0!"},{"$error":"#DIV/0!"},{"$error":"#DIV/0!"},{"$error":"#DIV/0!"},{"$f":"COUNTIF(D40:$AL40,\"NE\")/$AV$1","v":{"$error":"#DIV/0!"}},{"$error":"#DIV/0!"}]
[41,{"$nulls":38},{"$error":"#DIV/0!"},{"$error":"#DIV/0!"},{"$error":"#DIV/0!"},{"$error":"#DIV/0!"},{"$f":"COUNTIF(D41:$AL41,\"NE\")/$AV$1","v":{"$error":"#DIV/0!"}},{"$error":"#DIV/0!"}]
[42,{"$nulls":38},{"$error":"#DIV/0!"},{"$error":"#DIV/0!"},{"$error":"#DIV/0!"},{"$error":"#DIV/0!"},{"$f":"COUNTIF(D42:$AL42,\"NE\")/$AV$1","v":{"$error":"#DIV/0!"}},{"$error":"#DIV/0!"}]
[43,{"$nulls":38},{"$error":"#DIV/0!"},{"$error":"#DIV/0!"},{"$error":"#DIV/0!"},{"$error":"#DIV/0!"},{"$f":"COUNTIF(D43:$AL43,\"NE\")/$AV$1","v":{"$error":"#DIV/0!"}},{"$error":"#DIV/0!"}]
[44,{"$nulls":38},{"$error":"#DIV/0!"},{"$error":"#DIV/0!"},{"$error":"#DIV/0!"},{"$error":"#DIV/0!"},{"$f":"COUNTIF(D44:$AL44,\"NE\")/$AV$1","v":{"$error":"#DIV/0!"}},{"$error":"#DIV/0!"}]
[45,{"$nulls":38},{"$error":"#DIV/0!"},{"$error":"#DIV/0!"},{"$error":"#DIV/0!"},{"$error":"#DIV/0!"},{"$f":"COUNTIF(D45:$AL45,\"NE\")/$AV$1","v":{"$error":"#DIV/0!"}},{"$error":"#DIV/0!"}]
[46,{"$nulls":38},{"$error":"#DIV/0!"},{"$error":"#DIV/0!"},{"$error":"#DIV/0!"},{"$error":"#DIV/0!"},{"$f":"COUNTIF(D46:$AL46,\"NE\")/$AV$1","v":{"$error":"#DIV/0!"}},{"$error":"#DIV/0!"}]
[47,{"$nulls":38},{"$error":"#DIV/0!"},{"$error":"#DIV/0!"},{"$error":"#DIV/0!"},{"$error":"#DIV/0!"},{"$f":"COUNTIF(D47:$AL47,\"NE\")/$AV$1","v":{"$error":"#DIV/0!"}},{"$error":"#DIV/0!"}]
[48,{"$nulls":38},{"$error":"#DIV/0!"},{"$error":"#DIV/0!"},{"$error":"#DIV/0!"},{"$error":"#DIV/0!"},{"$f":"COUNTIF(D48:$AL48,\"NE\")/$AV$1","v":{"$error":"#DIV/0!"}},{"$error":"#DIV/0!"}]
[49,{"$nulls":38},{"$error":"#DIV/0!"},{"$error":"#DIV/0!"},{"$error":"#DIV/0!"},{"$error":"#DIV/0!"},{"$f":"COUNTIF(D49:$AL49,\"NE\")/$AV$1","v":{"$error":"#DIV/0!"}},{"$error":"#DIV/0!"}]
[50,{"$nulls":38},{"$error":"#DIV/0!"},{"$error":"#DIV/0!"},{"$error":"#DIV/0!"},{"$error":"#DIV/0!"},{"$f":"COUNTIF(D50:$AL50,\"NE\")/$AV$1","v":{"$error":"#DIV/0!"}},{"$error":"#DIV/0!"}]
[51,{"$nulls":38},{"$error":"#DIV/0!"},{"$error":"#DIV/0!"},{"$error":"#DIV/0!"},{"$error":"#DIV/0!"},{"$f":"COUNTIF(D51:$AL51,\"NE\")/$AV$1","v":{"$error":"#DIV/0!"}},{"$error":"#DIV/0!"}]
[52,{"$nulls":38},{"$error":"#DIV/0!"},{"$error":"#DIV/0!"},{"$error":"#DIV/0!"},{"$error":"#DIV/0!"},{"$f":"COUNTIF(D52:$AL52,\"NE\")/$AV$1","v":{"$error":"#DIV/0!"}},{"$error":"#DIV/0!"}]
[53,{"$nulls":38},{"$error":"#DIV/0!"},{"$error":"#DIV/0!"},{"$error":"#DIV/0!"},{"$error":"#DIV/0!"},{"$f":"COUNTIF(D53:$AL53,\"NE\")/$AV$1","v":{"$error":"#DIV/0!"}},{"$error":"#DIV/0!"}]
[54,{"$nulls":38},{"$error":"#DIV/0!"},{"$error":"#DIV/0!"},{"$error":"#DIV/0!"},{"$error":"#DIV/0!"},{"$f":"COUNTIF(D54:$AL54,\"NE\")/$AV$1","v":{"$error":"#DIV/0!"}},{"$error":"#DIV/0!"}]
[55,{"$nulls":38},{"$error":"#DIV/0!"},{"$error":"#DIV/0!"},{"$error":"#DIV/0!"},{"$error":"#DIV/0!"},{"$f":"COUNTIF(D55:$AL55,\"NE\")/$AV$1","v":{"$error":"#DIV/0!"}},{"$error":"#DIV/0!"}]
[56,{"$nulls":38},{"$error":"#DIV/0!"},{"$error":"#DIV/0!"},{"$error":"#DIV/0!"},{"$error":"#DIV/0!"},{"$f":"COUNTIF(D56:$AL56,\"NE\")/$AV$1","v":{"$error":"#DIV/0!"}},{"$error":"#DIV/0!"}]
[57,{"$nulls":38},{"$error":"#DIV/0!"},{"$error":"#DIV/0!"},{"$error":"#DIV/0!"},{"$error":"#DIV/0!"},{"$f":"COUNTIF(D57:$AL57,\"NE\")/$AV$1","v":{"$error":"#DIV/0!"}},{"$error":"#DIV/0!"}]
[58,{"$nulls":38},{"$error":"#DIV/0!"},{"$error":"#DIV/0!"},{"$error":"#DIV/0!"},{"$error":"#DIV/0!"},{"$f":"COUNTIF(D58:$AL58,\"NE\")/$AV$1","v":{"$error":"#DIV/0!"}},{"$error":"#DIV/0!"}]
[59,{"$nulls":38},{"$error":"#DIV/0!"},{"$error":"#DIV/0!"},{"$error":"#DIV/0!"},{"$error":"#DIV/0!"},{"$f":"COUNTIF(D59:$AL59,\"NE\")/$AV$1","v":{"$error":"#DIV/0!"}},{"$error":"#DIV/0!"}]
[60,{"$nulls":38},{"$error":"#DIV/0!"},{"$error":"#DIV/0!"},{"$error":"#DIV/0!"},{"$error":"#DIV/0!"},{"$f":"COUNTIF(D60:$AL60,\"NE\")/$AV$1","v":{"$error":"#DIV/0!"}},{"$error":"#DIV/0!"}]
[61,{"$nulls":38},{"$error":"#DIV/0!"},{"$error":"#DIV/0!"},{"$error":"#DIV/0!"},{"$error":"#DIV/0!"},{"$f":"COUNTIF(D61:$AL61,\"NE\")/$AV$1","v":{"$error":"#DIV/0!"}},{"$error":"#DIV/0!"}]
[62,{"$nulls":38},{"$error":"#DIV/0!"},{"$error":"#DIV/0!"},{"$error":"#DIV/0!"},{"$error":"#DIV/0!"},{"$f":"COUNTIF(D62:$AL62,\"NE\")/$AV$1","v":{"$error":"#DIV/0!"}},{"$error":"#DIV/0!"}]
[63,{"$nulls":38},{"$error":"#DIV/0!"},{"$error":"#DIV/0!"},{"$error":"#DIV/0!"},{"$error":"#DIV/0!"},{"$f":"COUNTIF(D63:$AL63,\"NE\")/$AV$1","v":{"$error":"#DIV/0!"}},{"$error":"#DIV/0!"}]
[64,{"$nulls":38},{"$error":"#DIV/0!"},{"$error":"#DIV/0!"},{"$error":"#DIV/0!"},{"$error":"#DIV/0!"},{"$f":"COUNTIF(D64:$AL64,\"NE\")/$AV$1","v":{"$error":"#DIV/0!"}},{"$error":"#DIV/0!"}]
[65,{"$nulls":38},{"$error":"#DIV/0!"},{"$error":"#DIV/0!"},{"$error":"#DIV/0!"},{"$error":"#DIV/0!"},{"$f":"COUNTIF(D65:$AL65,\"NE\")/$AV$1","v":{"$error":"#DIV/0!"}},{"$error":"#DIV/0!"}]
[66,{"$nulls":38},{"$error":"#DIV/0!"},{"$error":"#DIV/0!"},{"$error":"#DIV/0!"},{"$error":"#DIV/0!"},{"$f":"COUNTIF(D66:$AL66,\"NE\")/$AV$1","v":{"$error":"#DIV/0!"}},{"$error":"#DIV/0!"}]
[67,{"$nulls":38},{"$error":"#DIV/0!"},{"$error":"#DIV/0!"},{"$error":"#DIV/0!"},{"$error":"#DIV/0!"},{"$f":"COUNTIF(D67:$AL67,\"NE\")/$AV$1","v":{"$error":"#DIV/0!"}},{"$error":"#DIV/0!"}]
[68,{"$nulls":38},{"$error":"#DIV/0!"},{"$error":"#DIV/0!"},{"$error":"#DIV/0!"},{"$error":"#DIV/0!"},{"$f":"COUNTIF(D68:$AL68,\"NE\")/$AV$1","v":{"$error":"#DIV/0!"}},{"$error":"#DIV/0!"}]
[69,{"$nulls":38},{"$error":"#DIV/0!"},{"$error":"#DIV/0!"},{"$error":"#DIV/0!"},{"$error":"#DIV/0!"},{"$f":"COUNTIF(D69:$AL69,\"NE\")/$AV$1","v":{"$error":"#DIV/0!"}},{"$error":"#DIV/0!"}]
[70,{"$nulls":38},{"$f":"COUNTIF($D70:$AL70,$AU$1)/$AV$1","v":{"$error":"#DIV/0!"}},{"$f":"COUNTIF($D70:$AL70,$AU$2)/$AV$1","v":{"$error":"#DIV/0!"}},{"$f":"COUNTIF($D70:$AL70,$AU$3)/$AV$1","v":{"$error":"#DIV/0!"}},{"$f":"COUNTIF($D70:$AL70,$AU$4)/$AV$1","v":{"$error":"#DIV/0!"}},{"$f":"COUNTIF(D70:$AL70,\"NE\")/$AV$1","v":{"$error":"#DIV/0!"}},{"$error":"#DIV/0!"}]
[71,{"$nulls":38},{"$error":"#DIV/0!"},{"$error":"#DIV/0!"},{"$error":"#DIV/0!"},{"$error":"#DIV/0!"},{"$f":"COUNTIF(D71:$AL71,\"NE\")/$AV$1","v":{"$error":"#DIV/0!"}},{"$f":"AN71+(AO71*0.66)+(AP71*0.33)","v":{"$error":"#DIV/0!"}}]
[72,{"$nulls":38},{"$error":"#DIV/0!"},{"$error":"#DIV/0!"},{"$error":"#DIV/0!"},{"$error":"#DIV/0!"},{"$f":"COUNTIF(D72:$AL72,\"NE\")/$AV$1","v":{"$error":"#DIV/0!"}},{"$error":"#DIV/0!"}]
[73,{"$nulls":38},{"$error":"#DIV/0!"},{"$error":"#DIV/0!"},{"$error":"#DIV/0!"},{"$error":"#DIV/0!"},{"$f":"COUNTIF(D73:$AL73,\"NE\")/$AV$1","v":{"$error":"#DIV/0!"}},{"$error":"#DIV/0!"}]
[74,{"$nulls":38},{"$error":"#DIV/0!"},{"$error":"#DIV/0!"},{"$error":"#DIV/0!"},{"$error":"#DIV/0!"},{"$f":"COUNTIF(D74:$AL74,\"NE\")/$AV$1","v":{"$error":"#DIV/0!"}},{"$error":"#DIV/0!"}]
[75,{"$nulls":38},{"$error":"#DIV/0!"},{"$error":"#DIV/0!"},{"$error":"#DIV/0!"},{"$error":"#DIV/0!"},{"$f":"COUNTIF(D75:$AL75,\"NE\")/$AV$1","v":{"$error":"#DIV/0!"}},{"$error":"#DIV/0!"}]
[76,{"$nulls":38},{"$error":"#DIV/0!"},{"$error":"#DIV/0!"},{"$error":"#DIV/0!"},{"$error":"#DIV/0!"},{"$f":"COUNTIF(D76:$AL76,\"NE\")/$AV$1","v":{"$error":"#DIV/0!"}},{"$error":"#DIV/0!"}]
[77,{"$nulls":38},{"$error":"#DIV/0!"},{"$error":"#DIV/0!"},{"$error":"#DIV/0!"},{"$error":"#DIV/0!"},{"$f":"COUNTIF(D77:$AL77,\"NE\")/$AV$1","v":{"$error":"#DIV/0!"}},{"$error":"#DIV/0!"}]
[78,{"$nulls":38},{"$error":"#DIV/0!"},{"$error":"#DIV/0!"},{"$error":"#DIV/0!"},{"$error":"#DIV/0!"},{"$f":"COUNTIF(D78:$AL78,\"NE\")/$AV$1","v":{"$error":"#DIV/0!"}},{"$error":"#DIV/0!"}]
[79,{"$nulls":38},{"$error":"#DIV/0!"},{"$error":"#DIV/0!"},{"$error":"#DIV/0!"},{"$error":"#DIV/0!"},{"$f":"COUNTIF(D79:$AL79,\"NE\")/$AV$1","v":{"$error":"#DIV/0!"}},{"$error":"#DIV/0!"}]
[80,{"$nulls":38},{"$error":"#DIV/0!"},{"$error":"#DIV/0!"},{"$error":"#DIV/0!"},{"$error":"#DIV/0!"},{"$f":"COUNTIF(D80:$AL80,\"NE\")/$AV$1","v":{"$error":"#DIV/0!"}},{"$error":"#DIV/0!"}]
[81,{"$nulls":38},{"$error":"#DIV/0!"},{"$error":"#DIV/0!"},{"$error":"#DIV/0!"},{"$error":"#DIV/0!"},{"$f":"COUNTIF(D81:$AL81,\"NE\")/$AV$1","v":{"$error":"#DIV/0!"}},{"$error":"#DIV/0!"}]
[82,{"$nulls":38},{"$error":"#DIV/0!"},{"$error":"#DIV/0!"},{"$error":"#DIV/0!"},{"$error":"#DIV/0!"},{"$f":"COUNTIF(D82:$AL82,\"NE\")/$AV$1","v":{"$error":"#DIV/0!"}},{"$error":"#DIV/0!"}]
[83,{"$nulls":38},{"$error":"#DIV/0!"},{"$error":"#DIV/0!"},{"$error":"#DIV/0!"},{"$error":"#DIV/0!"},{"$f":"COUNTIF(D83:$AL83,\"NE\")/$AV$1","v":{"$error":"#DIV/0!"}},{"$error":"#DIV/0!"}]
[84,{"$nulls":38},{"$error":"#DIV/0!"},{"$error":"#DIV/0!"},{"$error":"#DIV/0!"},{"$error":"#DIV/0!"},{"$f":"COUNTIF(D84:$AL84,\"NE\")/$AV$1","v":{"$error":"#DIV/0!"}},{"$error":"#DIV/0!"}]
[85,{"$nulls":38},{"$error":"#DIV/0!"},{"$error":"#DIV/0!"},{"$error":"#DIV/0!"},{"$error":"#DIV/0!"},{"$f":"COUNTIF(D85:$AL85,\"NE\")/$AV$1","v":{"$error":"#DIV/0!"}},{"$error":"#DIV/0!"}]
[86,{"$nulls":38},{"$error":"#DIV/0!"},{"$error":"#DIV/0!"},{"$error":"#DIV/0!"},{"$error":"#DIV/0!"},{"$f":"COUNTIF(D86:$AL86,\"NE\")/$AV$1","v":{"$error":"#DIV/0!"}},{"$error":"#DIV/0!"}]
[87,{"$nulls":38},{"$error":"#DIV/0!"},{"$error":"#DIV/0!"},{"$error":"#DIV/0!"},{"$error":"#DIV/0!"},{"$f":"COUNTIF(D87:$AL87,\"NE\")/$AV$1","v":{"$error":"#DIV/0!"}},{"$error":"#DIV/0!"}]
[88,{"$nulls":38},{"$error":"#DIV/0!"},{"$error":"#DIV/0!"},{"$error":"#DIV/0!"},{"$error":"#DIV/0!"},{"$f":"COUNTIF(D88:$AL88,\"NE\")/$AV$1","v":{"$error":"#DIV/0!"}},{"$error":"#DIV/0!"}]
[89,{"$nulls":38},{"$error":"#DIV/0!"},{"$error":"#DIV/0!"},{"$error":"#DIV/0!"},{"$error":"#DIV/0!"},{"$f":"COUNTIF(D89:$AL89,\"NE\")/$AV$1","v":{"$error":"#DIV/0!"}},{"$error":"#DIV/0!"}]
[90,{"$nulls":38},{"$error":"#DIV/0!"},{"$error":"#DIV/0!"},{"$error":"#DIV/0!"},{"$error":"#DIV/0!"},{"$f":"COUNTIF(D90:$AL90,\"NE\")/$AV$1","v":{"$error":"#DIV/0!"}},{"$error":"#DIV/0!"}]
[91,{"$nulls":38},{"$error":"#DIV/0!"},{"$error":"#DIV/0!"},{"$error":"#DIV/0!"},{"$error":"#DIV/0!"},{"$f":"COUNTIF(D91:$AL91,\"NE\")/$AV$1","v":{"$error":"#DIV/0!"}},{"$error":"#DIV/0!"}]
[92,{"$nulls":38},{"$error":"#DIV/0!"},{"$error":"#DIV/0!"},{"$error":"#DIV/0!"},{"$error":"#DIV/0!"},{"$f":"COUNTIF(D92:$AL92,\"NE\")/$AV$1","v":{"$error":"#DIV/0!"}},{"$error":"#DIV/0!"}]
[93,{"$nulls":38},{"$error":"#DIV/0!"},{"$error":"#DIV/0!"},{"$error":"#DIV/0!"},{"$error":"#DIV/0!"},{"$f":"COUNTIF(D93:$AL93,\"NE\")/$AV$1","v":{"$error":"#DIV/0!"}},{"$error":"#DIV/0!"}]
[94,{"$nulls":38},{"$error":"#DIV/0!"},{"$error":"#DIV/0!"},{"$error":"#DIV/0!"},{"$error":"#DIV/0!"},{"$f":"COUNTIF(D94:$AL94,\"NE\")/$AV$1","v":{"$error":"#DIV/0!"}},{"$error":"#DIV/0!"}]
[95,{"$nulls":38},{"$error":"#DIV/0!"},{"$error":"#DIV/0!"},{"$error":"#DIV/0!"},{"$error":"#DIV/0!"},{"$f":"COUNTIF(D95:$AL95,\"NE\")/$AV$1","v":{"$error":"#DIV/0!"}},{"$error":"#DIV/0!"}]
[96,{"$nulls":38},{"$error":"#DIV/0!"},{"$error":"#DIV/0!"},{"$error":"#DIV/0!"},{"$error":"#DIV/0!"},{"$f":"COUNTIF(D96:$AL96,\"NE\")/$AV$1","v":{"$error":"#DIV/0!"}},{"$error":"#DIV/0!"}]
[97,{"$nulls":38},{"$error":"#DIV/0!"},{"$error":"#DIV/0!"},{"$error":"#DIV/0!"},{"$error":"#DIV/0!"},{"$f":"COUNTIF(D97:$AL97,\"NE\")/$AV$1","v":{"$error":"#DIV/0!"}},{"$error":"#DIV/0!"}]
[98,{"$nulls":38},{"$error":"#DIV/0!"},{"$error":"#DIV/0!"},{"$error":"#DIV/0!"},{"$error":"#DIV/0!"},{"$f":"COUNTIF(D98:$AL98,\"NE\")/$AV$1","v":{"$error":"#DIV/0!"}},{"$error":"#DIV/0!"}]
[99,{"$nulls":38},{"$error":"#DIV/0!"},{"$error":"#DIV/0!"},{"$error":"#DIV/0!"},{"$error":"#DIV/0!"},{"$f":"COUNTIF(D99:$AL99,\"NE\")/$AV$1","v":{"$error":"#DIV/0!"}},{"$error":"#DIV/0!"}]
[100,{"$nulls":38},{"$error":"#DIV/0!"},{"$error":"#DIV/0!"},{"$error":"#DIV/0!"},{"$error":"#DIV/0!"},{"$f":"COUNTIF(D100:$AL100,\"NE\")/$AV$1","v":{"$error":"#DIV/0!"}},{"$error":"#DIV/0!"}]
[101,{"$nulls":38},{"$error":"#DIV/0!"},{"$error":"#DIV/0!"},{"$error":"#DIV/0!"},{"$error":"#DIV/0!"},{"$f":"COUNTIF(D101:$AL101,\"NE\")/$AV$1","v":{"$error":"#DIV/0!"}},{"$error":"#DIV/0!"}]
[102,{"$nulls":38},{"$error":"#DIV/0!"},{"$error":"#DIV/0!"},{"$error":"#DIV/0!"},{"$error":"#DIV/0!"},{"$f":"COUNTIF(D102:$AL102,\"NE\")/$AV$1","v":{"$error":"#DIV/0!"}},{"$error":"#DIV/0!"}]
[103,{"$nulls":38},{"$error":"#DIV/0!"},{"$error":"#DIV/0!"},{"$error":"#DIV/0!"},{"$error":"#DIV/0!"},{"$f":"COUNTIF(D103:$AL103,\"NE\")/$AV$1","v":{"$error":"#DIV/0!"}},{"$error":"#DIV/0!"}]
[104,{"$nulls":38},{"$error":"#DIV/0!"},{"$error":"#DIV/0!"},{"$error":"#DIV/0!"},{"$error":"#DIV/0!"},{"$f":"COUNTIF(D104:$AL104,\"NE\")/$AV$1","v":{"$error":"#DIV/0!"}},{"$error":"#DIV/0!"}]
[105,{"$nulls":38},{"$error":"#DIV/0!"},{"$error":"#DIV/0!"},{"$error":"#DIV/0!"},{"$error":"#DIV/0!"},{"$f":"COUNTIF(D105:$AL105,\"NE\")/$AV$1","v":{"$error":"#DIV/0!"}},{"$error":"#DIV/0!"}]
[106,{"$nulls":38},{"$error":"#DIV/0!"},{"$error":"#DIV/0!"},{"$error":"#DIV/0!"},{"$error":"#DIV/0!"},{"$f":"COUNTIF(D106:$AL106,\"NE\")/$AV$1","v":{"$error":"#DIV/0!"}},{"$error":"#DIV/0!"}]
[107,{"$nulls":38},{"$error":"#DIV/0!"},{"$error":"#DIV/0!"},{"$error":"#DIV/0!"},{"$error":"#DIV/0!"},{"$f":"COUNTIF(D107:$AL107,\"NE\")/$AV$1","v":{"$error":"#DIV/0!"}},{"$error":"#DIV/0!"}]
[108,{"$nulls":38},{"$error":"#DIV/0!"},{"$error":"#DIV/0!"},{"$error":"#DIV/0!"},{"$error":"#DIV/0!"},{"$f":"COUNTIF(D108:$AL108,\"NE\")/$AV$1","v":{"$error":"#DIV/0!"}},{"$error":"#DIV/0!"}]
[109,{"$nulls":38},{"$error":"#DIV/0!"},{"$error":"#DIV/0!"},{"$error":"#DIV/0!"},{"$error":"#DIV/0!"},{"$f":"COUNTIF(D109:$AL109,\"NE\")/$AV$1","v":{"$error":"#DIV/0!"}},{"$error":"#DIV/0!"}]
[110,{"$nulls":38},{"$error":"#DIV/0!"},{"$error":"#DIV/0!"},{"$error":"#DIV/0!"},{"$error":"#DIV/0!"},{"$f":"COUNTIF(D110:$AL110,\"NE\")/$AV$1","v":{"$error":"#DIV/0!"}},{"$error":"#DIV/0!"}]
[111,{"$nulls":38},{"$error":"#DIV/0!"},{"$error":"#DIV/0!"},{"$error":"#DIV/0!"},{"$error":"#DIV/0!"},{"$f":"COUNTIF(D111:$AL111,\"NE\")/$AV$1","v":{"$error":"#DIV/0!"}},{"$error":"#DIV/0!"}]
[112,{"$nulls":38},{"$error":"#DIV/0!"},{"$error":"#DIV/0!"},{"$error":"#DIV/0!"},{"$error":"#DIV/0!"},{"$f":"COUNTIF(D112:$AL112,\"NE\")/$AV$1","v":{"$error":"#DIV/0!"}},{"$error":"#DIV/0!"}]
[113,{"$nulls":38},{"$error":"#DIV/0!"},{"$error":"#DIV/0!"},{"$error":"#DIV/0!"},{"$error":"#DIV/0!"},{"$f":"COUNTIF(D113:$AL113,\"NE\")/$AV$1","v":{"$error":"#DIV/0!"}},{"$error":"#DIV/0!"}]
[114,{"$nulls":38},{"$error":"#DIV/0!"},{"$error":"#DIV/0!"},{"$error":"#DIV/0!"},{"$error":"#DIV/0!"},{"$f":"COUNTIF(D114:$AL114,\"NE\")/$AV$1","v":{"$error":"#DIV/0!"}},{"$error":"#DIV/0!"}]
[115,{"$nulls":38},{"$error":"#DIV/0!"},{"$error":"#DIV/0!"},{"$error":"#DIV/0!"},{"$error":"#DIV/0!"},{"$f":"COUNTIF(D115:$AL115,\"NE\")/$AV$1","v":{"$error":"#DIV/0!"}},{"$error":"#DIV/0!"}]
[116,{"$nulls":38},{"$error":"#DIV/0!"},{"$error":"#DIV/0!"},{"$error":"#DIV/0!"},{"$error":"#DIV/0!"},{"$f":"COUNTIF(D116:$AL116,\"NE\")/$AV$1","v":{"$error":"#DIV/0!"}},{"$error":"#DIV/0!"}]
[117,{"$nulls":38},{"$error":"#DIV/0!"},{"$error":"#DIV/0!"},{"$error":"#DIV/0!"},{"$error":"#DIV/0!"},{"$f":"COUNTIF(D117:$AL117,\"NE\")/$AV$1","v":{"$error":"#DIV/0!"}},{"$error":"#DIV/0!"}]
[118,{"$nulls":38},{"$error":"#DIV/0!"},{"$error":"#DIV/0!"},{"$error":"#DIV/0!"},{"$error":"#DIV/0!"},{"$f":"COUNTIF(D118:$AL118,\"NE\")/$AV$1","v":{"$error":"#DIV/0!"}},{"$error":"#DIV/0!"}]
[119,{"$nulls":38},{"$error":"#DIV/0!"},{"$error":"#DIV/0!"},{"$error":"#DIV/0!"},{"$error":"#DIV/0!"},{"$f":"COUNTIF(D119:$AL119,\"NE\")/$AV$1","v":{"$error":"#DIV/0!"}},{"$error":"#DIV/0!"}]
[120,{"$nulls":38},{"$error":"#DIV/0!"},{"$error":"#DIV/0!"},{"$error":"#DIV/0!"},{"$error":"#DIV/0!"},{"$f":"COUNTIF(D120:$AL120,\"NE\")/$AV$1","v":{"$error":"#DIV/0!"}},{"$error":"#DIV/0!"}]
[121,{"$nulls":38},{"$error":"#DIV/0!"},{"$error":"#DIV/0!"},{"$error":"#DIV/0!"},{"$error":"#DIV/0!"},{"$f":"COUNTIF(D121:$AL121,\"NE\")/$AV$1","v":{"$error":"#DIV/0!"}},{"$error":"#DIV/0!"}]
[122,{"$nulls":38},{"$error":"#DIV/0!"},{"$error":"#DIV/0!"},{"$error":"#DIV/0!"},{"$error":"#DIV/0!"},{"$f":"COUNTIF(D122:$AL122,\"NE\")/$AV$1","v":{"$error":"#DIV/0!"}},{"$error":"#DIV/0!"}]
[123,{"$nulls":38},{"$error":"#DIV/0!"},{"$error":"#DIV/0!"},{"$error":"#DIV/0!"},{"$error":"#DIV/0!"},{"$f":"COUNTIF(D123:$AL123,\"NE\")/$AV$1","v":{"$error":"#DIV/0!"}},{"$error":"#DIV/0!"}]
[124,{"$nulls":38},{"$error":"#DIV/0!"},{"$error":"#DIV/0!"},{"$error":"#DIV/0!"},{"$error":"#DIV/0!"},{"$f":"COUNTIF(D124:$AL124,\"NE\")/$AV$1","v":{"$error":"#DIV/0!"}},{"$error":"#DIV/0!"}]
[125,{"$nulls":38},{"$error":"#DIV/0!"},{"$error":"#DIV/0!"},{"$error":"#DIV/0!"},{"$error":"#DIV/0!"},{"$f":"COUNTIF(D125:$AL125,\"NE\")/$AV$1","v":{"$error":"#DIV/0!"}},{"$error":"#DIV/0!"}]
[126,{"$nulls":38},{"$error":"#DIV/0!"},{"$error":"#DIV/0!"},{"$error":"#DIV/0!"},{"$error":"#DIV/0!"},{"$f":"COUNTIF(D126:$AL126,\"NE\")/$AV$1","v":{"$error":"#DIV/0!"}},{"$error":"#DIV/0!"}]
[127,{"$nulls":38},{"$error":"#DIV/0!"},{"$error":"#DIV/0!"},{"$error":"#DIV/0!"},{"$error":"#DIV/0!"},{"$f":"COUNTIF(D127:$AL127,\"NE\")/$AV$1","v":{"$error":"#DIV/0!"}},{"$error":"#DIV/0!"}]
[128,{"$nulls":38},{"$error":"#DIV/0!"},{"$error":"#DIV/0!"},{"$error":"#DIV/0!"},{"$error":"#DIV/0!"},{"$f":"COUNTIF(D128:$AL128,\"NE\")/$AV$1","v":{"$error":"#DIV/0!"}},{"$error":"#DIV/0!"}]
[129,{"$nulls":38},{"$error":"#DIV/0!"},{"$error":"#DIV/0!"},{"$error":"#DIV/0!"},{"$error":"#DIV/0!"},{"$f":"COUNTIF(D129:$AL129,\"NE\")/$AV$1","v":{"$error":"#DIV/0!"}},{"$error":"#DIV/0!"}]
[130,{"$nulls":38},{"$error":"#DIV/0!"},{"$error":"#DIV/0!"},{"$error":"#DIV/0!"},{"$error":"#DIV/0!"},{"$f":"COUNTIF(D130:$AL130,\"NE\")/$AV$1","v":{"$error":"#DIV/0!"}},{"$error":"#DIV/0!"}]
[131,{"$nulls":38},{"$error":"#DIV/0!"},{"$error":"#DIV/0!"},{"$error":"#DIV/0!"},{"$error":"#DIV/0!"},{"$f":"COUNTIF(D131:$AL131,\"NE\")/$AV$1","v":{"$error":"#DIV/0!"}},{"$error":"#DIV/0!"}]
[132,{"$nulls":38},{"$error":"#DIV/0!"},{"$error":"#DIV/0!"},{"$error":"#DIV/0!"},{"$error":"#DIV/0!"},{"$f":"COUNTIF(D132:$AL132,\"NE\")/$AV$1","v":{"$error":"#DIV/0!"}},{"$error":"#DIV/0!"}]
[133,{"$nulls":38},{"$error":"#DIV/0!"},{"$error":"#DIV/0!"},{"$error":"#DIV/0!"},{"$error":"#DIV/0!"},{"$f":"COUNTIF(D133:$AL133,\"NE\")/$AV$1","v":{"$error":"#DIV/0!"}},{"$error":"#DIV/0!"}]
[134,{"$nulls":38},{"$f":"COUNTIF($D134:$AL134,$AU$1)/$AV$1","v":{"$error":"#DIV/0!"}},{"$f":"COUNTIF($D134:$AL134,$AU$2)/$AV$1","v":{"$error":"#DIV/0!"}},{"$f":"COUNTIF($D134:$AL134,$AU$3)/$AV$1","v":{"$error":"#DIV/0!"}},{"$f":"COUNTIF($D134:$AL134,$AU$4)/$AV$1","v":{"$error":"#DIV/0!"}},{"$f":"COUNTIF(D134:$AL134,\"NE\")/$AV$1","v":{"$error":"#DIV/0!"}},{"$error":"#DIV/0!"}]
[135,{"$nulls":38},{"$error":"#DIV/0!"},{"$error":"#DIV/0!"},{"$error":"#DIV/0!"},{"$error":"#DIV/0!"},{"$f":"COUNTIF(D135:$AL135,\"NE\")/$AV$1","v":{"$error":"#DIV/0!"}},{"$f":"AN135+(AO135*0.66)+(AP135*0.33)","v":{"$error":"#DIV/0!"}}]
[136,{"$nulls":38},{"$error":"#DIV/0!"},{"$error":"#DIV/0!"},{"$error":"#DIV/0!"},{"$error":"#DIV/0!"},{"$f":"COUNTIF(D136:$AL136,\"NE\")/$AV$1","v":{"$error":"#DIV/0!"}},{"$error":"#DIV/0!"}]
[137,{"$nulls":38},{"$error":"#DIV/0!"},{"$error":"#DIV/0!"},{"$error":"#DIV/0!"},{"$error":"#DIV/0!"},{"$f":"COUNTIF(D137:$AL137,\"NE\")/$AV$1","v":{"$error":"#DIV/0!"}},{"$error":"#DIV/0!"}]
[138,{"$nulls":38},{"$error":"#DIV/0!"},{"$error":"#DIV/0!"},{"$error":"#DIV/0!"},{"$error":"#DIV/0!"},{"$f":"COUNTIF(D138:$AL138,\"NE\")/$AV$1","v":{"$error":"#DIV/0!"}},{"$error":"#DIV/0!"}]
[139,{"$nulls":38},{"$error":"#DIV/0!"},{"$error":"#DIV/0!"},{"$error":"#DIV/0!"},{"$error":"#DIV/0!"},{"$f":"COUNTIF(D139:$AL139,\"NE\")/$AV$1","v":{"$error":"#DIV/0!"}},{"$error":"#DIV/0!"}]
[140,{"$nulls":38},{"$error":"#DIV/0!"},{"$error":"#DIV/0!"},{"$error":"#DIV/0!"},{"$error":"#DIV/0!"},{"$f":"COUNTIF(D140:$AL140,\"NE\")/$AV$1","v":{"$error":"#DIV/0!"}},{"$error":"#DIV/0!"}]
[141,{"$nulls":38},{"$error":"#DIV/0!"},{"$error":"#DIV/0!"},{"$error":"#DIV/0!"},{"$error":"#DIV/0!"},{"$f":"COUNTIF(D141:$AL141,\"NE\")/$AV$1","v":{"$error":"#DIV/0!"}},{"$error":"#DIV/0!"}]
[142,{"$nulls":38},{"$error":"#DIV/0!"},{"$error":"#DIV/0!"},{"$error":"#DIV/0!"},{"$error":"#DIV/0!"},{"$f":"COUNTIF(D142:$AL142,\"NE\")/$AV$1","v":{"$error":"#DIV/0!"}},{"$error":"#DIV/0!"}]
[143,{"$nulls":38},{"$error":"#DIV/0!"},{"$error":"#DIV/0!"},{"$error":"#DIV/0!"},{"$error":"#DIV/0!"},{"$f":"COUNTIF(D143:$AL143,\"NE\")/$AV$1","v":{"$error":"#DIV/0!"}},{"$error":"#DIV/0!"}]
[144,{"$nulls":38},{"$error":"#DIV/0!"},{"$error":"#DIV/0!"},{"$error":"#DIV/0!"},{"$error":"#DIV/0!"},{"$f":"COUNTIF(D144:$AL144,\"NE\")/$AV$1","v":{"$error":"#DIV/0!"}},{"$error":"#DIV/0!"}]
[145,{"$nulls":38},{"$error":"#DIV/0!"},{"$error":"#DIV/0!"},{"$error":"#DIV/0!"},{"$error":"#DIV/0!"},{"$f":"COUNTIF(D145:$AL145,\"NE\")/$AV$1","v":{"$error":"#DIV/0!"}},{"$error":"#DIV/0!"}]
[146,{"$nulls":38},{"$error":"#DIV/0!"},{"$error":"#DIV/0!"},{"$error":"#DIV/0!"},{"$error":"#DIV/0!"},{"$f":"COUNTIF(D146:$AL146,\"NE\")/$AV$1","v":{"$error":"#DIV/0!"}},{"$error":"#DIV/0!"}]
[147,{"$nulls":38},{"$error":"#DIV/0!"},{"$error":"#DIV/0!"},{"$error":"#DIV/0!"},{"$error":"#DIV/0!"},{"$f":"COUNTIF(D147:$AL147,\"NE\")/$AV$1","v":{"$error":"#DIV/0!"}},{"$error":"#DIV/0!"}]
[148,{"$nulls":38},{"$error":"#DIV/0!"},{"$error":"#DIV/0!"},{"$error":"#DIV/0!"},{"$error":"#DIV/0!"},{"$f":"COUNTIF(D148:$AL148,\"NE\")/$AV$1","v":{"$error":"#DIV/0!"}},{"$error":"#DIV/0!"}]
[149,{"$nulls":38},{"$error":"#DIV/0!"},{"$error":"#DIV/0!"},{"$error":"#DIV/0!"},{"$error":"#DIV/0!"},{"$f":"COUNTIF(D149:$AL149,\"NE\")/$AV$1","v":{"$error":"#DIV/0!"}},{"$error":"#DIV/0!"}]
[150,{"$nulls":38},{"$error":"#DIV/0!"},{"$error":"#DIV/0!"},{"$error":"#DIV/0!"},{"$error":"#DIV/0!"},{"$f":"COUNTIF(D150:$AL150,\"NE\")/$AV$1","v":{"$error":"#DIV/0!"}},{"$error":"#DIV/0!"}]
[151,{"$nulls":38},{"$error":"#DIV/0!"},{"$error":"#DIV/0!"},{"$error":"#DIV/0!"},{"$error":"#DIV/0!"},{"$f":"COUNTIF(D151:$AL151,\"NE\")/$AV$1","v":{"$error":"#DIV/0!"}},{"$error":"#DIV/0!"}]
[152,{"$nulls":38},{"$error":"#DIV/0!"},{"$error":"#DIV/0!"},{"$error":"#DIV/0!"},{"$error":"#DIV/0!"},{"$f":"COUNTIF(D152:$AL152,\"NE\")/$AV$1","v":{"$error":"#DIV/0!"}},{"$error":"#DIV/0!"}]
[153,{"$nulls":38},{"$error":"#DIV/0!"},{"$error":"#DIV/0!"},{"$error":"#DIV/0!"},{"$error":"#DIV/0!"},{"$f":"COUNTIF(D153:$AL153,\"NE\")/$AV$1","v":{"$error":"#DIV/0!"}},{"$error":"#DIV/0!"}]
[154,{"$nulls":38},{"$error":"#DIV/0!"},{"$error":"#DIV/0!"},{"$error":"#DIV/0!"},{"$error":"#DIV/0!"},{"$f":"COUNTIF(D154:$AL154,\"NE\")/$AV$1","v":{"$error":"#DIV/0!"}},{"$error":"#DIV/0!"}]
[155,{"$nulls":38},{"$error":"#DIV/0!"},{"$error":"#DIV/0!"},{"$error":"#DIV/0!"},{"$error":"#DIV/0!"},{"$f":"COUNTIF(D155:$AL155,\"NE\")/$AV$1","v":{"$error":"#DIV/0!"}},{"$error":"#DIV/0!"}]
[156,{"$nulls":38},{"$error":"#DIV/0!"},{"$error":"#DIV/0!"},{"$error":"#DIV/0!"},{"$error":"#DIV/0!"},{"$f":"COUNTIF(D156:$AL156,\"NE\")/$AV$1","v":{"$error":"#DIV/0!"}},{"$error":"#DIV/0!"}]
[157,{"$nulls":38},{"$error":"#DIV/0!"},{"$error":"#DIV/0!"},{"$error":"#DIV/0!"},{"$error":"#DIV/0!"},{"$f":"COUNTIF(D157:$AL157,\"NE\")/$AV$1","v":{"$error":"#DIV/0!"}},{"$error":"#DIV/0!"}]
[158,{"$nulls":38},{"$error":"#DIV/0!"},{"$error":"#DIV/0!"},{"$error":"#DIV/0!"},{"$error":"#DIV/0!"},{"$f":"COUNTIF(D158:$AL158,\"NE\")/$AV$1","v":{"$error":"#DIV/0!"}},{"$error":"#DIV/0!"}]
[159,{"$nulls":38},{"$error":"#DIV/0!"},{"$error":"#DIV/0!"},{"$error":"#DIV/0!"},{"$error":"#DIV/0!"},{"$f":"COUNTIF(D159:$AL159,\"NE\")/$AV$1","v":{"$error":"#DIV/0!"}},{"$error":"#DIV/0!"}]
[160,{"$nulls":38},{"$error":"#DIV/0!"},{"$error":"#DIV/0!"},{"$error":"#DIV/0!"},{"$error":"#DIV/0!"},{"$f":"COUNTIF(D160:$AL160,\"NE\")/$AV$1","v":{"$error":"#DIV/0!"}},{"$error":"#DIV/0!"}]
[161,{"$nulls":38},{"$error":"#DIV/0!"},{"$error":"#DIV/0!"},{"$error":"#DIV/0!"},{"$error":"#DIV/0!"},{"$f":"COUNTIF(D161:$AL161,\"NE\")/$AV$1","v":{"$error":"#DIV/0!"}},{"$error":"#DIV/0!"}]
[162,{"$nulls":38},{"$error":"#DIV/0!"},{"$error":"#DIV/0!"},{"$error":"#DIV/0!"},{"$error":"#DIV/0!"},{"$f":"COUNTIF(D162:$AL162,\"NE\")/$AV$1","v":{"$error":"#DIV/0!"}},{"$error":"#DIV/0!"}]
[163,{"$nulls":38},{"$error":"#DIV/0!"},{"$error":"#DIV/0!"},{"$error":"#DIV/0!"},{"$error":"#DIV/0!"},{"$f":"COUNTIF(D163:$AL163,\"NE\")/$AV$1","v":{"$error":"#DIV/0!"}},{"$error":"#DIV/0!"}]
[164,{"$nulls":38},{"$error":"#DIV/0!"},{"$error":"#DIV/0!"},{"$error":"#DIV/0!"},{"$error":"#DIV/0!"},{"$f":"COUNTIF(D164:$AL164,\"NE\")/$AV$1","v":{"$error":"#DIV/0!"}},{"$error":"#DIV/0!"}]
[165,{"$nulls":38},{"$error":"#DIV/0!"},{"$error":"#DIV/0!"},{"$error":"#DIV/0!"},{"$error":"#DIV/0!"},{"$f":"COUNTIF(D165:$AL165,\"NE\")/$AV$1","v":{"$error":"#DIV/0!"}},{"$error":"#DIV/0!"}]
[166,{"$nulls":38},{"$error":"#DIV/0!"},{"$error":"#DIV/0!"},{"$error":"#DIV/0!"},{"$error":"#DIV/0!"},{"$f":"COUNTIF(D166:$AL166,\"NE\")/$AV$1","v":{"$error":"#DIV/0!"}},{"$error":"#DIV/0!"}]
[167,{"$nulls":38},{"$error":"#DIV/0!"},{"$error":"#DIV/0!"},{"$error":"#DIV/0!"},{"$error":"#DIV/0!"},{"$f":"COUNTIF(D167:$AL167,\"NE\")/$AV$1","v":{"$error":"#DIV/0!"}},{"$error":"#DIV/0!"}]
[168,{"$nulls":38},{"$error":"#DIV/0!"},{"$error":"#DIV/0!"},{"$error":"#DIV/0!"},{"$error":"#DIV/0!"},{"$f":"COUNTIF(D168:$AL168,\"NE\")/$AV$1","v":{"$error":"#DIV/0!"}},{"$error":"#DIV/0!"}]
[169,{"$nulls":38},{"$error":"#DIV/0!"},{"$error":"#DIV/0!"},{"$error":"#DIV/0!"},{"$error":"#DIV/0!"},{"$f":"COUNTIF(D169:$AL169,\"NE\")/$AV$1","v":{"$error":"#DIV/0!"}},{"$error":"#DIV/0!"}]
[170,{"$nulls":38},{"$error":"#DIV/0!"},{"$error":"#DIV/0!"},{"$error":"#DIV/0!"},{"$error":"#DIV/0!"},{"$f":"COUNTIF(D170:$AL170,\"NE\")/$AV$1","v":{"$error":"#DIV/0!"}},{"$error":"#DIV/0!"}]
[171,{"$nulls":38},{"$error":"#DIV/0!"},{"$error":"#DIV/0!"},{"$error":"#DIV/0!"},{"$error":"#DIV/0!"},{"$f":"COUNTIF(D171:$AL171,\"NE\")/$AV$1","v":{"$error":"#DIV/0!"}},{"$error":"#DIV/0!"}]
[172,{"$nulls":38},{"$error":"#DIV/0!"},{"$error":"#DIV/0!"},{"$error":"#DIV/0!"},{"$error":"#DIV/0!"},{"$f":"COUNTIF(D172:$AL172,\"NE\")/$AV$1","v":{"$error":"#DIV/0!"}},{"$error":"#DIV/0!"}]
[173,{"$nulls":38},{"$error":"#DIV/0!"},{"$error":"#DIV/0!"},{"$error":"#DIV/0!"},{"$error":"#DIV/0!"},{"$f":"COUNTIF(D173:$AL173,\"NE\")/$AV$1","v":{"$error":"#DIV/0!"}},{"$error":"#DIV/0!"}]
[174,{"$nulls":38},{"$error":"#DIV/0!"},{"$error":"#DIV/0!"},{"$error":"#DIV/0!"},{"$error":"#DIV/0!"},{"$f":"COUNTIF(D174:$AL174,\"NE\")/$AV$1","v":{"$error":"#DIV/0!"}},{"$error":"#DIV/0!"}]
[175,{"$nulls":38},{"$error":"#DIV/0!"},{"$error":"#DIV/0!"},{"$error":"#DIV/0!"},{"$error":"#DIV/0!"},{"$f":"COUNTIF(D175:$AL175,\"NE\")/$AV$1","v":{"$error":"#DIV/0!"}},{"$error":"#DIV/0!"}]
[176,{"$nulls":38},{"$error":"#DIV/0!"},{"$error":"#DIV/0!"},{"$error":"#DIV/0!"},{"$error":"#DIV/0!"},{"$f":"COUNTIF(D176:$AL176,\"NE\")/$AV$1","v":{"$error":"#DIV/0!"}},{"$error":"#DIV/0!"}]
[177,{"$nulls":38},{"$error":"#DIV/0!"},{"$error":"#DIV/0!"},{"$error":"#DIV/0!"},{"$error":"#DIV/0!"},{"$f":"COUNTIF(D177:$AL177,\"NE\")/$AV$1","v":{"$error":"#DIV/0!"}},{"$error":"#DIV/0!"}]
[178,{"$nulls":38},{"$error":"#DIV/0!"},{"$error":"#DIV/0!"},{"$error":"#DIV/0!"},{"$error":"#DIV/0!"},{"$f":"COUNTIF(D178:$AL178,\"NE\")/$AV$1","v":{"$error":"#DIV/0!"}},{"$error":"#DIV/0!"}]
[179,{"$nulls":38},{"$error":"#DIV/0!"},{"$error":"#DIV/0!"},{"$error":"#DIV/0!"},{"$error":"#DIV/0!"},{"$f":"COUNTIF(D179:$AL179,\"NE\")/$AV$1","v":{"$error":"#DIV/0!"}},{"$error":"#DIV/0!"}]
[180,{"$nulls":38},{"$error":"#DIV/0!"},{"$error":"#DIV/0!"},{"$error":"#DIV/0!"},{"$error":"#DIV/0!"},{"$f":"COUNTIF(D180:$AL180,\"NE\")/$AV$1","v":{"$error":"#DIV/0!"}},{"$error":"#DIV/0!"}]
[181,{"$nulls":38},{"$error":"#DIV/0!"},{"$error":"#DIV/0!"},{"$error":"#DIV/0!"},{"$error":"#DIV/0!"},{"$f":"COUNTIF(D181:$AL181,\"NE\")/$AV$1","v":{"$error":"#DIV/0!"}},{"$error":"#DIV/0!"}]
[182,{"$nulls":38},{"$error":"#DIV/0!"},{"$error":"#DIV/0!"},{"$error":"#DIV/0!"},{"$error":"#DIV/0!"},{"$f":"COUNTIF(D182:$AL182,\"NE\")/$AV$1","v":{"$error":"#DIV/0!"}},{"$error":"#DIV/0!"}]
[183,{"$nulls":38},{"$error":"#DIV/0!"},{"$error":"#DIV/0!"},{"$error":"#DIV/0!"},{"$error":"#DIV/0!"},{"$f":"COUNTIF(D183:$AL183,\"NE\")/$AV$1","v":{"$error":"#DIV/0!"}},{"$error":"#DIV/0!"}]
[184,{"$nulls":38},{"$error":"#DIV/0!"},{"$error":"#DIV/0!"},{"$error":"#DIV/0!"},{"$error":"#DIV/0!"},{"$f":"COUNTIF(D184:$AL184,\"NE\")/$AV$1","v":{"$error":"#DIV/0!"}},{"$error":"#DIV/0!"}]
[185,{"$nulls":38},{"$error":"#DIV/0!"},{"$error":"#DIV/0!"},{"$error":"#DIV/0!"},{"$error":"#DIV/0!"},{"$f":"COUNTIF(D185:$AL185,\"NE\")/$AV$1","v":{"$error":"#DIV/0!"}},{"$error":"#DIV/0!"}]
[186,{"$nulls":38},{"$error":"#DIV/0!"},{"$error":"#DIV/0!"},{"$error":"#DIV/0!"},{"$error":"#DIV/0!"},{"$f":"COUNTIF(D186:$AL186,\"NE\")/$AV$1","v":{"$error":"#DIV/0!"}},{"$error":"#DIV/0!"}]
[187,{"$nulls":38},{"$error":"#DIV/0!"},{"$error":"#DIV/0!"},{"$error":"#DIV/0!"},{"$error":"#DIV/0!"},{"$f":"COUNTIF(D187:$AL187,\"NE\")/$AV$1","v":{"$error":"#DIV/0!"}},{"$error":"#DIV/0!"}]
[188,{"$nulls":38},{"$error":"#DIV/0!"},{"$error":"#DIV/0!"},{"$error":"#DIV/0!"},{"$error":"#DIV/0!"},{"$f":"COUNTIF(D188:$AL188,\"NE\")/$AV$1","v":{"$error":"#DIV/0!"}},{"$error":"#DIV/0!"}]
[189,{"$nulls":38},{"$error":"#DIV/0!"},{"$error":"#DIV/0!"},{"$error":"#DIV/0!"},{"$error":"#DIV/0!"},{"$f":"COUNTIF(D189:$AL189,\"NE\")/$AV$1","v":{"$error":"#DIV/0!"}},{"$error":"#DIV/0!"}]
[190,{"$nulls":38},{"$error":"#DIV/0!"},{"$error":"#DIV/0!"},{"$error":"#DIV/0!"},{"$error":"#DIV/0!"},{"$f":"COUNTIF(D190:$AL190,\"NE\")/$AV$1","v":{"$error":"#DIV/0!"}},{"$error":"#DIV/0!"}]
[191,{"$nulls":38},{"$error":"#DIV/0!"},{"$error":"#DIV/0!"},{"$error":"#DIV/0!"},{"$error":"#DIV/0!"},{"$f":"COUNTIF(D191:$AL191,\"NE\")/$AV$1","v":{"$error":"#DIV/0!"}},{"$error":"#DIV/0!"}]
[192,{"$nulls":38},{"$error":"#DIV/0!"},{"$error":"#DIV/0!"},{"$error":"#DIV/0!"},{"$error":"#DIV/0!"},{"$f":"COUNTIF(D192:$AL192,\"NE\")/$AV$1","v":{"$error":"#DIV/0!"}},{"$error":"#DIV/0!"}]
[193,{"$nulls":38},{"$error":"#DIV/0!"},{"$error":"#DIV/0!"},{"$error":"#DIV/0!"},{"$error":"#DIV/0!"},{"$f":"COUNTIF(D193:$AL193,\"NE\")/$AV$1","v":{"$error":"#DIV/0!"}},{"$error":"#DIV/0!"}]
[194,{"$nulls":38},{"$error":"#DIV/0!"},{"$error":"#DIV/0!"},{"$error":"#DIV/0!"},{"$error":"#DIV/0!"},{"$f":"COUNTIF(D194:$AL194,\"NE\")/$AV$1","v":{"$error":"#DIV/0!"}},{"$error":"#DIV/0!"}]
[195,{"$nulls":38},{"$error":"#DIV/0!"},{"$error":"#DIV/0!"},{"$error":"#DIV/0!"},{"$error":"#DIV/0!"},{"$f":"COUNTIF(D195:$AL195,\"NE\")/$AV$1","v":{"$error":"#DIV/0!"}},{"$error":"#DIV/0!"}]
[196,{"$nulls":38},{"$error":"#DIV/0!"},{"$error":"#DIV/0!"},{"$error":"#DIV/0!"},{"$error":"#DIV/0!"},{"$f":"COUNTIF(D196:$AL196,\"NE\")/$AV$1","v":{"$error":"#DIV/0!"}},{"$error":"#DIV/0!"}]
[197,{"$nulls":38},{"$error":"#DIV/0!"},{"$error":"#DIV/0!"},{"$error":"#DIV/0!"},{"$error":"#DIV/0!"},{"$f":"COUNTIF(D197:$AL197,\"NE\")/$AV$1","v":{"$error":"#DIV/0!"}},{"$error":"#DIV/0!"}]
[198,{"$nulls":38},{"$f":"COUNTIF($D198:$AL198,$AU$1)/$AV$1","v":{"$error":"#DIV/0!"}},{"$f":"COUNTIF($D198:$AL198,$AU$2)/$AV$1","v":{"$error":"#DIV/0!"}},{"$f":"COUNTIF($D198:$AL198,$AU$3)/$AV$1","v":{"$error":"#DIV/0!"}},{"$f":"COUNTIF($D198:$AL198,$AU$4)/$AV$1","v":{"$error":"#DIV/0!"}},{"$f":"COUNTIF(D198:$AL198,\"NE\")/$AV$1","v":{"$error":"#DIV/0!"}},{"$error":"#DIV/0!"}]
[199,{"$nulls":38},{"$error":"#DIV/0!"},{"$error":"#DIV/0!"},{"$error":"#DIV/0!"},{"$error":"#DIV/0!"},{"$f":"COUNTIF(D199:$AL199,\"NE\")/$AV$1","v":{"$error":"#DIV/0!"}},{"$f":"AN199+(AO199*0.66)+(AP199*0.33)","v":{"$error":"#DIV/0!"}}]
[200,{"$nulls":38},{"$error":"#DIV/0!"},{"$error":"#DIV/0!"},{"$error":"#DIV/0!"},{"$error":"#DIV/0!"},{"$f":"COUNTIF(D200:$AL200,\"NE\")/$AV$1","v":{"$error":"#DIV/0!"}},{"$error":"#DIV/0!"}]
[201,{"$nulls":38},{"$error":"#DIV/0!"},{"$error":"#DIV/0!"},{"$error":"#DIV/0!"},{"$error":"#DIV/0!"},{"$f":"COUNTIF(D201:$AL201,\"NE\")/$AV$1","v":{"$error":"#DIV/0!"}},{"$error":"#DIV/0!"}]
[202,{"$nulls":38},{"$error":"#DIV/0!"},{"$error":"#DIV/0!"},{"$error":"#DIV/0!"},{"$error":"#DIV/0!"},{"$f":"COUNTIF(D202:$AL202,\"NE\")/$AV$1","v":{"$error":"#DIV/0!"}},{"$error":"#DIV/0!"}]
[203,{"$nulls":38},{"$error":"#DIV/0!"},{"$error":"#DIV/0!"},{"$error":"#DIV/0!"},{"$error":"#DIV/0!"},{"$f":"COUNTIF(D203:$AL203,\"NE\")/$AV$1","v":{"$error":"#DIV/0!"}},{"$error":"#DIV/0!"}]
[204,{"$nulls":38},{"$error":"#DIV/0!"},{"$error":"#DIV/0!"},{"$error":"#DIV/0!"},{"$error":"#DIV/0!"},{"$f":"COUNTIF(D204:$AL204,\"NE\")/$AV$1","v":{"$error":"#DIV/0!"}},{"$error":"#DIV/0!"}]
[205,{"$nulls":38},{"$error":"#DIV/0!"},{"$error":"#DIV/0!"},{"$error":"#DIV/0!"},{"$error":"#DIV/0!"},{"$f":"COUNTIF(D205:$AL205,\"NE\")/$AV$1","v":{"$error":"#DIV/0!"}},{"$error":"#DIV/0!"}]
[206,{"$nulls":38},{"$error":"#DIV/0!"},{"$error":"#DIV/0!"},{"$error":"#DIV/0!"},{"$error":"#DIV/0!"},{"$f":"COUNTIF(D206:$AL206,\"NE\")/$AV$1","v":{"$error":"#DIV/0!"}},{"$error":"#DIV/0!"}]
[207,{"$nulls":38},{"$error":"#DIV/0!"},{"$error":"#DIV/0!"},{"$error":"#DIV/0!"},{"$error":"#DIV/0!"},{"$f":"COUNTIF(D207:$AL207,\"NE\")/$AV$1","v":{"$error":"#DIV/0!"}},{"$error":"#DIV/0!"}]
[208,{"$nulls":38},{"$error":"#DIV/0!"},{"$error":"#DIV/0!"},{"$error":"#DIV/0!"},{"$error":"#DIV/0!"},{"$f":"COUNTIF(D208:$AL208,\"NE\")/$AV$1","v":{"$error":"#DIV/0!"}},{"$error":"#DIV/0!"}]
[209,{"$nulls":38},{"$error":"#DIV/0!"},{"$error":"#DIV/0!"},{"$error":"#DIV/0!"},{"$error":"#DIV/0!"},{"$f":"COUNTIF(D209:$AL209,\"NE\")/$AV$1","v":{"$error":"#DIV/0!"}},{"$error":"#DIV/0!"}]
[210,{"$nulls":38},{"$error":"#DIV/0!"},{"$error":"#DIV/0!"},{"$error":"#DIV/0!"},{"$error":"#DIV/0!"},{"$f":"COUNTIF(D210:$AL210,\"NE\")/$AV$1","v":{"$error":"#DIV/0!"}},{"$error":"#DIV/0!"}]
[211,{"$nulls":38},{"$error":"#DIV/0!"},{"$error":"#DIV/0!"},{"$error":"#DIV/0!"},{"$error":"#DIV/0!"},{"$f":"COUNTIF(D211:$AL211,\"NE\")/$AV$1","v":{"$error":"#DIV/0!"}},{"$error":"#DIV/0!"}]
[212,{"$nulls":38},{"$error":"#DIV/0!"},{"$error":"#DIV/0!"},{"$error":"#DIV/0!"},{"$error":"#DIV/0!"},{"$f":"COUNTIF(D212:$AL212,\"NE\")/$AV$1","v":{"$error":"#DIV/0!"}},{"$error":"#DIV/0!"}]
[213,{"$nulls":38},{"$error":"#DIV/0!"},{"$error":"#DIV/0!"},{"$error":"#DIV/0!"},{"$error":"#DIV/0!"},{"$f":"COUNTIF(D213:$AL213,\"NE\")/$AV$1","v":{"$error":"#DIV/0!"}},{"$error":"#DIV/0!"}]
[214,{"$nulls":38},{"$error":"#DIV/0!"},{"$error":"#DIV/0!"},{"$error":"#DIV/0!"},{"$error":"#DIV/0!"},{"$f":"COUNTIF(D214:$AL214,\"NE\")/$AV$1","v":{"$error":"#DIV/0!"}},{"$error":"#DIV/0!"}]
[215,{"$nulls":38},{"$error":"#DIV/0!"},{"$error":"#DIV/0!"},{"$error":"#DIV/0!"},{"$error":"#DIV/0!"},{"$f":"COUNTIF(D215:$AL215,\"NE\")/$AV$1","v":{"$error":"#DIV/0!"}},{"$error":"#DIV/0!"}]
[216,{"$nulls":38},{"$error":"#DIV/0!"},{"$error":"#DIV/0!"},{"$error":"#DIV/0!"},{"$error":"#DIV/0!"},{"$f":"COUNTIF(D216:$AL216,\"NE\")/$AV$1","v":{"$error":"#DIV/0!"}},{"$error":"#DIV/0!"}]
[217,{"$nulls":38},{"$error":"#DIV/0!"},{"$error":"#DIV/0!"},{"$error":"#DIV/0!"},{"$error":"#DIV/0!"},{"$f":"COUNTIF(D217:$AL217,\"NE\")/$AV$1","v":{"$error":"#DIV/0!"}},{"$error":"#DIV/0!"}]
[218,{"$nulls":38},{"$error":"#DIV/0!"},{"$error":"#DIV/0!"},{"$error":"#DIV/0!"},{"$error":"#DIV/0!"},{"$f":"COUNTIF(D218:$AL218,\"NE\")/$AV$1","v":{"$error":"#DIV/0!"}},{"$error":"#DIV/0!"}]
[219,{"$nulls":38},{"$error":"#DIV/0!"},{"$error":"#DIV/0!"},{"$error":"#DIV/0!"},{"$error":"#DIV/0!"},{"$f":"COUNTIF(D219:$AL219,\"NE\")/$AV$1","v":{"$error":"#DIV/0!"}},{"$error":"#DIV/0!"}]
[220,{"$nulls":38},{"$error":"#DIV/0!"},{"$error":"#DIV/0!"},{"$error":"#DIV/0!"},{"$error":"#DIV/0!"},{"$f":"COUNTIF(D220:$AL220,\"NE\")/$AV$1","v":{"$error":"#DIV/0!"}},{"$error":"#DIV/0!"}]
[221,{"$nulls":38},{"$error":"#DIV/0!"},{"$error":"#DIV/0!"},{"$error":"#DIV/0!"},{"$error":"#DIV/0!"},{"$f":"COUNTIF(D221:$AL221,\"NE\")/$AV$1","v":{"$error":"#DIV/0!"}},{"$error":"#DIV/0!"}]
[222,{"$nulls":38},{"$error":"#DIV/0!"},{"$error":"#DIV/0!"},{"$error":"#DIV/0!"},{"$error":"#DIV/0!"},{"$f":"COUNTIF(D222:$AL222,\"NE\")/$AV$1","v":{"$error":"#DIV/0!"}},{"$error":"#DIV/0!"}]
[223,{"$nulls":38},{"$error":"#DIV/0!"},{"$error":"#DIV/0!"},{"$error":"#DIV/0!"},{"$error":"#DIV/0!"},{"$f":"COUNTIF(D223:$AL223,\"NE\")/$AV$1","v":{"$error":"#DIV/0!"}},{"$error":"#DIV/0!"}]
[224,{"$nulls":38},{"$error":"#DIV/0!"},{"$error":"#DIV/0!"},{"$error":"#DIV/0!"},{"$error":"#DIV/0!"},{"$f":"COUNTIF(D224:$AL224,\"NE\")/$AV$1","v":{"$error":"#DIV/0!"}},{"$error":"#DIV/0!"}]
[225,{"$nulls":38},{"$error":"#DIV/0!"},{"$error":"#DIV/0!"},{"$error":"#DIV/0!"},{"$error":"#DIV/0!"},{"$f":"COUNTIF(D225:$AL225,\"NE\")/$AV$1","v":{"$error":"#DIV/0!"}},{"$error":"#DIV/0!"}]
[226,{"$nulls":38},{"$error":"#DIV/0!"},{"$error":"#DIV/0!"},{"$error":"#DIV/0!"},{"$error":"#DIV/0!"},{"$f":"COUNTIF(D226:$AL226,\"NE\")/$AV$1","v":{"$error":"#DIV/0!"}},{"$error":"#DIV/0!"}]
[227,{"$nulls":38},{"$error":"#DIV/0!"},{"$error":"#DIV/0!"},{"$error":"#DIV/0!"},{"$error":"#DIV/0!"},{"$f":"COUNTIF(D227:$AL227,\"NE\")/$AV$1","v":{"$error":"#DIV/0!"}},{"$error":"#DIV/0!"}]
[228,{"$nulls":38},{"$error":"#DIV/0!"},{"$error":"#DIV/0!"},{"$error":"#DIV/0!"},{"$error":"#DIV/0!"},{"$f":"COUNTIF(D228:$AL228,\"NE\")/$AV$1","v":{"$error":"#DIV/0!"}},{"$error":"#DIV/0!"}]
[229,{"$nulls":38},{"$error":"#DIV/0!"},{"$error":"#DIV/0!"},{"$error":"#DIV/0!"},{"$error":"#DIV/0!"},{"$f":"COUNTIF(D229:$AL229,\"NE\")/$AV$1","v":{"$error":"#DIV/0!"}},{"$error":"#DIV/0!"}]
[230,{"$nulls":38},{"$error":"#DIV/0!"},{"$error":"#DIV/0!"},{"$error":"#DIV/0!"},{"$error":"#DIV/0!"},{"$f":"COUNTIF(D230:$AL230,\"NE\")/$AV$1","v":{"$error":"#DIV/0!"}},{"$error":"#DIV/0!"}]
[231,{"$nulls":38},{"$error":"#DIV/0!"},{"$error":"#DIV/0!"},{"$error":"#DIV/0!"},{"$error":"#DIV/0!"},{"$f":"COUNTIF(D231:$AL231,\"NE\")/$AV$1","v":{"$error":"#DIV/0!"}},{"$error":"#DIV/0!"}]
[232,{"$nulls":38},{"$error":"#DIV/0!"},{"$error":"#DIV/0!"},{"$error":"#DIV/0!"},{"$error":"#DIV/0!"},{"$f":"COUNTIF(D232:$AL232,\"NE\")/$AV$1","v":{"$error":"#DIV/0!"}},{"$error":"#DIV/0!"}]
[233,{"$nulls":38},{"$error":"#DIV/0!"},{"$error":"#DIV/0!"},{"$error":"#DIV/0!"},{"$error":"#DIV/0!"},{"$f":"COUNTIF(D233:$AL233,\"NE\")/$AV$1","v":{"$error":"#DIV/0!"}},{"$error":"#DIV/0!"}]
[234,{"$nulls":38},{"$error":"#DIV/0!"},{"$error":"#DIV/0!"},{"$error":"#DIV/0!"},{"$error":"#DIV/0!"},{"$f":"COUNTIF(D234:$AL234,\"NE\")/$AV$1","v":{"$error":"#DIV/0!"}},{"$error":"#DIV/0!"}]
[235,{"$nulls":38},{"$error":"#DIV/0!"},{"$error":"#DIV/0!"},{"$error":"#DIV/0!"},{"$error":"#DIV/0!"},{"$f":"COUNTIF(D235:$AL235,\"NE\")/$AV$1","v":{"$error":"#DIV/0!"}},{"$error":"#DIV/0!"}]
[236,{"$nulls":38},{"$error":"#DIV/0!"},{"$error":"#DIV/0!"},{"$error":"#DIV/0!"},{"$error":"#DIV/0!"},{"$f":"COUNTIF(D236:$AL236,\"NE\")/$AV$1","v":{"$error":"#DIV/0!"}},{"$error":"#DIV/0!"}]
[237,{"$nulls":38},{"$error":"#DIV/0!"},{"$error":"#DIV/0!"},{"$error":"#DIV/0!"},{"$error":"#DIV/0!"},{"$f":"COUNTIF(D237:$AL237,\"NE\")/$AV$1","v":{"$error":"#DIV/0!"}},{"$error":"#DIV/0!"}]
[238,{"$nulls":38},{"$error":"#DIV/0!"},{"$error":"#DIV/0!"},{"$error":"#DIV/0!"},{"$error":"#DIV/0!"},{"$f":"COUNTIF(D238:$AL238,\"NE\")/$AV$1","v":{"$error":"#DIV/0!"}},{"$error":"#DIV/0!"}]
[239,{"$nulls":38},{"$error":"#DIV/0!"},{"$error":"#DIV/0!"},{"$error":"#DIV/0!"},{"$error":"#DIV/0!"},{"$f":"COUNTIF(D239:$AL239,\"NE\")/$AV$1","v":{"$error":"#DIV/0!"}},{"$error":"#DIV/0!"}]
[240,{"$nulls":38},{"$error":"#DIV/0!"},{"$error":"#DIV/0!"},{"$error":"#DIV/0!"},{"$error":"#DIV/0!"},{"$f":"COUNTIF(D240:$AL240,\"NE\")/$AV$1","v":{"$error":"#DIV/0!"}},{"$error":"#DIV/0!"}]
[241,{"$nulls":38},{"$error":"#DIV/0!"},{"$error":"#DIV/0!"},{"$error":"#DIV/0!"},{"$error":"#DIV/0!"},{"$f":"COUNTIF(D241:$AL241,\"NE\")/$AV$1","v":{"$error":"#DIV/0!"}},{"$error":"#DIV/0!"}]
[242,{"$nulls":38},{"$error":"#DIV/0!"},{"$error":"#DIV/0!"},{"$error":"#DIV/0!"},{"$error":"#DIV/0!"},{"$f":"COUNTIF(D242:$AL242,\"NE\")/$AV$1","v":{"$error":"#DIV/0!"}},{"$error":"#DIV/0!"}]
[243,{"$nulls":38},{"$error":"#DIV/0!"},{"$error":"#DIV/0!"},{"$error":"#DIV/0!"},{"$error":"#DIV/0!"},{"$f":"COUNTIF(D243:$AL243,\"NE\")/$AV$1","v":{"$error":"#DIV/0!"}},{"$error":"#DIV/0!"}]
[244,{"$nulls":38},{"$error":"#DIV/0!"},{"$error":"#DIV/0!"},{"$error":"#DIV/0!"},{"$error":"#DIV/0!"},{"$f":"COUNTIF(D244:$AL244,\"NE\")/$AV$1","v":{"$error":"#DIV/0!"}},{"$error":"#DIV/0!"}]
[245,{"$nulls":38},{"$error":"#DIV/0!"},{"$error":"#DIV/0!"},{"$error":"#DIV/0!"},{"$error":"#DIV/0!"},{"$f":"COUNTIF(D245:$AL245,\"NE\")/$AV$1","v":{"$error":"#DIV/0!"}},{"$error":"#DIV/0!"}]
[246,{"$nulls":38},{"$error":"#DIV/0!"},{"$error":"#DIV/0!"},{"$error":"#DIV/0!"},{"$error":"#DIV/0!"},{"$f":"COUNTIF(D246:$AL246,\"NE\")/$AV$1","v":{"$error":"#DIV/0!"}},{"$error":"#DIV/0!"}]
[247,{"$nulls":38},{"$error":"#DIV/0!"},{"$error":"#DIV/0!"},{"$error":"#DIV/0!"},{"$error":"#DIV/0!"},{"$f":"COUNTIF(D247:$AL247,\"NE\")/$AV$1","v":{"$error":"#DIV/0!"}},{"$error":"#DIV/0!"}]
[248,{"$nulls":38},{"$error":"#DIV/0!"},{"$error":"#DIV/0!"},{"$error":"#DIV/0!"},{"$error":"#DIV/0!"},{"$f":"COUNTIF(D248:$AL248,\"NE\")/$AV$1","v":{"$error":"#DIV/0!"}},{"$error":"#DIV/0!"}]
[249,{"$nulls":38},{"$error":"#DIV/0!"},{"$error":"#DIV/0!"},{"$error":"#DIV/0!"},{"$error":"#DIV/0!"},{"$f":"COUNTIF(D249:$AL249,\"NE\")/$AV$1","v":{"$error":"#DIV/0!"}},{"$error":"#DIV/0!"}]
[250,{"$nulls":38},{"$error":"#DIV/0!"},{"$error":"#DIV/0!"},{"$error":"#DIV/0!"},{"$error":"#DIV/0!"},{"$f":"COUNTIF(D250:$AL250,\"NE\")/$AV$1","v":{"$error":"#DIV/0!"}},{"$error":"#DIV/0!"}]
[251,{"$nulls":38},{"$error":"#DIV/0!"},{"$error":"#DIV/0!"},{"$error":"#DIV/0!"},{"$error":"#DIV/0!"},{"$f":"COUNTIF(D251:$AL251,\"NE\")/$AV$1","v":{"$error":"#DIV/0!"}},{"$error":"#DIV/0!"}]
[252,{"$nulls":38},{"$error":"#DIV/0!"},{"$error":"#DIV/0!"},{"$error":"#DIV/0!"},{"$error":"#DIV/0!"},{"$f":"COUNTIF(D252:$AL252,\"NE\")/$AV$1","v":{"$error":"#DIV/0!"}},{"$error":"#DIV/0!"}]
[253,{"$nulls":38},{"$error":"#DIV/0!"},{"$error":"#DIV/0!"},{"$error":"#DIV/0!"},{"$error":"#DIV/0!"},{"$f":"COUNTIF(D253:$AL253,\"NE\")/$AV$1","v":{"$error":"#DIV/0!"}},{"$error":"#DIV/0!"}]
[254,{"$nulls":38},{"$error":"#DIV/0!"},{"$error":"#DIV/0!"},{"$error":"#DIV/0!"},{"$error":"#DIV/0!"},{"$f":"COUNTIF(D254:$AL254,\"NE\")/$AV$1","v":{"$error":"#DIV/0!"}},{"$error":"#DIV/0!"}]
[255,{"$nulls":38},{"$error":"#DIV/0!"},{"$error":"#DIV/0!"},{"$error":"#DIV/0!"},{"$error":"#DIV/0!"},{"$f":"COUNTIF(D255:$AL255,\"NE\")/$AV$1","v":{"$error":"#DIV/0!"}},{"$error":"#DIV/0!"}]
[256,{"$nulls":38},{"$error":"#DIV/0!"},{"$error":"#DIV/0!"},{"$error":"#DIV/0!"},{"$error":"#DIV/0!"},{"$f":"COUNTIF(D256:$AL256,\"NE\")/$AV$1","v":{"$error":"#DIV/0!"}},{"$error":"#DIV/0!"}]
[257,{"$nulls":38},{"$error":"#DIV/0!"},{"$error":"#DIV/0!"},{"$error":"#DIV/0!"},{"$error":"#DIV/0!"},{"$f":"COUNTIF(D257:$AL257,\"NE\")/$AV$1","v":{"$error":"#DIV/0!"}},{"$error":"#DIV/0!"}]
[258,{"$nulls":38},{"$error":"#DIV/0!"},{"$error":"#DIV/0!"},{"$error":"#DIV/0!"},{"$error":"#DIV/0!"},{"$f":"COUNTIF(D258:$AL258,\"NE\")/$AV$1","v":{"$error":"#DIV/0!"}},{"$error":"#DIV/0!"}]
[259,{"$nulls":38},{"$error":"#DIV/0!"},{"$error":"#DIV/0!"},{"$error":"#DIV/0!"},{"$error":"#DIV/0!"},{"$f":"COUNTIF(D259:$AL259,\"NE\")/$AV$1","v":{"$error":"#DIV/0!"}},{"$error":"#DIV/0!"}]
[260,{"$nulls":38},{"$error":"#DIV/0!"},{"$error":"#DIV/0!"},{"$error":"#DIV/0!"},{"$error":"#DIV/0!"},{"$f":"COUNTIF(D260:$AL260,\"NE\")/$AV$1","v":{"$error":"#DIV/0!"}},{"$error":"#DIV/0!"}]
[261,{"$nulls":38},{"$error":"#DIV/0!"},{"$error":"#DIV/0!"},{"$error":"#DIV/0!"},{"$error":"#DIV/0!"},{"$f":"COUNTIF(D261:$AL261,\"NE\")/$AV$1","v":{"$error":"#DIV/0!"}},{"$error":"#DIV/0!"}]
[262,{"$nulls":38},{"$f":"COUNTIF($D262:$AL262,$AU$1)/$AV$1","v":{"$error":"#DIV/0!"}},{"$f":"COUNTIF($D262:$AL262,$AU$2)/$AV$1","v":{"$error":"#DIV/0!"}},{"$f":"COUNTIF($D262:$AL262,$AU$3)/$AV$1","v":{"$error":"#DIV/0!"}},{"$f":"COUNTIF($D262:$AL262,$AU$4)/$AV$1","v":{"$error":"#DIV/0!"}},{"$f":"COUNTIF(D262:$AL262,\"NE\")/$AV$1","v":{"$error":"#DIV/0!"}},{"$error":"#DIV/0!"}]
[263,{"$nulls":38},{"$error":"#DIV/0!"},{"$error":"#DIV/0!"},{"$error":"#DIV/0!"},{"$error":"#DIV/0!"},{"$f":"COUNTIF(D263:$AL263,\"NE\")/$AV$1","v":{"$error":"#DIV/0!"}},{"$f":"AN263+(AO263*0.66)+(AP263*0.33)","v":{"$error":"#DIV/0!"}}]
[264,{"$nulls":38},{"$error":"#DIV/0!"},{"$error":"#DIV/0!"},{"$error":"#DIV/0!"},{"$error":"#DIV/0!"},{"$f":"COUNTIF(D264:$AL264,\"NE\")/$AV$1","v":{"$error":"#DIV/0!"}},{"$error":"#DIV/0!"}]
[265,{"$nulls":38},{"$error":"#DIV/0!"},{"$error":"#DIV/0!"},{"$error":"#DIV/0!"},{"$error":"#DIV/0!"},{"$f":"COUNTIF(D265:$AL265,\"NE\")/$AV$1","v":{"$error":"#DIV/0!"}},{"$error":"#DIV/0!"}]
[266,{"$nulls":38},{"$error":"#DIV/0!"},{"$error":"#DIV/0!"},{"$error":"#DIV/0!"},{"$error":"#DIV/0!"},{"$f":"COUNTIF(D266:$AL266,\"NE\")/$AV$1","v":{"$error":"#DIV/0!"}},{"$error":"#DIV/0!"}]
[267,{"$nulls":38},{"$error":"#DIV/0!"},{"$error":"#DIV/0!"},{"$error":"#DIV/0!"},{"$error":"#DIV/0!"},{"$f":"COUNTIF(D267:$AL267,\"NE\")/$AV$1","v":{"$error":"#DIV/0!"}},{"$error":"#DIV/0!"}]
[268,{"$nulls":38},{"$error":"#DIV/0!"},{"$error":"#DIV/0!"},{"$error":"#DIV/0!"},{"$error":"#DIV/0!"},{"$f":"COUNTIF(D268:$AL268,\"NE\")/$AV$1","v":{"$error":"#DIV/0!"}},{"$error":"#DIV/0!"}]
[269,{"$nulls":38},{"$error":"#DIV/0!"},{"$error":"#DIV/0!"},{"$error":"#DIV/0!"},{"$error":"#DIV/0!"},{"$f":"COUNTIF(D269:$AL269,\"NE\")/$AV$1","v":{"$error":"#DIV/0!"}},{"$error":"#DIV/0!"}]
[270,{"$nulls":38},{"$error":"#DIV/0!"},{"$error":"#DIV/0!"},{"$error":"#DIV/0!"},{"$error":"#DIV/0!"},{"$f":"COUNTIF(D270:$AL270,\"NE\")/$AV$1","v":{"$error":"#DIV/0!"}},{"$error":"#DIV/0!"}]
[271,{"$nulls":38},{"$error":"#DIV/0!"},{"$error":"#DIV/0!"},{"$error":"#DIV/0!"},{"$error":"#DIV/0!"},{"$f":"COUNTIF(D271:$AL271,\"NE\")/$AV$1","v":{"$error":"#DIV/0!"}},{"$error":"#DIV/0!"}]
[272,{"$nulls":38},{"$error":"#DIV/0!"},{"$error":"#DIV/0!"},{"$error":"#DIV/0!"},{"$error":"#DIV/0!"},{"$f":"COUNTIF(D272:$AL272,\"NE\")/$AV$1","v":{"$error":"#DIV/0!"}},{"$error":"#DIV/0!"}]
[273,{"$nulls":38},{"$error":"#DIV/0!"},{"$error":"#DIV/0!"},{"$error":"#DIV/0!"},{"$error":"#DIV/0!"},{"$f":"COUNTIF(D273:$AL273,\"NE\")/$AV$1","v":{"$error":"#DIV/0!"}},{"$error":"#DIV/0!"}]
[274,{"$nulls":38},{"$error":"#DIV/0!"},{"$error":"#DIV/0!"},{"$error":"#DIV/0!"},{"$error":"#DIV/0!"},{"$f":"COUNTIF(D274:$AL274,\"NE\")/$AV$1","v":{"$error":"#DIV/0!"}},{"$error":"#DIV/0!"}]
[275,{"$nulls":38},{"$error":"#DIV/0!"},{"$error":"#DIV/0!"},{"$error":"#DIV/0!"},{"$error":"#DIV/0!"},{"$f":"COUNTIF(D275:$AL275,\"NE\")/$AV$1","v":{"$error":"#DIV/0!"}},{"$error":"#DIV/0!"}]
[276,{"$nulls":38},{"$error":"#DIV/0!"},{"$error":"#DIV/0!"},{"$error":"#DIV/0!"},{"$error":"#DIV/0!"},{"$f":"COUNTIF(D276:$AL276,\"NE\")/$AV$1","v":{"$error":"#DIV/0!"}},{"$error":"#DIV/0!"}]
[277,{"$nulls":38},{"$error":"#DIV/0!"},{"$error":"#DIV/0!"},{"$error":"#DIV/0!"},{"$error":"#DIV/0!"},{"$f":"COUNTIF(D277:$AL277,\"NE\")/$AV$1","v":{"$error":"#DIV/0!"}},{"$error":"#DIV/0!"}]
[278,{"$nulls":38},{"$error":"#DIV/0!"},{"$error":"#DIV/0!"},{"$error":"#DIV/0!"},{"$error":"#DIV/0!"},{"$f":"COUNTIF(D278:$AL278,\"NE\")/$AV$1","v":{"$error":"#DIV/0!"}},{"$error":"#DIV/0!"}]
[279,{"$nulls":38},{"$error":"#DIV/0!"},{"$error":"#DIV/0!"},{"$error":"#DIV/0!"},{"$error":"#DIV/0!"},{"$f":"COUNTIF(D279:$AL279,\"NE\")/$AV$1","v":{"$error":"#DIV/0!"}},{"$error":"#DIV/0!"}]
[280,{"$nulls":38},{"$error":"#DIV/0!"},{"$error":"#DIV/0!"},{"$error":"#DIV/0!"},{"$error":"#DIV/0!"},{"$f":"COUNTIF(D280:$AL280,\"NE\")/$AV$1","v":{"$error":"#DIV/0!"}},{"$error":"#DIV/0!"}]
[281,{"$nulls":38},{"$error":"#DIV/0!"},{"$error":"#DIV/0!"},{"$error":"#DIV/0!"},{"$error":"#DIV/0!"},{"$f":"COUNTIF(D281:$AL281,\"NE\")/$AV$1","v":{"$error":"#DIV/0!"}},{"$error":"#DIV/0!"}]
[282,{"$nulls":38},{"$error":"#DIV/0!"},{"$error":"#DIV/0!"},{"$error":"#DIV/0!"},{"$error":"#DIV/0!"},{"$f":"COUNTIF(D282:$AL282,\"NE\")/$AV$1","v":{"$error":"#DIV/0!"}},{"$error":"#DIV/0!"}]
[283,{"$nulls":38},{"$error":"#DIV/0!"},{"$error":"#DIV/0!"},{"$error":"#DIV/0!"},{"$error":"#DIV/0!"},{"$f":"COUNTIF(D283:$AL283,\"NE\")/$AV$1","v":{"$error":"#DIV/0!"}},{"$error":"#DIV/0!"}]
[284,{"$nulls":38},{"$error":"#DIV/0!"},{"$error":"#DIV/0!"},{"$error":"#DIV/0!"},{"$error":"#DIV/0!"},{"$f":"COUNTIF(D284:$AL284,\"NE\")/$AV$1","v":{"$error":"#DIV/0!"}},{"$error":"#DIV/0!"}]
[285,{"$nulls":38},{"$error":"#DIV/0!"},{"$error":"#DIV/0!"},{"$error":"#DIV/0!"},{"$error":"#DIV/0!"},{"$f":"COUNTIF(D285:$AL285,\"NE\")/$AV$1","v":{"$error":"#DIV/0!"}},{"$error":"#DIV/0!"}]
[286,{"$nulls":38},{"$error":"#DIV/0!"},{"$error":"#DIV/0!"},{"$error":"#DIV/0!"},{"$error":"#DIV/0!"},{"$f":"COUNTIF(D286:$AL286,\"NE\")/$AV$1","v":{"$error":"#DIV/0!"}},{"$error":"#DIV/0!"}]
[287,{"$nulls":38},{"$error":"#DIV/0!"},{"$error":"#DIV/0!"},{"$error":"#DIV/0!"},{"$error":"#DIV/0!"},{"$f":"COUNTIF(D287:$AL287,\"NE\")/$AV$1","v":{"$error":"#DIV/0!"}},{"$error":"#DIV/0!"}]
[288,{"$nulls":38},{"$error":"#DIV/0!"},{"$error":"#DIV/0!"},{"$error":"#DIV/0!"},{"$error":"#DIV/0!"},{"$f":"COUNTIF(D288:$AL288,\"NE\")/$AV$1","v":{"$error":"#DIV/0!"}},{"$error":"#DIV/0!"}]
[289,{"$nulls":38},{"$error":"#DIV/0!"},{"$error":"#DIV/0!"},{"$error":"#DIV/0!"},{"$error":"#DIV/0!"},{"$f":"COUNTIF(D289:$AL289,\"NE\")/$AV$1","v":{"$error":"#DIV/0!"}},{"$error":"#DIV/0!"}]
[290,{"$nulls":38},{"$error":"#DIV/0!"},{"$error":"#DIV/0!"},{"$error":"#DIV/0!"},{"$error":"#DIV/0!"},{"$f":"COUNTIF(D290:$AL290,\"NE\")/$AV$1","v":{"$error":"#DIV/0!"}},{"$error":"#DIV/0!"}]
[291,{"$nulls":38},{"$error":"#DIV/0!"},{"$error":"#DIV/0!"},{"$error":"#DIV/0!"},{"$error":"#DIV/0!"},{"$f":"COUNTIF(D291:$AL291,\"NE\")/$AV$1","v":{"$error":"#DIV/0!"}},{"$error":"#DIV/0!"}]
[292,{"$nulls":38},{"$error":"#DIV/0!"},{"$error":"#DIV/0!"},{"$error":"#DIV/0!"},{"$error":"#DIV/0!"},{"$f":"COUNTIF(D292:$AL292,\"NE\")/$AV$1","v":{"$error":"#DIV/0!"}},{"$error":"#DIV/0!"}]
[293,{"$nulls":38},{"$error":"#DIV/0!"},{"$error":"#DIV/0!"},{"$error":"#DIV/0!"},{"$error":"#DIV/0!"},{"$f":"COUNTIF(D293:$AL293,\"NE\")/$AV$1","v":{"$error":"#DIV/0!"}},{"$error":"#DIV/0!"}]
[294,{"$nulls":38},{"$error":"#DIV/0!"},{"$error":"#DIV/0!"},{"$error":"#DIV/0!"},{"$error":"#DIV/0!"},{"$f":"COUNTIF(D294:$AL294,\"NE\")/$AV$1","v":{"$error":"#DIV/0!"}},{"$error":"#DIV/0!"}]
[295,{"$nulls":38},{"$error":"#DIV/0!"},{"$error":"#DIV/0!"},{"$error":"#DIV/0!"},{"$error":"#DIV/0!"},{"$f":"COUNTIF(D295:$AL295,\"NE\")/$AV$1","v":{"$error":"#DIV/0!"}},{"$error":"#DIV/0!"}]
[296,{"$nulls":38},{"$error":"#DIV/0!"},{"$error":"#DIV/0!"},{"$error":"#DIV/0!"},{"$error":"#DIV/0!"},{"$f":"COUNTIF(D296:$AL296,\"NE\")/$AV$1","v":{"$error":"#DIV/0!"}},{"$error":"#DIV/0!"}]
[297,{"$nulls":38},{"$error":"#DIV/0!"},{"$error":"#DIV/0!"},{"$error":"#DIV/0!"},{"$error":"#DIV/0!"},{"$f":"COUNTIF(D297:$AL297,\"NE\")/$AV$1","v":{"$error":"#DIV/0!"}},{"$error":"#DIV/0!"}]
[298,{"$nulls":38},{"$error":"#DIV/0!"},{"$error":"#DIV/0!"},{"$error":"#DIV/0!"},{"$error":"#DIV/0!"},{"$f":"COUNTIF(D298:$AL298,\"NE\")/$AV$1","v":{"$error":"#DIV/0!"}},{"$error":"#DIV/0!"}]
[299,{"$nulls":38},{"$error":"#DIV/0!"},{"$error":"#DIV/0!"},{"$error":"#DIV/0!"},{"$error":"#DIV/0!"},{"$f":"COUNTIF(D299:$AL299,\"NE\")/$AV$1","v":{"$error":"#DIV/0!"}},{"$error":"#DIV/0!"}]
[300,{"$nulls":38},{"$error":"#DIV/0!"},{"$error":"#DIV/0!"},{"$error":"#DIV/0!"},{"$error":"#DIV/0!"},{"$f":"COUNTIF(D300:$AL300,\"NE\")/$AV$1","v":{"$error":"#DIV/0!"}},{"$error":"#DIV/0!"}]
[301,{"$nulls":38},{"$error":"#DIV/0!"},{"$error":"#DIV/0!"},{"$error":"#DIV/0!"},{"$error":"#DIV/0!"},{"$f":"COUNTIF(D301:$AL301,\"NE\")/$AV$1","v":{"$error":"#DIV/0!"}},{"$error":"#DIV/0!"}]
[302,{"$nulls":38},{"$error":"#DIV/0!"},{"$error":"#DIV/0!"},{"$error":"#DIV/0!"},{"$error":"#DIV/0!"},{"$f":"COUNTIF(D302:$AL302,\"NE\")/$AV$1","v":{"$error":"#DIV/0!"}},{"$error":"#DIV/0!"}]
[303,{"$nulls":38},{"$error":"#DIV/0!"},{"$error":"#DIV/0!"},{"$error":"#DIV/0!"},{"$error":"#DIV/0!"},{"$f":"COUNTIF(D303:$AL303,\"NE\")/$AV$1","v":{"$error":"#DIV/0!"}},{"$error":"#DIV/0!"}]
[304,{"$nulls":38},{"$error":"#DIV/0!"},{"$error":"#DIV/0!"},{"$error":"#DIV/0!"},{"$error":"#DIV/0!"},{"$f":"COUNTIF(D304:$AL304,\"NE\")/$AV$1","v":{"$error":"#DIV/0!"}},{"$error":"#DIV/0!"}]
[305,{"$nulls":38},{"$error":"#DIV/0!"},{"$error":"#DIV/0!"},{"$error":"#DIV/0!"},{"$error":"#DIV/0!"},{"$f":"COUNTIF(D305:$AL305,\"NE\")/$AV$1","v":{"$error":"#DIV/0!"}},{"$error":"#DIV/0!"}]
[306,{"$nulls":38},{"$error":"#DIV/0!"},{"$error":"#DIV/0!"},{"$error":"#DIV/0!"},{"$error":"#DIV/0!"},{"$f":"COUNTIF(D306:$AL306,\"NE\")/$AV$1","v":{"$error":"#DIV/0!"}},{"$error":"#DIV/0!"}]
[307,{"$nulls":38},{"$error":"#DIV/0!"},{"$error":"#DIV/0!"},{"$error":"#DIV/0!"},{"$error":"#DIV/0!"},{"$f":"COUNTIF(D307:$AL307,\"NE\")/$AV$1","v":{"$error":"#DIV/0!"}},{"$error":"#DIV/0!"}]
[308,{"$nulls":38},{"$error":"#DIV/0!"},{"$error":"#DIV/0!"},{"$error":"#DIV/0!"},{"$error":"#DIV/0!"},{"$f":"COUNTIF(D308:$AL308,\"NE\")/$AV$1","v":{"$error":"#DIV/0!"}},{"$error":"#DIV/0!"}]
[309,{"$nulls":38},{"$error":"#DIV/0!"},{"$error":"#DIV/0!"},{"$error":"#DIV/0!"},{"$error":"#DIV/0!"},{"$f":"COUNTIF(D309:$AL309,\"NE\")/$AV$1","v":{"$error":"#DIV/0!"}},{"$error":"#DIV/0!"}]
[310,{"$nulls":38},{"$error":"#DIV/0!"},{"$error":"#DIV/0!"},{"$error":"#DIV/0!"},{"$error":"#DIV/0!"},{"$f":"COUNTIF(D310:$AL310,\"NE\")/$AV$1","v":{"$error":"#DIV/0!"}},{"$error":"#DIV/0!"}]
[311,{"$nulls":38},{"$error":"#DIV/0!"},{"$error":"#DIV/0!"},{"$error":"#DIV/0!"},{"$error":"#DIV/0!"},{"$f":"COUNTIF(D311:$AL311,\"NE\")/$AV$1","v":{"$error":"#DIV/0!"}},{"$error":"#DIV/0!"}]
[312,{"$nulls":38},{"$error":"#DIV/0!"},{"$error":"#DIV/0!"},{"$error":"#DIV/0!"},{"$error":"#DIV/0!"},{"$f":"COUNTIF(D312:$AL312,\"NE\")/$AV$1","v":{"$error":"#DIV/0!"}},{"$error":"#DIV/0!"}]
[313,{"$nulls":38},{"$error":"#DIV/0!"},{"$error":"#DIV/0!"},{"$error":"#DIV/0!"},{"$error":"#DIV/0!"},{"$f":"COUNTIF(D313:$AL313,\"NE\")/$AV$1","v":{"$error":"#DIV/0!"}},{"$error":"#DIV/0!"}]
[314,{"$nulls":38},{"$error":"#DIV/0!"},{"$error":"#DIV/0!"},{"$error":"#DIV/0!"},{"$error":"#DIV/0!"},{"$f":"COUNTIF(D314:$AL314,\"NE\")/$AV$1","v":{"$error":"#DIV/0!"}},{"$error":"#DIV/0!"}]
[315,{"$nulls":38},{"$error":"#DIV/0!"},{"$error":"#DIV/0!"},{"$error":"#DIV/0!"},{"$error":"#DIV/0!"},{"$f":"COUNTIF(D315:$AL315,\"NE\")/$AV$1","v":{"$error":"#DIV/0!"}},{"$error":"#DIV/0!"}]
[316,{"$nulls":38},{"$error":"#DIV/0!"},{"$error":"#DIV/0!"},{"$error":"#DIV/0!"},{"$error":"#DIV/0!"},{"$f":"COUNTIF(D316:$AL316,\"NE\")/$AV$1","v":{"$error":"#DIV/0!"}},{"$error":"#DIV/0!"}]
[317,{"$nulls":38},{"$error":"#DIV/0!"},{"$error":"#DIV/0!"},{"$error":"#DIV/0!"},{"$error":"#DIV/0!"},{"$f":"COUNTIF(D317:$AL317,\"NE\")/$AV$1","v":{"$error":"#DIV/0!"}},{"$error":"#DIV/0!"}]
[318,{"$nulls":38},{"$error":"#DIV/0!"},{"$error":"#DIV/0!"},{"$error":"#DIV/0!"},{"$error":"#DIV/0!"},{"$f":"COUNTIF(D318:$AL318,\"NE\")/$AV$1","v":{"$error":"#DIV/0!"}},{"$error":"#DIV/0!"}]
[319,{"$nulls":38},{"$error":"#DIV/0!"},{"$error":"#DIV/0!"},{"$error":"#DIV/0!"},{"$error":"#DIV/0!"},{"$f":"COUNTIF(D319:$AL319,\"NE\")/$AV$1","v":{"$error":"#DIV/0!"}},{"$error":"#DIV/0!"}]
[320,{"$nulls":38},{"$error":"#DIV/0!"},{"$error":"#DIV/0!"},{"$error":"#DIV/0!"},{"$error":"#DIV/0!"},{"$f":"COUNTIF(D320:$AL320,\"NE\")/$AV$1","v":{"$error":"#DIV/0!"}},{"$error":"#DIV/0!"}]
[321,{"$nulls":38},{"$error":"#DIV/0!"},{"$error":"#DIV/0!"},{"$error":"#DIV/0!"},{"$error":"#DIV/0!"},{"$f":"COUNTIF(D321:$AL321,\"NE\")/$AV$1","v":{"$error":"#DIV/0!"}},{"$error":"#DIV/0!"}]
[322,{"$nulls":38},{"$error":"#DIV/0!"},{"$error":"#DIV/0!"},{"$error":"#DIV/0!"},{"$error":"#DIV/0!"},{"$f":"COUNTIF(D322:$AL322,\"NE\")/$AV$1","v":{"$error":"#DIV/0!"}},{"$error":"#DIV/0!"}]
[323,{"$nulls":38},{"$error":"#DIV/0!"},{"$error":"#DIV/0!"},{"$error":"#DIV/0!"},{"$error":"#DIV/0!"},{"$f":"COUNTIF(D323:$AL323,\"NE\")/$AV$1","v":{"$error":"#DIV/0!"}},{"$error":"#DIV/0!"}]
[324,{"$nulls":38},{"$error":"#DIV/0!"},{"$error":"#DIV/0!"},{"$error":"#DIV/0!"},{"$error":"#DIV/0!"},{"$f":"COUNTIF(D324:$AL324,\"NE\")/$AV$1","v":{"$error":"#DIV/0!"}},{"$error":"#DIV/0!"}]
[325,{"$nulls":38},{"$error":"#DIV/0!"},{"$error":"#DIV/0!"},{"$error":"#DIV/0!"},{"$error":"#DIV/0!"},{"$f":"COUNTIF(D325:$AL325,\"NE\")/$AV$1","v":{"$error":"#DIV/0!"}},{"$error":"#DIV/0!"}]
[326,{"$nulls":38},{"$f":"COUNTIF($D326:$AL326,$AU$1)/$AV$1","v":{"$error":"#DIV/0!"}},{"$f":"COUNTIF($D326:$AL326,$AU$2)/$AV$1","v":{"$error":"#DIV/0!"}},{"$f":"COUNTIF($D326:$AL326,$AU$3)/$AV$1","v":{"$error":"#DIV/0!"}},{"$f":"COUNTIF($D326:$AL326,$AU$4)/$AV$1","v":{"$error":"#DIV/0!"}},{"$f":"COUNTIF(D326:$AL326,\"NE\")/$AV$1","v":{"$error":"#DIV/0!"}},{"$error":"#DIV/0!"}]
[327,{"$nulls":38},{"$error":"#DIV/0!"},{"$error":"#DIV/0!"},{"$error":"#DIV/0!"},{"$error":"#DIV/0!"},{"$f":"COUNTIF(D327:$AL327,\"NE\")/$AV$1","v":{"$error":"#DIV/0!"}},{"$f":"AN327+(AO327*0.66)+(AP327*0.33)","v":{"$error":"#DIV/0!"}}]
[328,{"$nulls":38},{"$error":"#DIV/0!"},{"$error":"#DIV/0!"},{"$error":"#DIV/0!"},{"$error":"#DIV/0!"},{"$f":"COUNTIF(D328:$AL328,\"NE\")/$AV$1","v":{"$error":"#DIV/0!"}},{"$error":"#DIV/0!"}]
[329,{"$nulls":38},{"$error":"#DIV/0!"},{"$error":"#DIV/0!"},{"$error":"#DIV/0!"},{"$error":"#DIV/0!"},{"$f":"COUNTIF(D329:$AL329,\"NE\")/$AV$1","v":{"$error":"#DIV/0!"}},{"$error":"#DIV/0!"}]
[330,{"$nulls":38},{"$error":"#DIV/0!"},{"$error":"#DIV/0!"},{"$error":"#DIV/0!"},{"$error":"#DIV/0!"},{"$f":"COUNTIF(D330:$AL330,\"NE\")/$AV$1","v":{"$error":"#DIV/0!"}},{"$error":"#DIV/0!"}]
[331,{"$nulls":38},{"$error":"#DIV/0!"},{"$error":"#DIV/0!"},{"$error":"#DIV/0!"},{"$error":"#DIV/0!"},{"$f":"COUNTIF(D331:$AL331,\"NE\")/$AV$1","v":{"$error":"#DIV/0!"}},{"$error":"#DIV/0!"}]
[332,{"$nulls":38},{"$error":"#DIV/0!"},{"$error":"#DIV/0!"},{"$error":"#DIV/0!"},{"$error":"#DIV/0!"},{"$f":"COUNTIF(D332:$AL332,\"NE\")/$AV$1","v":{"$error":"#DIV/0!"}},{"$error":"#DIV/0!"}]
[333,{"$nulls":38},{"$error":"#DIV/0!"},{"$error":"#DIV/0!"},{"$error":"#DIV/0!"},{"$error":"#DIV/0!"},{"$f":"COUNTIF(D333:$AL333,\"NE\")/$AV$1","v":{"$error":"#DIV/0!"}},{"$error":"#DIV/0!"}]
[334,{"$nulls":38},{"$error":"#DIV/0!"},{"$error":"#DIV/0!"},{"$error":"#DIV/0!"},{"$error":"#DIV/0!"},{"$f":"COUNTIF(D334:$AL334,\"NE\")/$AV$1","v":{"$error":"#DIV/0!"}},{"$error":"#DIV/0!"}]
[335,{"$nulls":38},{"$error":"#DIV/0!"},{"$error":"#DIV/0!"},{"$error":"#DIV/0!"},{"$error":"#DIV/0!"},{"$f":"COUNTIF(D335:$AL335,\"NE\")/$AV$1","v":{"$error":"#DIV/0!"}},{"$error":"#DIV/0!"}]
[336,{"$nulls":38},{"$error":"#DIV/0!"},{"$error":"#DIV/0!"},{"$error":"#DIV/0!"},{"$error":"#DIV/0!"},{"$f":"COUNTIF(D336:$AL336,\"NE\")/$AV$1","v":{"$error":"#DIV/0!"}},{"$error":"#DIV/0!"}]
[337,{"$nulls":38},{"$error":"#DIV/0!"},{"$error":"#DIV/0!"},{"$error":"#DIV/0!"},{"$error":"#DIV/0!"},{"$f":"COUNTIF(D337:$AL337,\"NE\")/$AV$1","v":{"$error":"#DIV/0!"}},{"$error":"#DIV/0!"}]
[338,{"$nulls":38},{"$error":"#DIV/0!"},{"$error":"#DIV/0!"},{"$error":"#DIV/0!"},{"$error":"#DIV/0!"},{"$f":"COUNTIF(D338:$AL338,\"NE\")/$AV$1","v":{"$error":"#DIV/0!"}},{"$error":"#DIV/0!"}]
[339,{"$nulls":38},{"$error":"#DIV/0!"},{"$error":"#DIV/0!"},{"$error":"#DIV/0!"},{"$error":"#DIV/0!"},{"$f":"COUNTIF(D339:$AL339,\"NE\")/$AV$1","v":{"$error":"#DIV/0!"}},{"$error":"#DIV/0!"}]
[340,{"$nulls":38},{"$error":"#DIV/0!"},{"$error":"#DIV/0!"},{"$error":"#DIV/0!"},{"$error":"#DIV/0!"},{"$f":"COUNTIF(D340:$AL340,\"NE\")/$AV$1","v":{"$error":"#DIV/0!"}},{"$error":"#DIV/0!"}]
[341,{"$nulls":38},{"$error":"#DIV/0!"},{"$error":"#DIV/0!"},{"$error":"#DIV/0!"},{"$error":"#DIV/0!"},{"$f":"COUNTIF(D341:$AL341,\"NE\")/$AV$1","v":{"$error":"#DIV/0!"}},{"$error":"#DIV/0!"}]
[342,{"$nulls":38},{"$error":"#DIV/0!"},{"$error":"#DIV/0!"},{"$error":"#DIV/0!"},{"$error":"#DIV/0!"},{"$f":"COUNTIF(D342:$AL342,\"NE\")/$AV$1","v":{"$error":"#DIV/0!"}},{"$error":"#DIV/0!"}]
[343,{"$nulls":38},{"$error":"#DIV/0!"},{"$error":"#DIV/0!"},{"$error":"#DIV/0!"},{"$error":"#DIV/0!"},{"$f":"COUNTIF(D343:$AL343,\"NE\")/$AV$1","v":{"$error":"#DIV/0!"}},{"$error":"#DIV/0!"}]
[344,{"$nulls":38},{"$error":"#DIV/0!"},{"$error":"#DIV/0!"},{"$error":"#DIV/0!"},{"$error":"#DIV/0!"},{"$f":"COUNTIF(D344:$AL344,\"NE\")/$AV$1","v":{"$error":"#DIV/0!"}},{"$error":"#DIV/0!"}]
[345,{"$nulls":38},{"$error":"#DIV/0!"},{"$error":"#DIV/0!"},{"$error":"#DIV/0!"},{"$error":"#DIV/0!"},{"$f":"COUNTIF(D345:$AL345,\"NE\")/$AV$1","v":{"$error":"#DIV/0!"}},{"$error":"#DIV/0!"}]
[346,{"$nulls":38},{"$error":"#DIV/0!"},{"$error":"#DIV/0!"},{"$error":"#DIV/0!"},{"$error":"#DIV/0!"},{"$f":"COUNTIF(D346:$AL346,\"NE\")/$AV$1","v":{"$error":"#DIV/0!"}},{"$error":"#DIV/0!"}]
[347,{"$nulls":38},{"$error":"#DIV/0!"},{"$error":"#DIV/0!"},{"$error":"#DIV/0!"},{"$error":"#DIV/0!"},{"$f":"COUNTIF(D347:$AL347,\"NE\")/$AV$1","v":{"$error":"#DIV/0!"}},{"$error":"#DIV/0!"}]
[348,{"$nulls":38},{"$error":"#DIV/0!"},{"$error":"#DIV/0!"},{"$error":"#DIV/0!"},{"$error":"#DIV/0!"},{"$f":"COUNTIF(D348:$AL348,\"NE\")/$AV$1","v":{"$error":"#DIV/0!"}},{"$error":"#DIV/0!"}]
[349,{"$nulls":38},{"$error":"#DIV/0!"},{"$error":"#DIV/0!"},{"$error":"#DIV/0!"},{"$error":"#DIV/0!"},{"$f":"COUNTIF(D349:$AL349,\"NE\")/$AV$1","v":{"$error":"#DIV/0!"}},{"$error":"#DIV/0!"}]
[350,{"$nulls":38},{"$error":"#DIV/0!"},{"$error":"#DIV/0!"},{"$error":"#DIV/0!"},{"$error":"#DIV/0!"},{"$f":"COUNTIF(D350:$AL350,\"NE\")/$AV$1","v":{"$error":"#DIV/0!"}},{"$error":"#DIV/0!"}]
[351,{"$nulls":38},{"$error":"#DIV/0!"},{"$error":"#DIV/0!"},{"$error":"#DIV/0!"},{"$error":"#DIV/0!"},{"$f":"COUNTIF(D351:$AL351,\"NE\")/$AV$1","v":{"$error":"#DIV/0!"}},{"$error":"#DIV/0!"}]
[352,{"$nulls":38},{"$error":"#DIV/0!"},{"$error":"#DIV/0!"},{"$error":"#DIV/0!"},{"$error":"#DIV/0!"},{"$f":"COUNTIF(D352:$AL352,\"NE\")/$AV$1","v":{"$error":"#DIV/0!"}},{"$error":"#DIV/0!"}]
[353,{"$nulls":38},{"$error":"#DIV/0!"},{"$error":"#DIV/0!"},{"$error":"#DIV/0!"},{"$error":"#DIV/0!"},{"$f":"COUNTIF(D353:$AL353,\"NE\")/$AV$1","v":{"$error":"#DIV/0!"}},{"$error":"#DIV/0!"}]
[354,{"$nulls":38},{"$error":"#DIV/0!"},{"$error":"#DIV/0!"},{"$error":"#DIV/0!"},{"$error":"#DIV/0!"},{"$f":"COUNTIF(D354:$AL354,\"NE\")/$AV$1","v":{"$error":"#DIV/0!"}},{"$error":"#DIV/0!"}]
[355,{"$nulls":38},{"$error":"#DIV/0!"},{"$error":"#DIV/0!"},{"$error":"#DIV/0!"},{"$error":"#DIV/0!"},{"$f":"COUNTIF(D355:$AL355,\"NE\")/$AV$1","v":{"$error":"#DIV/0!"}},{"$error":"#DIV/0!"}]
[356,{"$nulls":38},{"$error":"#DIV/0!"},{"$error":"#DIV/0!"},{"$error":"#DIV/0!"},{"$error":"#DIV/0!"},{"$f":"COUNTIF(D356:$AL356,\"NE\")/$AV$1","v":{"$error":"#DIV/0!"}},{"$error":"#DIV/0!"}]
[357,{"$nulls":38},{"$error":"#DIV/0!"},{"$error":"#DIV/0!"},{"$error":"#DIV/0!"},{"$error":"#DIV/0!"},{"$f":"COUNTIF(D357:$AL357,\"NE\")/$AV$1","v":{"$error":"#DIV/0!"}},{"$error":"#DIV/0!"}]
[358,{"$nulls":38},{"$error":"#DIV/0!"},{"$error":"#DIV/0!"},{"$error":"#DIV/0!"},{"$error":"#DIV/0!"},{"$f":"COUNTIF(D358:$AL358,\"NE\")/$AV$1","v":{"$error":"#DIV/0!"}},{"$error":"#DIV/0!"}]
[359,{"$nulls":38},{"$error":"#DIV/0!"},{"$error":"#DIV/0!"},{"$error":"#DIV/0!"},{"$error":"#DIV/0!"},{"$f":"COUNTIF(D359:$AL359,\"NE\")/$AV$1","v":{"$error":"#DIV/0!"}},{"$error":"#DIV/0!"}]
[360,{"$nulls":38},{"$error":"#DIV/0!"},{"$error":"#DIV/0!"},{"$error":"#DIV/0!"},{"$error":"#DIV/0!"},{"$f":"COUNTIF(D360:$AL360,\"NE\")/$AV$1","v":{"$error":"#DIV/0!"}},{"$error":"#DIV/0!"}]
[361,{"$nulls":38},{"$error":"#DIV/0!"},{"$error":"#DIV/0!"},{"$error":"#DIV/0!"},{"$error":"#DIV/0!"},{"$f":"COUNTIF(D361:$AL361,\"NE\")/$AV$1","v":{"$error":"#DIV/0!"}},{"$error":"#DIV/0!"}]
[362,{"$nulls":38},{"$error":"#DIV/0!"},{"$error":"#DIV/0!"},{"$error":"#DIV/0!"},{"$error":"#DIV/0!"},{"$f":"COUNTIF(D362:$AL362,\"NE\")/$AV$1","v":{"$error":"#DIV/0!"}},{"$error":"#DIV/0!"}]
[363,{"$nulls":38},{"$error":"#DIV/0!"},{"$error":"#DIV/0!"},{"$error":"#DIV/0!"},{"$error":"#DIV/0!"},{"$f":"COUNTIF(D363:$AL363,\"NE\")/$AV$1","v":{"$error":"#DIV/0!"}},{"$error":"#DIV/0!"}]
[364,{"$nulls":38},{"$error":"#DIV/0!"},{"$error":"#DIV/0!"},{"$error":"#DIV/0!"},{"$error":"#DIV/0!"},{"$f":"COUNTIF(D364:$AL364,\"NE\")/$AV$1","v":{"$error":"#DIV/0!"}},{"$error":"#DIV/0!"}]
[365,{"$nulls":38},{"$error":"#DIV/0!"},{"$error":"#DIV/0!"},{"$error":"#DIV/0!"},{"$error":"#DIV/0!"},{"$f":"COUNTIF(D365:$AL365,\"NE\")/$AV$1","v":{"$error":"#DIV/0!"}},{"$error":"#DIV/0!"}]
[366,{"$nulls":38},{"$error":"#DIV/0!"},{"$error":"#DIV/0!"},{"$error":"#DIV/0!"},{"$error":"#DIV/0!"},{"$f":"COUNTIF(D366:$AL366,\"NE\")/$AV$1","v":{"$error":"#DIV/0!"}},{"$error":"#DIV/0!"}]
[367,{"$nulls":38},{"$error":"#DIV/0!"},{"$error":"#DIV/0!"},{"$error":"#DIV/0!"},{"$error":"#DIV/0!"},{"$f":"COUNTIF(D367:$AL367,\"NE\")/$AV$1","v":{"$error":"#DIV/0!"}},{"$error":"#DIV/0!"}]
[368,{"$nulls":38},{"$error":"#DIV/0!"},{"$error":"#DIV/0!"},{"$error":"#DIV/0!"},{"$error":"#DIV/0!"},{"$f":"COUNTIF(D368:$AL368,\"NE\")/$AV$1","v":{"$error":"#DIV/0!"}},{"$error":"#DIV/0!"}]
[369,{"$nulls":38},{"$error":"#DIV/0!"},{"$error":"#DIV/0!"},{"$error":"#DIV/0!"},{"$error":"#DIV/0!"},{"$f":"COUNTIF(D369:$AL369,\"NE\")/$AV$1","v":{"$error":"#DIV/0!"}},{"$error":"#DIV/0!"}]
[370,{"$nulls":38},{"$error":"#DIV/0!"},{"$error":"#DIV/0!"},{"$error":"#DIV/0!"},{"$error":"#DIV/0!"},{"$f":"COUNTIF(D370:$AL370,\"NE\")/$AV$1","v":{"$error":"#DIV/0!"}},{"$error":"#DIV/0!"}]
[371,{"$nulls":38},{"$error":"#DIV/0!"},{"$error":"#DIV/0!"},{"$error":"#DIV/0!"},{"$error":"#DIV/0!"},{"$f":"COUNTIF(D371:$AL371,\"NE\")/$AV$1","v":{"$error":"#DIV/0!"}},{"$error":"#DIV/0!"}]
[372,{"$nulls":38},{"$error":"#DIV/0!"},{"$error":"#DIV/0!"},{"$error":"#DIV/0!"},{"$error":"#DIV/0!"},{"$f":"COUNTIF(D372:$AL372,\"NE\")/$AV$1","v":{"$error":"#DIV/0!"}},{"$error":"#DIV/0!"}]
[373,{"$nulls":38},{"$error":"#DIV/0!"},{"$error":"#DIV/0!"},{"$error":"#DIV/0!"},{"$error":"#DIV/0!"},{"$f":"COUNTIF(D373:$AL373,\"NE\")/$AV$1","v":{"$error":"#DIV/0!"}},{"$error":"#DIV/0!"}]
[374,{"$nulls":38},{"$error":"#DIV/0!"},{"$error":"#DIV/0!"},{"$error":"#DIV/0!"},{"$error":"#DIV/0!"},{"$f":"COUNTIF(D374:$AL374,\"NE\")/$AV$1","v":{"$error":"#DIV/0!"}},{"$error":"#DIV/0!"}]
[375,{"$nulls":38},{"$error":"#DIV/0!"},{"$error":"#DIV/0!"},{"$error":"#DIV/0!"},{"$error":"#DIV/0!"},{"$f":"COUNTIF(D375:$AL375,\"NE\")/$AV$1","v":{"$error":"#DIV/0!"}},{"$error":"#DIV/0!"}]
[376,{"$nulls":38},{"$error":"#DIV/0!"},{"$error":"#DIV/0!"},{"$error":"#DIV/0!"},{"$error":"#DIV/0!"},{"$f":"COUNTIF(D376:$AL376,\"NE\")/$AV$1","v":{"$error":"#DIV/0!"}},{"$error":"#DIV/0!"}]
[377,{"$nulls":38},{"$error":"#DIV/0!"},{"$error":"#DIV/0!"},{"$error":"#DIV/0!"},{"$error":"#DIV/0!"},{"$f":"COUNTIF(D377:$AL377,\"NE\")/$AV$1","v":{"$error":"#DIV/0!"}},{"$error":"#DIV/0!"}]
[378,{"$nulls":38},{"$error":"#DIV/0!"},{"$error":"#DIV/0!"},{"$error":"#DIV/0!"},{"$error":"#DIV/0!"},{"$f":"COUNTIF(D378:$AL378,\"NE\")/$AV$1","v":{"$error":"#DIV/0!"}},{"$error":"#DIV/0!"}]
[379,{"$nulls":38},{"$error":"#DIV/0!"},{"$error":"#DIV/0!"},{"$error":"#DIV/0!"},{"$error":"#DIV/0!"},{"$f":"COUNTIF(D379:$AL379,\"NE\")/$AV$1","v":{"$error":"#DIV/0!"}},{"$error":"#DIV/0!"}]
[380,{"$nulls":38},{"$error":"#DIV/0!"},{"$error":"#DIV/0!"},{"$error":"#DIV/0!"},{"$error":"#DIV/0!"},{"$f":"COUNTIF(D380:$AL380,\"NE\")/$AV$1","v":{"$error":"#DIV/0!"}},{"$error":"#DIV/0!"}]
[381,{"$nulls":38},{"$error":"#DIV/0!"},{"$error":"#DIV/0!"},{"$error":"#DIV/0!"},{"$error":"#DIV/0!"},{"$f":"COUNTIF(D381:$AL381,\"NE\")/$AV$1","v":{"$error":"#DIV/0!"}},{"$error":"#DIV/0!"}]
[382,{"$nulls":38},{"$error":"#DIV/0!"},{"$error":"#DIV/0!"},{"$error":"#DIV/0!"},{"$error":"#DIV/0!"},{"$f":"COUNTIF(D382:$AL382,\"NE\")/$AV$1","v":{"$error":"#DIV/0!"}},{"$error":"#DIV/0!"}]
[383,{"$nulls":38},{"$error":"#DIV/0!"},{"$error":"#DIV/0!"},{"$error":"#DIV/0!"},{"$error":"#DIV/0!"},{"$f":"COUNTIF(D383:$AL383,\"NE\")/$AV$1","v":{"$error":"#DIV/0!"}},{"$error":"#DIV/0!"}]
[384,{"$nulls":38},{"$error":"#DIV/0!"},{"$error":"#DIV/0!"},{"$error":"#DIV/0!"},{"$error":"#DIV/0!"},{"$f":"COUNTIF(D384:$AL384,\"NE\")/$AV$1","v":{"$error":"#DIV/0!"}},{"$error":"#DIV/0!"}]
[385,{"$nulls":38},{"$error":"#DIV/0!"},{"$error":"#DIV/0!"},{"$error":"#DIV/0!"},{"$error":"#DIV/0!"},{"$f":"COUNTIF(D385:$AL385,\"NE\")/$AV$1","v":{"$error":"#DIV/0!"}},{"$error":"#DIV/0!"}]
[386,{"$nulls":38},{"$error":"#DIV/0!"},{"$error":"#DIV/0!"},{"$error":"#DIV/0!"},{"$error":"#DIV/0!"},{"$f":"COUNTIF(D386:$AL386,\"NE\")/$AV$1","v":{"$error":"#DIV/0!"}},{"$error":"#DIV/0!"}]
[387,{"$nulls":38},{"$error":"#DIV/0!"},{"$error":"#DIV/0!"},{"$error":"#DIV/0!"},{"$error":"#DIV/0!"},{"$f":"COUNTIF(D387:$AL387,\"NE\")/$AV$1","v":{"$error":"#DIV/0!"}},{"$error":"#DIV/0!"}]
[388,{"$nulls":38},{"$error":"#DIV/0!"},{"$error":"#DIV/0!"},{"$error":"#DIV/0!"},{"$error":"#DIV/0!"},{"$f":"COUNTIF(D388:$AL388,\"NE\")/$AV$1","v":{"$error":"#DIV/0!"}},{"$error":"#DIV/0!"}]
[389,{"$nulls":38},{"$error":"#DIV/0!"},{"$error":"#DIV/0!"},{"$error":"#DIV/0!"},{"$error":"#DIV/0!"},{"$f":"COUNTIF(D389:$AL389,\"NE\")/$AV$1","v":{"$error":"#DIV/0!"}},{"$error":"#DIV/0!"}]
[390,{"$nulls":38},{"$f":"COUNTIF($D390:$AL390,$AU$1)/$AV$1","v":{"$error":"#DIV/0!"}},{"$f":"COUNTIF($D390:$AL390,$AU$2)/$AV$1","v":{"$error":"#DIV/0!"}},{"$f":"COUNTIF($D390:$AL390,$AU$3)/$AV$1","v":{"$error":"#DIV/0!"}},{"$f":"COUNTIF($D390:$AL390,$AU$4)/$AV$1","v":{"$error":"#DIV/0!"}},{"$f":"COUNTIF(D390:$AL390,\"NE\")/$AV$1","v":{"$error":"#DIV/0!"}},{"$error":"#DIV/0!"}]
[391,{"$nulls":38},{"$error":"#DIV/0!"},{"$error":"#DIV/0!"},{"$error":"#DIV/0!"},{"$error":"#DIV/0!"},{"$f":"COUNTIF(D391:$AL391,\"NE\")/$AV$1","v":{"$error":"#DIV/0!"}},{"$f":"AN391+(AO391*0.66)+(AP391*0.33)","v":{"$error":"#DIV/0!"}}]
[392,{"$nulls":38},{"$error":"#DIV/0!"},{"$error":"#DIV/0!"},{"$error":"#DIV/0!"},{"$error":"#DIV/0!"},{"$f":"COUNTIF(D392:$AL392,\"NE\")/$AV$1","v":{"$error":"#DIV/0!"}},{"$error":"#DIV/0!"}]
[393,{"$nulls":38},{"$error":"#DIV/0!"},{"$error":"#DIV/0!"},{"$error":"#DIV/0!"},{"$error":"#DIV/0!"},{"$f":"COUNTIF(D393:$AL393,\"NE\")/$AV$1","v":{"$error":"#DIV/0!"}},{"$error":"#DIV/0!"}]
[394,{"$nulls":38},{"$error":"#DIV/0!"},{"$error":"#DIV/0!"},{"$error":"#DIV/0!"},{"$error":"#DIV/0!"},{"$f":"COUNTIF(D394:$AL394,\"NE\")/$AV$1","v":{"$error":"#DIV/0!"}},{"$error":"#DIV/0!"}]
[395,{"$nulls":38},{"$error":"#DIV/0!"},{"$error":"#DIV/0!"},{"$error":"#DIV/0!"},{"$error":"#DIV/0!"},{"$f":"COUNTIF(D395:$AL395,\"NE\")/$AV$1","v":{"$error":"#DIV/0!"}},{"$error":"#DIV/0!"}]
[396,{"$nulls":38},{"$error":"#DIV/0!"},{"$error":"#DIV/0!"},{"$error":"#DIV/0!"},{"$error":"#DIV/0!"},{"$f":"COUNTIF(D396:$AL396,\"NE\")/$AV$1","v":{"$error":"#DIV/0!"}},{"$error":"#DIV/0!"}]
[397,{"$nulls":38},{"$error":"#DIV/0!"},{"$error":"#DIV/0!"},{"$error":"#DIV/0!"},{"$error":"#DIV/0!"},{"$f":"COUNTIF(D397:$AL397,\"NE\")/$AV$1","v":{"$error":"#DIV/0!"}},{"$error":"#DIV/0!"}]
[398,{"$nulls":38},{"$error":"#DIV/0!"},{"$error":"#DIV/0!"},{"$error":"#DIV/0!"},{"$error":"#DIV/0!"},{"$f":"COUNTIF(D398:$AL398,\"NE\")/$AV$1","v":{"$error":"#DIV/0!"}},{"$error":"#DIV/0!"}]
[399,{"$nulls":38},{"$error":"#DIV/0!"},{"$error":"#DIV/0!"},{"$error":"#DIV/0!"},{"$error":"#DIV/0!"},{"$f":"COUNTIF(D399:$AL399,\"NE\")/$AV$1","v":{"$error":"#DIV/0!"}},{"$error":"#DIV/0!"}]
[400,{"$nulls":38},{"$error":"#DIV/0!"},{"$error":"#DIV/0!"},{"$error":"#DIV/0!"},{"$error":"#DIV/0!"},{"$f":"COUNTIF(D400:$AL400,\"NE\")/$AV$1","v":{"$error":"#DIV/0!"}},{"$error":"#DIV/0!"}]
[401,{"$nulls":38},{"$error":"#DIV/0!"},{"$error":"#DIV/0!"},{"$error":"#DIV/0!"},{"$error":"#DIV/0!"},{"$f":"COUNTIF(D401:$AL401,\"NE\")/$AV$1","v":{"$error":"#DIV/0!"}},{"$error":"#DIV/0!"}]
[402,{"$nulls":38},{"$error":"#DIV/0!"},{"$error":"#DIV/0!"},{"$error":"#DIV/0!"},{"$error":"#DIV/0!"},{"$f":"COUNTIF(D402:$AL402,\"NE\")/$AV$1","v":{"$error":"#DIV/0!"}},{"$error":"#DIV/0!"}]
[403,{"$nulls":38},{"$error":"#DIV/0!"},{"$error":"#DIV/0!"},{"$error":"#DIV/0!"},{"$error":"#DIV/0!"},{"$f":"COUNTIF(D403:$AL403,\"NE\")/$AV$1","v":{"$error":"#DIV/0!"}},{"$error":"#DIV/0!"}]
[404,{"$nulls":38},{"$error":"#DIV/0!"},{"$error":"#DIV/0!"},{"$error":"#DIV/0!"},{"$error":"#DIV/0!"},{"$f":"COUNTIF(D404:$AL404,\"NE\")/$AV$1","v":{"$error":"#DIV/0!"}},{"$error":"#DIV/0!"}]
[405,{"$nulls":38},{"$error":"#DIV/0!"},{"$error":"#DIV/0!"},{"$error":"#DIV/0!"},{"$error":"#DIV/0!"},{"$f":"COUNTIF(D405:$AL405,\"NE\")/$AV$1","v":{"$error":"#DIV/0!"}},{"$error":"#DIV/0!"}]
[406,{"$nulls":38},{"$error":"#DIV/0!"},{"$error":"#DIV/0!"},{"$error":"#DIV/0!"},{"$error":"#DIV/0!"},{"$f":"COUNTIF(D406:$AL406,\"NE\")/$AV$1","v":{"$error":"#DIV/0!"}},{"$error":"#DIV/0!"}]
[407,{"$nulls":38},{"$error":"#DIV/0!"},{"$error":"#DIV/0!"},{"$error":"#DIV/0!"},{"$error":"#DIV/0!"},{"$f":"COUNTIF(D407:$AL407,\"NE\")/$AV$1","v":{"$error":"#DIV/0!"}},{"$error":"#DIV/0!"}]
[408,{"$nulls":38},{"$error":"#DIV/0!"},{"$error":"#DIV/0!"},{"$error":"#DIV/0!"},{"$error":"#DIV/0!"},{"$f":"COUNTIF(D408:$AL408,\"NE\")/$AV$1","v":{"$error":"#DIV/0!"}},{"$error":"#DIV/0!"}]
[409,{"$nulls":38},{"$error":"#DIV/0!"},{"$error":"#DIV/0!"},{"$error":"#DIV/0!"},{"$error":"#DIV/0!"},{"$f":"COUNTIF(D409:$AL409,\"NE\")/$AV$1","v":{"$error":"#DIV/0!"}},{"$error":"#DIV/0!"}]
[410,{"$nulls":38},{"$error":"#DIV/0!"},{"$error":"#DIV/0!"},{"$error":"#DIV/0!"},{"$error":"#DIV/0!"},{"$f":"COUNTIF(D410:$AL410,\"NE\")/$AV$1","v":{"$error":"#DIV/0!"}},{"$error":"#DIV/0!"}]
[411,{"$nulls":38},{"$error":"#DIV/0!"},{"$error":"#DIV/0!"},{"$error":"#DIV/0!"},{"$error":"#DIV/0!"},{"$f":"COUNTIF(D411:$AL411,\"NE\")/$AV$1","v":{"$error":"#DIV/0!"}},{"$error":"#DIV/0!"}]
[412,{"$nulls":38},{"$error":"#DIV/0!"},{"$error":"#DIV/0!"},{"$error":"#DIV/0!"},{"$error":"#DIV/0!"},{"$f":"COUNTIF(D412:$AL412,\"NE\")/$AV$1","v":{"$error":"#DIV/0!"}},{"$error":"#DIV/0!"}]
[413,{"$nulls":38},{"$error":"#DIV/0!"},{"$error":"#DIV/0!"},{"$error":"#DIV/0!"},{"$error":"#DIV/0!"},{"$f":"COUNTIF(D413:$AL413,\"NE\")/$AV$1","v":{"$error":"#DIV/0!"}},{"$error":"#DIV/0!"}]
[414,{"$nulls":38},{"$error":"#DIV/0!"},{"$error":"#DIV/0!"},{"$error":"#DIV/0!"},{"$error":"#DIV/0!"},{"$f":"COUNTIF(D414:$AL414,\"NE\")/$AV$1","v":{"$error":"#DIV/0!"}},{"$error":"#DIV/0!"}]
[415,{"$nulls":38},{"$error":"#DIV/0!"},{"$error":"#DIV/0!"},{"$error":"#DIV/0!"},{"$error":"#DIV/0!"},{"$f":"COUNTIF(D415:$AL415,\"NE\")/$AV$1","v":{"$error":"#DIV/0!"}},{"$error":"#DIV/0!"}]
[416,{"$nulls":38},{"$error":"#DIV/0!"},{"$error":"#DIV/0!"},{"$error":"#DIV/0!"},{"$error":"#DIV/0!"},{"$f":"COUNTIF(D416:$AL416,\"NE\")/$AV$1","v":{"$error":"#DIV/0!"}},{"$error":"#DIV/0!"}]
[417,{"$nulls":38},{"$error":"#DIV/0!"},{"$error":"#DIV/0!"},{"$error":"#DIV/0!"},{"$error":"#DIV/0!"},{"$f":"COUNTIF(D417:$AL417,\"NE\")/$AV$1","v":{"$error":"#DIV/0!"}},{"$error":"#DIV/0!"}]
[418,{"$nulls":38},{"$error":"#DIV/0!"},{"$error":"#DIV/0!"},{"$error":"#DIV/0!"},{"$error":"#DIV/0!"},{"$f":"COUNTIF(D418:$AL418,\"NE\")/$AV$1","v":{"$error":"#DIV/0!"}},{"$error":"#DIV/0!"}]
[419,{"$nulls":38},{"$error":"#DIV/0!"},{"$error":"#DIV/0!"},{"$error":"#DIV/0!"},{"$error":"#DIV/0!"},{"$f":"COUNTIF(D419:$AL419,\"NE\")/$AV$1","v":{"$error":"#DIV/0!"}},{"$error":"#DIV/0!"}]
[420,{"$nulls":38},{"$error":"#DIV/0!"},{"$error":"#DIV/0!"},{"$error":"#DIV/0!"},{"$error":"#DIV/0!"},{"$f":"COUNTIF(D420:$AL420,\"NE\")/$AV$1","v":{"$error":"#DIV/0!"}},{"$error":"#DIV/0!"}]
[421,{"$nulls":38},{"$error":"#DIV/0!"},{"$error":"#DIV/0!"},{"$error":"#DIV/0!"},{"$error":"#DIV/0!"},{"$f":"COUNTIF(D421:$AL421,\"NE\")/$AV$1","v":{"$error":"#DIV/0!"}},{"$error":"#DIV/0!"}]
[422,{"$nulls":38},{"$error":"#DIV/0!"},{"$error":"#DIV/0!"},{"$error":"#DIV/0!"},{"$error":"#DIV/0!"},{"$f":"COUNTIF(D422:$AL422,\"NE\")/$AV$1","v":{"$error":"#DIV/0!"}},{"$error":"#DIV/0!"}]
[423,{"$nulls":38},{"$error":"#DIV/0!"},{"$error":"#DIV/0!"},{"$error":"#DIV/0!"},{"$error":"#DIV/0!"},{"$f":"COUNTIF(D423:$AL423,\"NE\")/$AV$1","v":{"$error":"#DIV/0!"}},{"$error":"#DIV/0!"}]
[424,{"$nulls":38},{"$error":"#DIV/0!"},{"$error":"#DIV/0!"},{"$error":"#DIV/0!"},{"$error":"#DIV/0!"},{"$f":"COUNTIF(D424:$AL424,\"NE\")/$AV$1","v":{"$error":"#DIV/0!"}},{"$error":"#DIV/0!"}]
[425,{"$nulls":38},{"$error":"#DIV/0!"},{"$error":"#DIV/0!"},{"$error":"#DIV/0!"},{"$error":"#DIV/0!"},{"$f":"COUNTIF(D425:$AL425,\"NE\")/$AV$1","v":{"$error":"#DIV/0!"}},{"$error":"#DIV/0!"}]
[426,{"$nulls":38},{"$error":"#DIV/0!"},{"$error":"#DIV/0!"},{"$error":"#DIV/0!"},{"$error":"#DIV/0!"},{"$f":"COUNTIF(D426:$AL426,\"NE\")/$AV$1","v":{"$error":"#DIV/0!"}},{"$error":"#DIV/0!"}]
[427,{"$nulls":38},{"$error":"#DIV/0!"},{"$error":"#DIV/0!"},{"$error":"#DIV/0!"},{"$error":"#DIV/0!"},{"$f":"COUNTIF(D427:$AL427,\"NE\")/$AV$1","v":{"$error":"#DIV/0!"}},{"$error":"#DIV/0!"}]
[428,{"$nulls":38},{"$error":"#DIV/0!"},{"$error":"#DIV/0!"},{"$error":"#DIV/0!"},{"$error":"#DIV/0!"},{"$f":"COUNTIF(D428:$AL428,\"NE\")/$AV$1","v":{"$error":"#DIV/0!"}},{"$error":"#DIV/0!"}]
[429,{"$nulls":38},{"$error":"#DIV/0!"},{"$error":"#DIV/0!"},{"$error":"#DIV/0!"},{"$error":"#DIV/0!"},{"$f":"COUNTIF(D429:$AL429,\"NE\")/$AV$1","v":{"$error":"#DIV/0!"}},{"$error":"#DIV/0!"}]
[430,{"$nulls":38},{"$error":"#DIV/0!"},{"$error":"#DIV/0!"},{"$error":"#DIV/0!"},{"$error":"#DIV/0!"},{"$f":"COUNTIF(D430:$AL430,\"NE\")/$AV$1","v":{"$error":"#DIV/0!"}},{"$error":"#DIV/0!"}]
[431,{"$nulls":38},{"$error":"#DIV/0!"},{"$error":"#DIV/0!"},{"$error":"#DIV/0!"},{"$error":"#DIV/0!"},{"$f":"COUNTIF(D431:$AL431,\"NE\")/$AV$1","v":{"$error":"#DIV/0!"}},{"$error":"#DIV/0!"}]
[432,{"$nulls":38},{"$error":"#DIV/0!"},{"$error":"#DIV/0!"},{"$error":"#DIV/0!"},{"$error":"#DIV/0!"},{"$f":"COUNTIF(D432:$AL432,\"NE\")/$AV$1","v":{"$error":"#DIV/0!"}},{"$error":"#DIV/0!"}]
[433,{"$nulls":38},{"$error":"#DIV/0!"},{"$error":"#DIV/0!"},{"$error":"#DIV/0!"},{"$error":"#DIV/0!"},{"$f":"COUNTIF(D433:$AL433,\"NE\")/$AV$1","v":{"$error":"#DIV/0!"}},{"$error":"#DIV/0!"}]
[434,{"$nulls":38},{"$error":"#DIV/0!"},{"$error":"#DIV/0!"},{"$error":"#DIV/0!"},{"$error":"#DIV/0!"},{"$f":"COUNTIF(D434:$AL434,\"NE\")/$AV$1","v":{"$error":"#DIV/0!"}},{"$error":"#DIV/0!"}]
[435,{"$nulls":38},{"$error":"#DIV/0!"},{"$error":"#DIV/0!"},{"$error":"#DIV/0!"},{"$error":"#DIV/0!"},{"$f":"COUNTIF(D435:$AL435,\"NE\")/$AV$1","v":{"$error":"#DIV/0!"}},{"$error":"#DIV/0!"}]
[436,{"$nulls":38},{"$error":"#DIV/0!"},{"$error":"#DIV/0!"},{"$error":"#DIV/0!"},{"$error":"#DIV/0!"},{"$f":"COUNTIF(D436:$AL436,\"NE\")/$AV$1","v":{"$error":"#DIV/0!"}},{"$error":"#DIV/0!"}]
[437,{"$nulls":38},{"$error":"#DIV/0!"},{"$error":"#DIV/0!"},{"$error":"#DIV/0!"},{"$error":"#DIV/0!"},{"$f":"COUNTIF(D437:$AL437,\"NE\")/$AV$1","v":{"$error":"#DIV/0!"}},{"$error":"#DIV/0!"}]
[438,{"$nulls":38},{"$error":"#DIV/0!"},{"$error":"#DIV/0!"},{"$error":"#DIV/0!"},{"$error":"#DIV/0!"},{"$f":"COUNTIF(D438:$AL438,\"NE\")/$AV$1","v":{"$error":"#DIV/0!"}},{"$error":"#DIV/0!"}]
[439,{"$nulls":38},{"$error":"#DIV/0!"},{"$error":"#DIV/0!"},{"$error":"#DIV/0!"},{"$error":"#DIV/0!"},{"$f":"COUNTIF(D439:$AL439,\"NE\")/$AV$1","v":{"$error":"#DIV/0!"}},{"$error":"#DIV/0!"}]
[440,{"$nulls":38},{"$error":"#DIV/0!"},{"$error":"#DIV/0!"},{"$error":"#DIV/0!"},{"$error":"#DIV/0!"},{"$f":"COUNTIF(D440:$AL440,\"NE\")/$AV$1","v":{"$error":"#DIV/0!"}},{"$error":"#DIV/0!"}]
[441,{"$nulls":38},{"$error":"#DIV/0!"},{"$error":"#DIV/0!"},{"$error":"#DIV/0!"},{"$error":"#DIV/0!"},{"$f":"COUNTIF(D441:$AL441,\"NE\")/$AV$1","v":{"$error":"#DIV/0!"}},{"$error":"#DIV/0!"}]
[442,{"$nulls":38},{"$error":"#DIV/0!"},{"$error":"#DIV/0!"},{"$error":"#DIV/0!"},{"$error":"#DIV/0!"},{"$f":"COUNTIF(D442:$AL442,\"NE\")/$AV$1","v":{"$error":"#DIV/0!"}},{"$error":"#DIV/0!"}]
[443,{"$nulls":38},{"$error":"#DIV/0!"},{"$error":"#DIV/0!"},{"$error":"#DIV/0!"},{"$error":"#DIV/0!"},{"$f":"COUNTIF(D443:$AL443,\"NE\")/$AV$1","v":{"$error":"#DIV/0!"}},{"$error":"#DIV/0!"}]
[444,{"$nulls":38},{"$error":"#DIV/0!"},{"$error":"#DIV/0!"},{"$error":"#DIV/0!"},{"$error":"#DIV/0!"},{"$f":"COUNTIF(D444:$AL444,\"NE\")/$AV$1","v":{"$error":"#DIV/0!"}},{"$error":"#DIV/0!"}]
[445,{"$nulls":38},{"$error":"#DIV/0!"},{"$error":"#DIV/0!"},{"$error":"#DIV/0!"},{"$error":"#DIV/0!"},{"$f":"COUNTIF(D445:$AL445,\"NE\")/$AV$1","v":{"$error":"#DIV/0!"}},{"$error":"#DIV/0!"}]
[446,{"$nulls":38},{"$error":"#DIV/0!"},{"$error":"#DIV/0!"},{"$error":"#DIV/0!"},{"$error":"#DIV/0!"},{"$f":"COUNTIF(D446:$AL446,\"NE\")/$AV$1","v":{"$error":"#DIV/0!"}},{"$error":"#DIV/0!"}]
[447,{"$nulls":38},{"$error":"#DIV/0!"},{"$error":"#DIV/0!"},{"$error":"#DIV/0!"},{"$error":"#DIV/0!"},{"$f":"COUNTIF(D447:$AL447,\"NE\")/$AV$1","v":{"$error":"#DIV/0!"}},{"$error":"#DIV/0!"}]
[448,{"$nulls":38},{"$error":"#DIV/0!"},{"$error":"#DIV/0!"},{"$error":"#DIV/0!"},{"$error":"#DIV/0!"},{"$f":"COUNTIF(D448:$AL448,\"NE\")/$AV$1","v":{"$error":"#DIV/0!"}},{"$error":"#DIV/0!"}]
[449,{"$nulls":38},{"$error":"#DIV/0!"},{"$error":"#DIV/0!"},{"$error":"#DIV/0!"},{"$error":"#DIV/0!"},{"$f":"COUNTIF(D449:$AL449,\"NE\")/$AV$1","v":{"$error":"#DIV/0!"}},{"$error":"#DIV/0!"}]
[450,{"$nulls":38},{"$error":"#DIV/0!"},{"$error":"#DIV/0!"},{"$error":"#DIV/0!"},{"$error":"#DIV/0!"},{"$f":"COUNTIF(D450:$AL450,\"NE\")/$AV$1","v":{"$error":"#DIV/0!"}},{"$error":"#DIV/0!"}]
[451,{"$nulls":38},{"$error":"#DIV/0!"},{"$error":"#DIV/0!"},{"$error":"#DIV/0!"},{"$error":"#DIV/0!"},{"$f":"COUNTIF(D451:$AL451,\"NE\")/$AV$1","v":{"$error":"#DIV/0!"}},{"$error":"#DIV/0!"}]
[452,{"$nulls":38},{"$error":"#DIV/0!"},{"$error":"#DIV/0!"},{"$error":"#DIV/0!"},{"$error":"#DIV/0!"},{"$f":"COUNTIF(D452:$AL452,\"NE\")/$AV$1","v":{"$error":"#DIV/0!"}},{"$error":"#DIV/0!"}]
[453,{"$nulls":38},{"$error":"#DIV/0!"},{"$error":"#DIV/0!"},{"$error":"#DIV/0!"},{"$error":"#DIV/0!"},{"$f":"COUNTIF(D453:$AL453,\"NE\")/$AV$1","v":{"$error":"#DIV/0!"}},{"$error":"#DIV/0!"}]
[454,{"$nulls":38},{"$f":"COUNTIF($D454:$AL454,$AU$1)/$AV$1","v":{"$error":"#DIV/0!"}},{"$f":"COUNTIF($D454:$AL454,$AU$2)/$AV$1","v":{"$error":"#DIV/0!"}},{"$f":"COUNTIF($D454:$AL454,$AU$3)/$AV$1","v":{"$error":"#DIV/0!"}},{"$f":"COUNTIF($D454:$AL454,$AU$4)/$AV$1","v":{"$error":"#DIV/0!"}},{"$f":"COUNTIF(D454:$AL454,\"NE\")/$AV$1","v":{"$error":"#DIV/0!"}},{"$error":"#DIV/0!"}]
[455,{"$nulls":38},{"$error":"#DIV/0!"},{"$error":"#DIV/0!"},{"$error":"#DIV/0!"},{"$error":"#DIV/0!"},{"$f":"COUNTIF(D455:$AL455,\"NE\")/$AV$1","v":{"$error":"#DIV/0!"}},{"$f":"AN455+(AO455*0.66)+(AP455*0.33)","v":{"$error":"#DIV/0!"}}]
[456,{"$nulls":38},{"$error":"#DIV/0!"},{"$error":"#DIV/0!"},{"$error":"#DIV/0!"},{"$error":"#DIV/0!"},{"$f":"COUNTIF(D456:$AL456,\"NE\")/$AV$1","v":{"$error":"#DIV/0!"}},{"$error":"#DIV/0!"}]
[457,{"$nulls":38},{"$error":"#DIV/0!"},{"$error":"#DIV/0!"},{"$error":"#DIV/0!"},{"$error":"#DIV/0!"},{"$f":"COUNTIF(D457:$AL457,\"NE\")/$AV$1","v":{"$error":"#DIV/0!"}},{"$error":"#DIV/0!"}]
[458,{"$nulls":38},{"$error":"#DIV/0!"},{"$error":"#DIV/0!"},{"$error":"#DIV/0!"},{"$error":"#DIV/0!"},{"$f":"COUNTIF(D458:$AL458,\"NE\")/$AV$1","v":{"$error":"#DIV/0!"}},{"$error":"#DIV/0!"}]
[459,{"$nulls":38},{"$error":"#DIV/0!"},{"$error":"#DIV/0!"},{"$error":"#DIV/0!"},{"$error":"#DIV/0!"},{"$f":"COUNTIF(D459:$AL459,\"NE\")/$AV$1","v":{"$error":"#DIV/0!"}},{"$error":"#DIV/0!"}]
[460,{"$nulls":38},{"$error":"#DIV/0!"},{"$error":"#DIV/0!"},{"$error":"#DIV/0!"},{"$error":"#DIV/0!"},{"$f":"COUNTIF(D460:$AL460,\"NE\")/$AV$1","v":{"$error":"#DIV/0!"}},{"$error":"#DIV/0!"}]
[461,{"$nulls":38},{"$error":"#DIV/0!"},{"$error":"#DIV/0!"},{"$error":"#DIV/0!"},{"$error":"#DIV/0!"},{"$f":"COUNTIF(D461:$AL461,\"NE\")/$AV$1","v":{"$error":"#DIV/0!"}},{"$error":"#DIV/0!"}]
[462,{"$nulls":38},{"$error":"#DIV/0!"},{"$error":"#DIV/0!"},{"$error":"#DIV/0!"},{"$error":"#DIV/0!"},{"$f":"COUNTIF(D462:$AL462,\"NE\")/$AV$1","v":{"$error":"#DIV/0!"}},{"$error":"#DIV/0!"}]
[463,{"$nulls":38},{"$error":"#DIV/0!"},{"$error":"#DIV/0!"},{"$error":"#DIV/0!"},{"$error":"#DIV/0!"},{"$f":"COUNTIF(D463:$AL463,\"NE\")/$AV$1","v":{"$error":"#DIV/0!"}},{"$error":"#DIV/0!"}]
[464,{"$nulls":38},{"$error":"#DIV/0!"},{"$error":"#DIV/0!"},{"$error":"#DIV/0!"},{"$error":"#DIV/0!"},{"$f":"COUNTIF(D464:$AL464,\"NE\")/$AV$1","v":{"$error":"#DIV/0!"}},{"$error":"#DIV/0!"}]
[465,{"$nulls":38},{"$error":"#DIV/0!"},{"$error":"#DIV/0!"},{"$error":"#DIV/0!"},{"$error":"#DIV/0!"},{"$f":"COUNTIF(D465:$AL465,\"NE\")/$AV$1","v":{"$error":"#DIV/0!"}},{"$error":"#DIV/0!"}]
[466,{"$nulls":38},{"$error":"#DIV/0!"},{"$error":"#DIV/0!"},{"$error":"#DIV/0!"},{"$error":"#DIV/0!"},{"$f":"COUNTIF(D466:$AL466,\"NE\")/$AV$1","v":{"$error":"#DIV/0!"}},{"$error":"#DIV/0!"}]
[467,{"$nulls":38},{"$error":"#DIV/0!"},{"$error":"#DIV/0!"},{"$error":"#DIV/0!"},{"$error":"#DIV/0!"},{"$f":"COUNTIF(D467:$AL467,\"NE\")/$AV$1","v":{"$error":"#DIV/0!"}},{"$error":"#DIV/0!"}]
[468,{"$nulls":38},{"$error":"#DIV/0!"},{"$error":"#DIV/0!"},{"$error":"#DIV/0!"},{"$error":"#DIV/0!"},{"$f":"COUNTIF(D468:$AL468,\"NE\")/$AV$1","v":{"$error":"#DIV/0!"}},{"$error":"#DIV/0!"}]
[469,{"$nulls":38},{"$error":"#DIV/0!"},{"$error":"#DIV/0!"},{"$error":"#DIV/0!"},{"$error":"#DIV/0!"},{"$f":"COUNTIF(D469:$AL469,\"NE\")/$AV$1","v":{"$error":"#DIV/0!"}},{"$error":"#DIV/0!"}]
[470,{"$nulls":38},{"$error":"#DIV/0!"},{"$error":"#DIV/0!"},{"$error":"#DIV/0!"},{"$error":"#DIV/0!"},{"$f":"COUNTIF(D470:$AL470,\"NE\")/$AV$1","v":{"$error":"#DIV/0!"}},{"$error":"#DIV/0!"}]
[471,{"$nulls":38},{"$error":"#DIV/0!"},{"$error":"#DIV/0!"},{"$error":"#DIV/0!"},{"$error":"#DIV/0!"},{"$f":"COUNTIF(D471:$AL471,\"NE\")/$AV$1","v":{"$error":"#DIV/0!"}},{"$error":"#DIV/0!"}]
[472,{"$nulls":38},{"$error":"#DIV/0!"},{"$error":"#DIV/0!"},{"$error":"#DIV/0!"},{"$error":"#DIV/0!"},{"$f":"COUNTIF(D472:$AL472,\"NE\")/$AV$1","v":{"$error":"#DIV/0!"}},{"$error":"#DIV/0!"}]
[473,{"$nulls":38},{"$error":"#DIV/0!"},{"$error":"#DIV/0!"},{"$error":"#DIV/0!"},{"$error":"#DIV/0!"},{"$f":"COUNTIF(D473:$AL473,\"NE\")/$AV$1","v":{"$error":"#DIV/0!"}},{"$error":"#DIV/0!"}]
[474,{"$nulls":38},{"$error":"#DIV/0!"},{"$error":"#DIV/0!"},{"$error":"#DIV/0!"},{"$error":"#DIV/0!"},{"$f":"COUNTIF(D474:$AL474,\"NE\")/$AV$1","v":{"$error":"#DIV/0!"}},{"$error":"#DIV/0!"}]
[475,{"$nulls":38},{"$error":"#DIV/0!"},{"$error":"#DIV/0!"},{"$error":"#DIV/0!"},{"$error":"#DIV/0!"},{"$f":"COUNTIF(D475:$AL475,\"NE\")/$AV$1","v":{"$error":"#DIV/0!"}},{"$error":"#DIV/0!"}]
[476,{"$nulls":38},{"$error":"#DIV/0!"},{"$error":"#DIV/0!"},{"$error":"#DIV/0!"},{"$error":"#DIV/0!"},{"$f":"COUNTIF(D476:$AL476,\"NE\")/$AV$1","v":{"$error":"#DIV/0!"}},{"$error":"#DIV/0!"}]
[477,{"$nulls":38},{"$error":"#DIV/0!"},{"$error":"#DIV/0!"},{"$error":"#DIV/0!"},{"$error":"#DIV/0!"},{"$f":"COUNTIF(D477:$AL477,\"NE\")/$AV$1","v":{"$error":"#DIV/0!"}},{"$error":"#DIV/0!"}]
[478,{"$nulls":38},{"$error":"#DIV/0!"},{"$error":"#DIV/0!"},{"$error":"#DIV/0!"},{"$error":"#DIV/0!"},{"$f":"COUNTIF(D478:$AL478,\"NE\")/$AV$1","v":{"$error":"#DIV/0!"}},{"$error":"#DIV/0!"}]
[479,{"$nulls":38},{"$error":"#DIV/0!"},{"$error":"#DIV/0!"},{"$error":"#DIV/0!"},{"$error":"#DIV/0!"},{"$f":"COUNTIF(D479:$AL479,\"NE\")/$AV$1","v":{"$error":"#DIV/0!"}},{"$error":"#DIV/0!"}]
[480,{"$nulls":38},{"$error":"#DIV/0!"},{"$error":"#DIV/0!"},{"$error":"#DIV/0!"},{"$error":"#DIV/0!"},{"$f":"COUNTIF(D480:$AL480,\"NE\")/$AV$1","v":{"$error":"#DIV/0!"}},{"$error":"#DIV/0!"}]
[481,{"$nulls":38},{"$error":"#DIV/0!"},{"$error":"#DIV/0!"},{"$error":"#DIV/0!"},{"$error":"#DIV/0!"},{"$f":"COUNTIF(D481:$AL481,\"NE\")/$AV$1","v":{"$error":"#DIV/0!"}},{"$error":"#DIV/0!"}]
[482,{"$nulls":38},{"$error":"#DIV/0!"},{"$error":"#DIV/0!"},{"$error":"#DIV/0!"},{"$error":"#DIV/0!"},{"$f":"COUNTIF(D482:$AL482,\"NE\")/$AV$1","v":{"$error":"#DIV/0!"}},{"$error":"#DIV/0!"}]
[483,{"$nulls":38},{"$error":"#DIV/0!"},{"$error":"#DIV/0!"},{"$error":"#DIV/0!"},{"$error":"#DIV/0!"},{"$f":"COUNTIF(D483:$AL483,\"NE\")/$AV$1","v":{"$error":"#DIV/0!"}},{"$error":"#DIV/0!"}]
[484,{"$nulls":38},{"$error":"#DIV/0!"},{"$error":"#DIV/0!"},{"$error":"#DIV/0!"},{"$error":"#DIV/0!"},{"$f":"COUNTIF(D484:$AL484,\"NE\")/$AV$1","v":{"$error":"#DIV/0!"}},{"$error":"#DIV/0!"}]
[485,{"$nulls":38},{"$error":"#DIV/0!"},{"$error":"#DIV/0!"},{"$error":"#DIV/0!"},{"$error":"#DIV/0!"},{"$f":"COUNTIF(D485:$AL485,\"NE\")/$AV$1","v":{"$error":"#DIV/0!"}},{"$error":"#DIV/0!"}]
[486,{"$nulls":38},{"$error":"#DIV/0!"},{"$error":"#DIV/0!"},{"$error":"#DIV/0!"},{"$error":"#DIV/0!"},{"$f":"COUNTIF(D486:$AL486,\"NE\")/$AV$1","v":{"$error":"#DIV/0!"}},{"$error":"#DIV/0!"}]
[487,{"$nulls":38},{"$error":"#DIV/0!"},{"$error":"#DIV/0!"},{"$error":"#DIV/0!"},{"$error":"#DIV/0!"},{"$f":"COUNTIF(D487:$AL487,\"NE\")/$AV$1","v":{"$error":"#DIV/0!"}},{"$error":"#DIV/0!"}]
[488,{"$nulls":38},{"$error":"#DIV/0!"},{"$error":"#DIV/0!"},{"$error":"#DIV/0!"},{"$error":"#DIV/0!"},{"$f":"COUNTIF(D488:$AL488,\"NE\")/$AV$1","v":{"$error":"#DIV/0!"}},{"$error":"#DIV/0!"}]
[489,{"$nulls":38},{"$error":"#DIV/0!"},{"$error":"#DIV/0!"},{"$error":"#DIV/0!"},{"$error":"#DIV/0!"},{"$f":"COUNTIF(D489:$AL489,\"NE\")/$AV$1","v":{"$error":"#DIV/0!"}},{"$error":"#DIV/0!"}]
[490,{"$nulls":38},{"$error":"#DIV/0!"},{"$error":"#DIV/0!"},{"$error":"#DIV/0!"},{"$error":"#DIV/0!"},{"$f":"COUNTIF(D490:$AL490,\"NE\")/$AV$1","v":{"$error":"#DIV/0!"}},{"$error":"#DIV/0!"}]
[491,{"$nulls":38},{"$error":"#DIV/0!"},{"$error":"#DIV/0!"},{"$error":"#DIV/0!"},{"$error":"#DIV/0!"},{"$f":"COUNTIF(D491:$AL491,\"NE\")/$AV$1","v":{"$error":"#DIV/0!"}},{"$error":"#DIV/0!"}]
[492,{"$nulls":38},{"$error":"#DIV/0!"},{"$error":"#DIV/0!"},{"$error":"#DIV/0!"},{"$error":"#DIV/0!"},{"$f":"COUNTIF(D492:$AL492,\"NE\")/$AV$1","v":{"$error":"#DIV/0!"}},{"$error":"#DIV/0!"}]
[493,{"$nulls":38},{"$error":"#DIV/0!"},{"$error":"#DIV/0!"},{"$error":"#DIV/0!"},{"$error":"#DIV/0!"},{"$f":"COUNTIF(D493:$AL493,\"NE\")/$AV$1","v":{"$error":"#DIV/0!"}},{"$error":"#DIV/0!"}]
[494,{"$nulls":38},{"$error":"#DIV/0!"},{"$error":"#DIV/0!"},{"$error":"#DIV/0!"},{"$error":"#DIV/0!"},{"$f":"COUNTIF(D494:$AL494,\"NE\")/$AV$1","v":{"$error":"#DIV/0!"}},{"$error":"#DIV/0!"}]
[495,{"$nulls":38},{"$error":"#DIV/0!"},{"$error":"#DIV/0!"},{"$error":"#DIV/0!"},{"$error":"#DIV/0!"},{"$f":"COUNTIF(D495:$AL495,\"NE\")/$AV$1","v":{"$error":"#DIV/0!"}},{"$error":"#DIV/0!"}]
[496,{"$nulls":38},{"$error":"#DIV/0!"},{"$error":"#DIV/0!"},{"$error":"#DIV/0!"},{"$error":"#DIV/0!"},{"$f":"COUNTIF(D496:$AL496,\"NE\")/$AV$1","v":{"$error":"#DIV/0!"}},{"$error":"#DIV/0!"}]
[497,{"$nulls":38},{"$error":"#DIV/0!"},{"$error":"#DIV/0!"},{"$error":"#DIV/0!"},{"$error":"#DIV/0!"},{"$f":"COUNTIF(D497:$AL497,\"NE\")/$AV$1","v":{"$error":"#DIV/0!"}},{"$error":"#DIV/0!"}]
[498,{"$nulls":38},{"$error":"#DIV/0!"},{"$error":"#DIV/0!"},{"$error":"#DIV/0!"},{"$error":"#DIV/0!"},{"$f":"COUNTIF(D498:$AL498,\"NE\")/$AV$1","v":{"$error":"#DIV/0!"}},{"$error":"#DIV/0!"}]
[499,{"$nulls":38},{"$error":"#DIV/0!"},{"$error":"#DIV/0!"},{"$error":"#DIV/0!"},{"$error":"#DIV/0!"},{"$f":"COUNTIF(D499:$AL499,\"NE\")/$AV$1","v":{"$error":"#DIV/0!"}},{"$error":"#DIV/0!"}]
[500,{"$nulls":38},{"$error":"#DIV/0!"},{"$error":"#DIV/0!"},{"$error":"#DIV/0!"},{"$error":"#DIV/0!"},{"$f":"COUNTIF(D500:$AL500,\"NE\")/$AV$1","v":{"$error":"#DIV/0!"}},{"$error":"#DIV/0!"}]
[501,{"$nulls":38},{"$error":"#DIV/0!"},{"$error":"#DIV/0!"},{"$error":"#DIV/0!"},{"$error":"#DIV/0!"},{"$f":"COUNTIF(D501:$AL501,\"NE\")/$AV$1","v":{"$error":"#DIV/0!"}},{"$error":"#DIV/0!"}]
[502,{"$nulls":38},{"$error":"#DIV/0!"},{"$error":"#DIV/0!"},{"$error":"#DIV/0!"},{"$error":"#DIV/0!"},{"$f":"COUNTIF(D502:$AL502,\"NE\")/$AV$1","v":{"$error":"#DIV/0!"}},{"$error":"#DIV/0!"}]
[503,{"$nulls":38},{"$error":"#DIV/0!"},{"$error":"#DIV/0!"},{"$error":"#DIV/0!"},{"$error":"#DIV/0!"},{"$f":"COUNTIF(D503:$AL503,\"NE\")/$AV$1","v":{"$error":"#DIV/0!"}},{"$error":"#DIV/0!"}]
[504,{"$nulls":38},{"$error":"#DIV/0!"},{"$error":"#DIV/0!"},{"$error":"#DIV/0!"},{"$error":"#DIV/0!"},{"$f":"COUNTIF(D504:$AL504,\"NE\")/$AV$1","v":{"$error":"#DIV/0!"}},{"$error":"#DIV/0!"}]
[505,{"$nulls":38},{"$error":"#DIV/0!"},{"$error":"#DIV/0!"},{"$error":"#DIV/0!"},{"$error":"#DIV/0!"},{"$f":"COUNTIF(D505:$AL505,\"NE\")/$AV$1","v":{"$error":"#DIV/0!"}},{"$error":"#DIV/0!"}]
[506,{"$nulls":38},{"$error":"#DIV/0!"},{"$error":"#DIV/0!"},{"$error":"#DIV/0!"},{"$error":"#DIV/0!"},{"$f":"COUNTIF(D506:$AL506,\"NE\")/$AV$1","v":{"$error":"#DIV/0!"}},{"$error":"#DIV/0!"}]
[507,{"$nulls":38},{"$error":"#DIV/0!"},{"$error":"#DIV/0!"},{"$error":"#DIV/0!"},{"$error":"#DIV/0!"},{"$f":"COUNTIF(D507:$AL507,\"NE\")/$AV$1","v":{"$error":"#DIV/0!"}},{"$error":"#DIV/0!"}]
[508,{"$nulls":38},{"$error":"#DIV/0!"},{"$error":"#DIV/0!"},{"$error":"#DIV/0!"},{"$error":"#DIV/0!"},{"$f":"COUNTIF(D508:$AL508,\"NE\")/$AV$1","v":{"$error":"#DIV/0!"}},{"$error":"#DIV/0!"}]
[509,{"$nulls":38},{"$error":"#DIV/0!"},{"$error":"#DIV/0!"},{"$error":"#DIV/0!"},{"$error":"#DIV/0!"},{"$f":"COUNTIF(D509:$AL509,\"NE\")/$AV$1","v":{"$error":"#DIV/0!"}},{"$error":"#DIV/0!"}]
[510,{"$nulls":38},{"$error":"#DIV/0!"},{"$error":"#DIV/0!"},{"$error":"#DIV/0!"},{"$error":"#DIV/0!"},{"$f":"COUNTIF(D510:$AL510,\"NE\")/$AV$1","v":{"$error":"#DIV/0!"}},{"$error":"#DIV/0!"}]
[511,{"$nulls":38},{"$error":"#DIV/0!"},{"$error":"#DIV/0!"},{"$error":"#DIV/0!"},{"$error":"#DIV/0!"},{"$f":"COUNTIF(D511:$AL511,\"NE\")/$AV$1","v":{"$error":"#DIV/0!"}},{"$error":"#DIV/0!"}]
[512,{"$nulls":38},{"$error":"#DIV/0!"},{"$error":"#DIV/0!"},{"$error":"#DIV/0!"},{"$error":"#DIV/0!"},{"$f":"COUNTIF(D512:$AL512,\"NE\")/$AV$1","v":{"$error":"#DIV/0!"}},{"$error":"#DIV/0!"}]
[513,{"$nulls":38},{"$error":"#DIV/0!"},{"$error":"#DIV/0!"},{"$error":"#DIV/0!"},{"$error":"#DIV/0!"},{"$f":"COUNTIF(D513:$AL513,\"NE\")/$AV$1","v":{"$error":"#DIV/0!"}},{"$error":"#DIV/0!"}]
[514,{"$nulls":38},{"$error":"#DIV/0!"},{"$error":"#DIV/0!"},{"$error":"#DIV/0!"},{"$error":"#DIV/0!"},{"$f":"COUNTIF(D514:$AL514,\"NE\")/$AV$1","v":{"$error":"#DIV/0!"}},{"$error":"#DIV/0!"}]
[515,{"$nulls":38},{"$error":"#DIV/0!"},{"$error":"#DIV/0!"},{"$error":"#DIV/0!"},{"$error":"#DIV/0!"},{"$f":"COUNTIF(D515:$AL515,\"NE\")/$AV$1","v":{"$error":"#DIV/0!"}},{"$error":"#DIV/0!"}]
[516,{"$nulls":38},{"$error":"#DIV/0!"},{"$error":"#DIV/0!"},{"$error":"#DIV/0!"},{"$error":"#DIV/0!"},{"$f":"COUNTIF(D516:$AL516,\"NE\")/$AV$1","v":{"$error":"#DIV/0!"}},{"$error":"#DIV/0!"}]
[517,{"$nulls":38},{"$error":"#DIV/0!"},{"$error":"#DIV/0!"},{"$error":"#DIV/0!"},{"$error":"#DIV/0!"},{"$f":"COUNTIF(D517:$AL517,\"NE\")/$AV$1","v":{"$error":"#DIV/0!"}},{"$error":"#DIV/0!"}]
[518,{"$nulls":38},{"$f":"COUNTIF($D518:$AL518,$AU$1)/$AV$1","v":{"$error":"#DIV/0!"}},{"$f":"COUNTIF($D518:$AL518,$AU$2)/$AV$1","v":{"$error":"#DIV/0!"}},{"$f":"COUNTIF($D518:$AL518,$AU$3)/$AV$1","v":{"$error":"#DIV/0!"}},{"$f":"COUNTIF($D518:$AL518,$AU$4)/$AV$1","v":{"$error":"#DIV/0!"}},{"$f":"COUNTIF(D518:$AL518,\"NE\")/$AV$1","v":{"$error":"#DIV/0!"}},{"$error":"#DIV/0!"}]
[519,{"$nulls":38},{"$error":"#DIV/0!"},{"$error":"#DIV/0!"},{"$error":"#DIV/0!"},{"$error":"#DIV/0!"},{"$f":"COUNTIF(D519:$AL519,\"NE\")/$AV$1","v":{"$error":"#DIV/0!"}},{"$f":"AN519+(AO519*0.66)+(AP519*0.33)","v":{"$error":"#DIV/0!"}}]
[520,{"$nulls":38},{"$error":"#DIV/0!"},{"$error":"#DIV/0!"},{"$error":"#DIV/0!"},{"$error":"#DIV/0!"},{"$f":"COUNTIF(D520:$AL520,\"NE\")/$AV$1","v":{"$error":"#DIV/0!"}},{"$error":"#DIV/0!"}]
[521,{"$nulls":38},{"$error":"#DIV/0!"},{"$error":"#DIV/0!"},{"$error":"#DIV/0!"},{"$error":"#DIV/0!"},{"$f":"COUNTIF(D521:$AL521,\"NE\")/$AV$1","v":{"$error":"#DIV/0!"}},{"$error":"#DIV/0!"}]
[522,{"$nulls":38},{"$error":"#DIV/0!"},{"$error":"#DIV/0!"},{"$error":"#DIV/0!"},{"$error":"#DIV/0!"},{"$f":"COUNTIF(D522:$AL522,\"NE\")/$AV$1","v":{"$error":"#DIV/0!"}},{"$error":"#DIV/0!"}]
[523,{"$nulls":38},{"$error":"#DIV/0!"},{"$error":"#DIV/0!"},{"$error":"#DIV/0!"},{"$error":"#DIV/0!"},{"$f":"COUNTIF(D523:$AL523,\"NE\")/$AV$1","v":{"$error":"#DIV/0!"}},{"$error":"#DIV/0!"}]
[524,{"$nulls":38},{"$error":"#DIV/0!"},{"$error":"#DIV/0!"},{"$error":"#DIV/0!"},{"$error":"#DIV/0!"},{"$f":"COUNTIF(D524:$AL524,\"NE\")/$AV$1","v":{"$error":"#DIV/0!"}},{"$error":"#DIV/0!"}]
[525,{"$nulls":38},{"$error":"#DIV/0!"},{"$error":"#DIV/0!"},{"$error":"#DIV/0!"},{"$error":"#DIV/0!"},{"$f":"COUNTIF(D525:$AL525,\"NE\")/$AV$1","v":{"$error":"#DIV/0!"}},{"$error":"#DIV/0!"}]
[526,{"$nulls":38},{"$error":"#DIV/0!"},{"$error":"#DIV/0!"},{"$error":"#DIV/0!"},{"$error":"#DIV/0!"},{"$f":"COUNTIF(D526:$AL526,\"NE\")/$AV$1","v":{"$error":"#DIV/0!"}},{"$error":"#DIV/0!"}]
[527,{"$nulls":38},{"$error":"#DIV/0!"},{"$error":"#DIV/0!"},{"$error":"#DIV/0!"},{"$error":"#DIV/0!"},{"$f":"COUNTIF(D527:$AL527,\"NE\")/$AV$1","v":{"$error":"#DIV/0!"}},{"$error":"#DIV/0!"}]
[528,{"$nulls":38},{"$error":"#DIV/0!"},{"$error":"#DIV/0!"},{"$error":"#DIV/0!"},{"$error":"#DIV/0!"},{"$f":"COUNTIF(D528:$AL528,\"NE\")/$AV$1","v":{"$error":"#DIV/0!"}},{"$error":"#DIV/0!"}]
[529,{"$nulls":38},{"$error":"#DIV/0!"},{"$error":"#DIV/0!"},{"$error":"#DIV/0!"},{"$error":"#DIV/0!"},{"$f":"COUNTIF(D529:$AL529,\"NE\")/$AV$1","v":{"$error":"#DIV/0!"}},{"$error":"#DIV/0!"}]
[530,{"$nulls":38},{"$error":"#DIV/0!"},{"$error":"#DIV/0!"},{"$error":"#DIV/0!"},{"$error":"#DIV/0!"},{"$f":"COUNTIF(D530:$AL530,\"NE\")/$AV$1","v":{"$error":"#DIV/0!"}},{"$error":"#DIV/0!"}]
[531,{"$nulls":38},{"$error":"#DIV/0!"},{"$error":"#DIV/0!"},{"$error":"#DIV/0!"},{"$error":"#DIV/0!"},{"$f":"COUNTIF(D531:$AL531,\"NE\")/$AV$1","v":{"$error":"#DIV/0!"}},{"$error":"#DIV/0!"}]
[532,{"$nulls":38},{"$error":"#DIV/0!"},{"$error":"#DIV/0!"},{"$error":"#DIV/0!"},{"$error":"#DIV/0!"},{"$f":"COUNTIF(D532:$AL532,\"NE\")/$AV$1","v":{"$error":"#DIV/0!"}},{"$error":"#DIV/0!"}]
[533,{"$nulls":38},{"$error":"#DIV/0!"},{"$error":"#DIV/0!"},{"$error":"#DIV/0!"},{"$error":"#DIV/0!"},{"$f":"COUNTIF(D533:$AL533,\"NE\")/$AV$1","v":{"$error":"#DIV/0!"}},{"$error":"#DIV/0!"}]
[534,{"$nulls":38},{"$error":"#DIV/0!"},{"$error":"#DIV/0!"},{"$error":"#DIV/0!"},{"$error":"#DIV/0!"},{"$f":"COUNTIF(D534:$AL534,\"NE\")/$AV$1","v":{"$error":"#DIV/0!"}},{"$error":"#DIV/0!"}]
[535,{"$nulls":38},{"$error":"#DIV/0!"},{"$error":"#DIV/0!"},{"$error":"#DIV/0!"},{"$error":"#DIV/0!"},{"$f":"COUNTIF(D535:$AL535,\"NE\")/$AV$1","v":{"$error":"#DIV/0!"}},{"$error":"#DIV/0!"}]
[536,{"$nulls":38},{"$error":"#DIV/0!"},{"$error":"#DIV/0!"},{"$error":"#DIV/0!"},{"$error":"#DIV/0!"},{"$f":"COUNTIF(D536:$AL536,\"NE\")/$AV$1","v":{"$error":"#DIV/0!"}},{"$error":"#DIV/0!"}]
[537,{"$nulls":38},{"$error":"#DIV/0!"},{"$error":"#DIV/0!"},{"$error":"#DIV/0!"},{"$error":"#DIV/0!"},{"$f":"COUNTIF(D537:$AL537,\"NE\")/$AV$1","v":{"$error":"#DIV/0!"}},{"$error":"#DIV/0!"}]
[538,{"$nulls":38},{"$error":"#DIV/0!"},{"$error":"#DIV/0!"},{"$error":"#DIV/0!"},{"$error":"#DIV/0!"},{"$f":"COUNTIF(D538:$AL538,\"NE\")/$AV$1","v":{"$error":"#DIV/0!"}},{"$error":"#DIV/0!"}]
[539,{"$nulls":38},{"$error":"#DIV/0!"},{"$error":"#DIV/0!"},{"$error":"#DIV/0!"},{"$error":"#DIV/0!"},{"$f":"COUNTIF(D539:$AL539,\"NE\")/$AV$1","v":{"$error":"#DIV/0!"}},{"$error":"#DIV/0!"}]
[540,{"$nulls":38},{"$error":"#DIV/0!"},{"$error":"#DIV/0!"},{"$error":"#DIV/0!"},{"$error":"#DIV/0!"},{"$f":"COUNTIF(D540:$AL540,\"NE\")/$AV$1","v":{"$error":"#DIV/0!"}},{"$error":"#DIV/0!"}]
[541,{"$nulls":38},{"$error":"#DIV/0!"},{"$error":"#DIV/0!"},{"$error":"#DIV/0!"},{"$error":"#DIV/0!"},{"$f":"COUNTIF(D541:$AL541,\"NE\")/$AV$1","v":{"$error":"#DIV/0!"}},{"$error":"#DIV/0!"}]
[542,{"$nulls":38},{"$error":"#DIV/0!"},{"$error":"#DIV/0!"},{"$error":"#DIV/0!"},{"$error":"#DIV/0!"},{"$f":"COUNTIF(D542:$AL542,\"NE\")/$AV$1","v":{"$error":"#DIV/0!"}},{"$error":"#DIV/0!"}]
[543,{"$nulls":38},{"$error":"#DIV/0!"},{"$error":"#DIV/0!"},{"$error":"#DIV/0!"},{"$error":"#DIV/0!"},{"$f":"COUNTIF(D543:$AL543,\"NE\")/$AV$1","v":{"$error":"#DIV/0!"}},{"$error":"#DIV/0!"}]
[544,{"$nulls":38},{"$error":"#DIV/0!"},{"$error":"#DIV/0!"},{"$error":"#DIV/0!"},{"$error":"#DIV/0!"},{"$f":"COUNTIF(D544:$AL544,\"NE\")/$AV$1","v":{"$error":"#DIV/0!"}},{"$error":"#DIV/0!"}]
[545,{"$nulls":38},{"$error":"#DIV/0!"},{"$error":"#DIV/0!"},{"$error":"#DIV/0!"},{"$error":"#DIV/0!"},{"$f":"COUNTIF(D545:$AL545,\"NE\")/$AV$1","v":{"$error":"#DIV/0!"}},{"$error":"#DIV/0!"}]
[546,{"$nulls":38},{"$error":"#DIV/0!"},{"$error":"#DIV/0!"},{"$error":"#DIV/0!"},{"$error":"#DIV/0!"},{"$f":"COUNTIF(D546:$AL546,\"NE\")/$AV$1","v":{"$error":"#DIV/0!"}},{"$error":"#DIV/0!"}]
[547,{"$nulls":38},{"$error":"#DIV/0!"},{"$error":"#DIV/0!"},{"$error":"#DIV/0!"},{"$error":"#DIV/0!"},{"$f":"COUNTIF(D547:$AL547,\"NE\")/$AV$1","v":{"$error":"#DIV/0!"}},{"$error":"#DIV/0!"}]
[548,{"$nulls":38},{"$error":"#DIV/0!"},{"$error":"#DIV/0!"},{"$error":"#DIV/0!"},{"$error":"#DIV/0!"},{"$f":"COUNTIF(D548:$AL548,\"NE\")/$AV$1","v":{"$error":"#DIV/0!"}},{"$error":"#DIV/0!"}]
[549,{"$nulls":38},{"$error":"#DIV/0!"},{"$error":"#DIV/0!"},{"$error":"#DIV/0!"},{"$error":"#DIV/0!"},{"$f":"COUNTIF(D549:$AL549,\"NE\")/$AV$1","v":{"$error":"#DIV/0!"}},{"$error":"#DIV/0!"}]
[550,{"$nulls":38},{"$error":"#DIV/0!"},{"$error":"#DIV/0!"},{"$error":"#DIV/0!"},{"$error":"#DIV/0!"},{"$f":"COUNTIF(D550:$AL550,\"NE\")/$AV$1","v":{"$error":"#DIV/0!"}},{"$error":"#DIV/0!"}]
[551,{"$nulls":38},{"$error":"#DIV/0!"},{"$error":"#DIV/0!"},{"$error":"#DIV/0!"},{"$error":"#DIV/0!"},{"$f":"COUNTIF(D551:$AL551,\"NE\")/$AV$1","v":{"$error":"#DIV/0!"}},{"$error":"#DIV/0!"}]
[552,{"$nulls":38},{"$error":"#DIV/0!"},{"$error":"#DIV/0!"},{"$error":"#DIV/0!"},{"$error":"#DIV/0!"},{"$f":"COUNTIF(D552:$AL552,\"NE\")/$AV$1","v":{"$error":"#DIV/0!"}},{"$error":"#DIV/0!"}]
[553,{"$nulls":38},{"$error":"#DIV/0!"},{"$error":"#DIV/0!"},{"$error":"#DIV/0!"},{"$error":"#DIV/0!"},{"$f":"COUNTIF(D553:$AL553,\"NE\")/$AV$1","v":{"$error":"#DIV/0!"}},{"$error":"#DIV/0!"}]
[554,{"$nulls":38},{"$error":"#DIV/0!"},{"$error":"#DIV/0!"},{"$error":"#DIV/0!"},{"$error":"#DIV/0!"},{"$f":"COUNTIF(D554:$AL554,\"NE\")/$AV$1","v":{"$error":"#DIV/0!"}},{"$error":"#DIV/0!"}]
[555,{"$nulls":38},{"$error":"#DIV/0!"},{"$error":"#DIV/0!"},{"$error":"#DIV/0!"},{"$error":"#DIV/0!"},{"$f":"COUNTIF(D555:$AL555,\"NE\")/$AV$1","v":{"$error":"#DIV/0!"}},{"$error":"#DIV/0!"}]
[556,{"$nulls":38},{"$error":"#DIV/0!"},{"$error":"#DIV/0!"},{"$error":"#DIV/0!"},{"$error":"#DIV/0!"},{"$f":"COUNTIF(D556:$AL556,\"NE\")/$AV$1","v":{"$error":"#DIV/0!"}},{"$error":"#DIV/0!"}]
[557,{"$nulls":38},{"$error":"#DIV/0!"},{"$error":"#DIV/0!"},{"$error":"#DIV/0!"},{"$error":"#DIV/0!"},{"$f":"COUNTIF(D557:$AL557,\"NE\")/$AV$1","v":{"$error":"#DIV/0!"}},{"$error":"#DIV/0!"}]
[558,{"$nulls":38},{"$error":"#DIV/0!"},{"$error":"#DIV/0!"},{"$error":"#DIV/0!"},{"$error":"#DIV/0!"},{"$f":"COUNTIF(D558:$AL558,\"NE\")/$AV$1","v":{"$error":"#DIV/0!"}},{"$error":"#DIV/0!"}]
[559,{"$nulls":38},{"$error":"#DIV/0!"},{"$error":"#DIV/0!"},{"$error":"#DIV/0!"},{"$error":"#DIV/0!"},{"$f":"COUNTIF(D559:$AL559,\"NE\")/$AV$1","v":{"$error":"#DIV/0!"}},{"$error":"#DIV/0!"}]
[560,{"$nulls":38},{"$error":"#DIV/0!"},{"$error":"#DIV/0!"},{"$error":"#DIV/0!"},{"$error":"#DIV/0!"},{"$f":"COUNTIF(D560:$AL560,\"NE\")/$AV$1","v":{"$error":"#DIV/0!"}},{"$error":"#DIV/0!"}]
[561,{"$nulls":38},{"$error":"#DIV/0!"},{"$error":"#DIV/0!"},{"$error":"#DIV/0!"},{"$error":"#DIV/0!"},{"$f":"COUNTIF(D561:$AL561,\"NE\")/$AV$1","v":{"$error":"#DIV/0!"}},{"$error":"#DIV/0!"}]
[562,{"$nulls":38},{"$error":"#DIV/0!"},{"$error":"#DIV/0!"},{"$error":"#DIV/0!"},{"$error":"#DIV/0!"},{"$f":"COUNTIF(D562:$AL562,\"NE\")/$AV$1","v":{"$error":"#DIV/0!"}},{"$error":"#DIV/0!"}]
[563,{"$nulls":38},{"$error":"#DIV/0!"},{"$error":"#DIV/0!"},{"$error":"#DIV/0!"},{"$error":"#DIV/0!"},{"$f":"COUNTIF(D563:$AL563,\"NE\")/$AV$1","v":{"$error":"#DIV/0!"}},{"$error":"#DIV/0!"}]
[564,{"$nulls":38},{"$error":"#DIV/0!"},{"$error":"#DIV/0!"},{"$error":"#DIV/0!"},{"$error":"#DIV/0!"},{"$f":"COUNTIF(D564:$AL564,\"NE\")/$AV$1","v":{"$error":"#DIV/0!"}},{"$error":"#DIV/0!"}]
[565,{"$nulls":38},{"$error":"#DIV/0!"},{"$error":"#DIV/0!"},{"$error":"#DIV/0!"},{"$error":"#DIV/0!"},{"$f":"COUNTIF(D565:$AL565,\"NE\")/$AV$1","v":{"$error":"#DIV/0!"}},{"$error":"#DIV/0!"}]
[566,{"$nulls":38},{"$error":"#DIV/0!"},{"$error":"#DIV/0!"},{"$error":"#DIV/0!"},{"$error":"#DIV/0!"},{"$f":"COUNTIF(D566:$AL566,\"NE\")/$AV$1","v":{"$error":"#DIV/0!"}},{"$error":"#DIV/0!"}]
[567,{"$nulls":38},{"$error":"#DIV/0!"},{"$error":"#DIV/0!"},{"$error":"#DIV/0!"},{"$error":"#DIV/0!"},{"$f":"COUNTIF(D567:$AL567,\"NE\")/$AV$1","v":{"$error":"#DIV/0!"}},{"$error":"#DIV/0!"}]
[568,{"$nulls":38},{"$error":"#DIV/0!"},{"$error":"#DIV/0!"},{"$error":"#DIV/0!"},{"$error":"#DIV/0!"},{"$f":"COUNTIF(D568:$AL568,\"NE\")/$AV$1","v":{"$error":"#DIV/0!"}},{"$error":"#DIV/0!"}]
[569,{"$nulls":38},{"$error":"#DIV/0!"},{"$error":"#DIV/0!"},{"$error":"#DIV/0!"},{"$error":"#DIV/0!"},{"$f":"COUNTIF(D569:$AL569,\"NE\")/$AV$1","v":{"$error":"#DIV/0!"}},{"$error":"#DIV/0!"}]
[570,{"$nulls":38},{"$error":"#DIV/0!"},{"$error":"#DIV/0!"},{"$error":"#DIV/0!"},{"$error":"#DIV/0!"},{"$f":"COUNTIF(D570:$AL570,\"NE\")/$AV$1","v":{"$error":"#DIV/0!"}},{"$error":"#DIV/0!"}]
[571,{"$nulls":38},{"$error":"#DIV/0!"},{"$error":"#DIV/0!"},{"$error":"#DIV/0!"},{"$error":"#DIV/0!"},{"$f":"COUNTIF(D571:$AL571,\"NE\")/$AV$1","v":{"$error":"#DIV/0!"}},{"$error":"#DIV/0!"}]
[572,{"$nulls":38},{"$error":"#DIV/0!"},{"$error":"#DIV/0!"},{"$error":"#DIV/0!"},{"$error":"#DIV/0!"},{"$f":"COUNTIF(D572:$AL572,\"NE\")/$AV$1","v":{"$error":"#DIV/0!"}},{"$error":"#DIV/0!"}]
[573,{"$nulls":38},{"$error":"#DIV/0!"},{"$error":"#DIV/0!"},{"$error":"#DIV/0!"},{"$error":"#DIV/0!"},{"$f":"COUNTIF(D573:$AL573,\"NE\")/$AV$1","v":{"$error":"#DIV/0!"}},{"$error":"#DIV/0!"}]
[574,{"$nulls":38},{"$error":"#DIV/0!"},{"$error":"#DIV/0!"},{"$error":"#DIV/0!"},{"$error":"#DIV/0!"},{"$f":"COUNTIF(D574:$AL574,\"NE\")/$AV$1","v":{"$error":"#DIV/0!"}},{"$error":"#DIV/0!"}]
[575,{"$nulls":38},{"$error":"#DIV/0!"},{"$error":"#DIV/0!"},{"$error":"#DIV/0!"},{"$error":"#DIV/0!"},{"$f":"COUNTIF(D575:$AL575,\"NE\")/$AV$1","v":{"$error":"#DIV/0!"}},{"$error":"#DIV/0!"}]
[576,{"$nulls":38},{"$error":"#DIV/0!"},{"$error":"#DIV/0!"},{"$error":"#DIV/0!"},{"$error":"#DIV/0!"},{"$f":"COUNTIF(D576:$AL576,\"NE\")/$AV$1","v":{"$error":"#DIV/0!"}},{"$error":"#DIV/0!"}]
[577,{"$nulls":38},{"$error":"#DIV/0!"},{"$error":"#DIV/0!"},{"$error":"#DIV/0!"},{"$error":"#DIV/0!"},{"$f":"COUNTIF(D577:$AL577,\"NE\")/$AV$1","v":{"$error":"#DIV/0!"}},{"$error":"#DIV/0!"}]
[578,{"$nulls":38},{"$error":"#DIV/0!"},{"$error":"#DIV/0!"},{"$error":"#DIV/0!"},{"$error":"#DIV/0!"},{"$f":"COUNTIF(D578:$AL578,\"NE\")/$AV$1","v":{"$error":"#DIV/0!"}},{"$error":"#DIV/0!"}]
[579,{"$nulls":38},{"$error":"#DIV/0!"},{"$error":"#DIV/0!"},{"$error":"#DIV/0!"},{"$error":"#DIV/0!"},{"$f":"COUNTIF(D579:$AL579,\"NE\")/$AV$1","v":{"$error":"#DIV/0!"}},{"$error":"#DIV/0!"}]
[580,{"$nulls":38},{"$error":"#DIV/0!"},{"$error":"#DIV/0!"},{"$error":"#DIV/0!"},{"$error":"#DIV/0!"},{"$f":"COUNTIF(D580:$AL580,\"NE\")/$AV$1","v":{"$error":"#DIV/0!"}},{"$error":"#DIV/0!"}]
[581,{"$nulls":38},{"$error":"#DIV/0!"},{"$error":"#DIV/0!"},{"$error":"#DIV/0!"},{"$error":"#DIV/0!"},{"$f":"COUNTIF(D581:$AL581,\"NE\")/$AV$1","v":{"$error":"#DIV/0!"}},{"$error":"#DIV/0!"}]
[582,{"$nulls":38},{"$f":"COUNTIF($D582:$AL582,$AU$1)/$AV$1","v":{"$error":"#DIV/0!"}},{"$f":"COUNTIF($D582:$AL582,$AU$2)/$AV$1","v":{"$error":"#DIV/0!"}},{"$f":"COUNTIF($D582:$AL582,$AU$3)/$AV$1","v":{"$error":"#DIV/0!"}},{"$f":"COUNTIF($D582:$AL582,$AU$4)/$AV$1","v":{"$error":"#DIV/0!"}},{"$f":"COUNTIF(D582:$AL582,\"NE\")/$AV$1","v":{"$error":"#DIV/0!"}},{"$error":"#DIV/0!"}]
[583,{"$nulls":38},{"$error":"#DIV/0!"},{"$error":"#DIV/0!"},{"$error":"#DIV/0!"},{"$error":"#DIV/0!"},{"$f":"COUNTIF(D583:$AL583,\"NE\")/$AV$1","v":{"$error":"#DIV/0!"}},{"$f":"AN583+(AO583*0.66)+(AP583*0.33)","v":{"$error":"#DIV/0!"}}]
[584,{"$nulls":38},{"$error":"#DIV/0!"},{"$error":"#DIV/0!"},{"$error":"#DIV/0!"},{"$error":"#DIV/0!"},{"$f":"COUNTIF(D584:$AL584,\"NE\")/$AV$1","v":{"$error":"#DIV/0!"}},{"$error":"#DIV/0!"}]
[585,{"$nulls":38},{"$error":"#DIV/0!"},{"$error":"#DIV/0!"},{"$error":"#DIV/0!"},{"$error":"#DIV/0!"},{"$f":"COUNTIF(D585:$AL585,\"NE\")/$AV$1","v":{"$error":"#DIV/0!"}},{"$error":"#DIV/0!"}]
[586,{"$nulls":38},{"$error":"#DIV/0!"},{"$error":"#DIV/0!"},{"$error":"#DIV/0!"},{"$error":"#DIV/0!"},{"$f":"COUNTIF(D586:$AL586,\"NE\")/$AV$1","v":{"$error":"#DIV/0!"}},{"$error":"#DIV/0!"}]
[587,{"$nulls":38},{"$error":"#DIV/0!"},{"$error":"#DIV/0!"},{"$error":"#DIV/0!"},{"$error":"#DIV/0!"},{"$f":"COUNTIF(D587:$AL587,\"NE\")/$AV$1","v":{"$error":"#DIV/0!"}},{"$error":"#DIV/0!"}]
[588,{"$nulls":38},{"$error":"#DIV/0!"},{"$error":"#DIV/0!"},{"$error":"#DIV/0!"},{"$error":"#DIV/0!"},{"$f":"COUNTIF(D588:$AL588,\"NE\")/$AV$1","v":{"$error":"#DIV/0!"}},{"$error":"#DIV/0!"}]
[589,{"$nulls":38},{"$error":"#DIV/0!"},{"$error":"#DIV/0!"},{"$error":"#DIV/0!"},{"$error":"#DIV/0!"},{"$f":"COUNTIF(D589:$AL589,\"NE\")/$AV$1","v":{"$error":"#DIV/0!"}},{"$error":"#DIV/0!"}]
[590,{"$nulls":38},{"$error":"#DIV/0!"},{"$error":"#DIV/0!"},{"$error":"#DIV/0!"},{"$error":"#DIV/0!"},{"$f":"COUNTIF(D590:$AL590,\"NE\")/$AV$1","v":{"$error":"#DIV/0!"}},{"$error":"#DIV/0!"}]
[591,{"$nulls":38},{"$error":"#DIV/0!"},{"$error":"#DIV/0!"},{"$error":"#DIV/0!"},{"$error":"#DIV/0!"},{"$f":"COUNTIF(D591:$AL591,\"NE\")/$AV$1","v":{"$error":"#DIV/0!"}},{"$error":"#DIV/0!"}]
[592,{"$nulls":38},{"$error":"#DIV/0!"},{"$error":"#DIV/0!"},{"$error":"#DIV/0!"},{"$error":"#DIV/0!"},{"$f":"COUNTIF(D592:$AL592,\"NE\")/$AV$1","v":{"$error":"#DIV/0!"}},{"$error":"#DIV/0!"}]
[593,{"$nulls":38},{"$error":"#DIV/0!"},{"$error":"#DIV/0!"},{"$error":"#DIV/0!"},{"$error":"#DIV/0!"},{"$f":"COUNTIF(D593:$AL593,\"NE\")/$AV$1","v":{"$error":"#DIV/0!"}},{"$error":"#DIV/0!"}]
[594,{"$nulls":38},{"$error":"#DIV/0!"},{"$error":"#DIV/0!"},{"$error":"#DIV/0!"},{"$error":"#DIV/0!"},{"$f":"COUNTIF(D594:$AL594,\"NE\")/$AV$1","v":{"$error":"#DIV/0!"}},{"$error":"#DIV/0!"}]
[595,{"$nulls":38},{"$error":"#DIV/0!"},{"$error":"#DIV/0!"},{"$error":"#DIV/0!"},{"$error":"#DIV/0!"},{"$f":"COUNTIF(D595:$AL595,\"NE\")/$AV$1","v":{"$error":"#DIV/0!"}},{"$error":"#DIV/0!"}]
[596,{"$nulls":38},{"$error":"#DIV/0!"},{"$error":"#DIV/0!"},{"$error":"#DIV/0!"},{"$error":"#DIV/0!"},{"$f":"COUNTIF(D596:$AL596,\"NE\")/$AV$1","v":{"$error":"#DIV/0!"}},{"$error":"#DIV/0!"}]
[597,{"$nulls":38},{"$error":"#DIV/0!"},{"$error":"#DIV/0!"},{"$error":"#DIV/0!"},{"$error":"#DIV/0!"},{"$f":"COUNTIF(D597:$AL597,\"NE\")/$AV$1","v":{"$error":"#DIV/0!"}},{"$error":"#DIV/0!"}]
[598,{"$nulls":38},{"$error":"#DIV/0!"},{"$error":"#DIV/0!"},{"$error":"#DIV/0!"},{"$error":"#DIV/0!"},{"$f":"COUNTIF(D598:$AL598,\"NE\")/$AV$1","v":{"$error":"#DIV/0!"}},{"$error":"#DIV/0!"}]
[599,{"$nulls":38},{"$error":"#DIV/0!"},{"$error":"#DIV/0!"},{"$error":"#DIV/0!"},{"$error":"#DIV/0!"},{"$f":"COUNTIF(D599:$AL599,\"NE\")/$AV$1","v":{"$error":"#DIV/0!"}},{"$error":"#DIV/0!"}]
[600,{"$nulls":38},{"$error":"#DIV/0!"},{"$error":"#DIV/0!"},{"$error":"#DIV/0!"},{"$error":"#DIV/0!"},{"$f":"COUNTIF(D600:$AL600,\"NE\")/$AV$1","v":{"$error":"#DIV/0!"}},{"$error":"#DIV/0!"}]
[601,{"$nulls":38},{"$error":"#DIV/0!"},{"$error":"#DIV/0!"},{"$error":"#DIV/0!"},{"$error":"#DIV/0!"},{"$f":"COUNTIF(D601:$AL601,\"NE\")/$AV$1","v":{"$error":"#DIV/0!"}},{"$error":"#DIV/0!"}]
[602,{"$nulls":38},{"$error":"#DIV/0!"},{"$error":"#DIV/0!"},{"$error":"#DIV/0!"},{"$error":"#DIV/0!"},{"$f":"COUNTIF(D602:$AL602,\"NE\")/$AV$1","v":{"$error":"#DIV/0!"}},{"$error":"#DIV/0!"}]
[603,{"$nulls":38},{"$error":"#DIV/0!"},{"$error":"#DIV/0!"},{"$error":"#DIV/0!"},{"$error":"#DIV/0!"},{"$f":"COUNTIF(D603:$AL603,\"NE\")/$AV$1","v":{"$error":"#DIV/0!"}},{"$error":"#DIV/0!"}]
[604,{"$nulls":38},{"$error":"#DIV/0!"},{"$error":"#DIV/0!"},{"$error":"#DIV/0!"},{"$error":"#DIV/0!"},{"$f":"COUNTIF(D604:$AL604,\"NE\")/$AV$1","v":{"$error":"#DIV/0!"}},{"$error":"#DIV/0!"}]
[605,{"$nulls":38},{"$error":"#DIV/0!"},{"$error":"#DIV/0!"},{"$error":"#DIV/0!"},{"$error":"#DIV/0!"},{"$f":"COUNTIF(D605:$AL605,\"NE\")/$AV$1","v":{"$error":"#DIV/0!"}},{"$error":"#DIV/0!"}]
[606,{"$nulls":38},{"$error":"#DIV/0!"},{"$error":"#DIV/0!"},{"$error":"#DIV/0!"},{"$error":"#DIV/0!"},{"$f":"COUNTIF(D606:$AL606,\"NE\")/$AV$1","v":{"$error":"#DIV/0!"}},{"$error":"#DIV/0!"}]
[607,{"$nulls":38},{"$error":"#DIV/0!"},{"$error":"#DIV/0!"},{"$error":"#DIV/0!"},{"$error":"#DIV/0!"},{"$f":"COUNTIF(D607:$AL607,\"NE\")/$AV$1","v":{"$error":"#DIV/0!"}},{"$error":"#DIV/0!"}]
[608,{"$nulls":38},{"$error":"#DIV/0!"},{"$error":"#DIV/0!"},{"$error":"#DIV/0!"},{"$error":"#DIV/0!"},{"$f":"COUNTIF(D608:$AL608,\"NE\")/$AV$1","v":{"$error":"#DIV/0!"}},{"$error":"#DIV/0!"}]
[609,{"$nulls":38},{"$error":"#DIV/0!"},{"$error":"#DIV/0!"},{"$error":"#DIV/0!"},{"$error":"#DIV/0!"},{"$f":"COUNTIF(D609:$AL609,\"NE\")/$AV$1","v":{"$error":"#DIV/0!"}},{"$error":"#DIV/0!"}]
[610,{"$nulls":38},{"$error":"#DIV/0!"},{"$error":"#DIV/0!"},{"$error":"#DIV/0!"},{"$error":"#DIV/0!"},{"$f":"COUNTIF(D610:$AL610,\"NE\")/$AV$1","v":{"$error":"#DIV/0!"}},{"$error":"#DIV/0!"}]
[611,{"$nulls":38},{"$error":"#DIV/0!"},{"$error":"#DIV/0!"},{"$error":"#DIV/0!"},{"$error":"#DIV/0!"},{"$f":"COUNTIF(D611:$AL611,\"NE\")/$AV$1","v":{"$error":"#DIV/0!"}},{"$error":"#DIV/0!"}]
[612,{"$nulls":38},{"$error":"#DIV/0!"},{"$error":"#DIV/0!"},{"$error":"#DIV/0!"},{"$error":"#DIV/0!"},{"$f":"COUNTIF(D612:$AL612,\"NE\")/$AV$1","v":{"$error":"#DIV/0!"}},{"$error":"#DIV/0!"}]
[613,{"$nulls":38},{"$error":"#DIV/0!"},{"$error":"#DIV/0!"},{"$error":"#DIV/0!"},{"$error":"#DIV/0!"},{"$f":"COUNTIF(D613:$AL613,\"NE\")/$AV$1","v":{"$error":"#DIV/0!"}},{"$error":"#DIV/0!"}]
[614,{"$nulls":38},{"$error":"#DIV/0!"},{"$error":"#DIV/0!"},{"$error":"#DIV/0!"},{"$error":"#DIV/0!"},{"$f":"COUNTIF(D614:$AL614,\"NE\")/$AV$1","v":{"$error":"#DIV/0!"}},{"$error":"#DIV/0!"}]
[615,{"$nulls":38},{"$error":"#DIV/0!"},{"$error":"#DIV/0!"},{"$error":"#DIV/0!"},{"$error":"#DIV/0!"},{"$f":"COUNTIF(D615:$AL615,\"NE\")/$AV$1","v":{"$error":"#DIV/0!"}},{"$error":"#DIV/0!"}]
[616,{"$nulls":38},{"$error":"#DIV/0!"},{"$error":"#DIV/0!"},{"$error":"#DIV/0!"},{"$error":"#DIV/0!"},{"$f":"COUNTIF(D616:$AL616,\"NE\")/$AV$1","v":{"$error":"#DIV/0!"}},{"$error":"#DIV/0!"}]
[617,{"$nulls":38},{"$error":"#DIV/0!"},{"$error":"#DIV/0!"},{"$error":"#DIV/0!"},{"$error":"#DIV/0!"},{"$f":"COUNTIF(D617:$AL617,\"NE\")/$AV$1","v":{"$error":"#DIV/0!"}},{"$error":"#DIV/0!"}]
[618,{"$nulls":38},{"$error":"#DIV/0!"},{"$error":"#DIV/0!"},{"$error":"#DIV/0!"},{"$error":"#DIV/0!"},{"$f":"COUNTIF(D618:$AL618,\"NE\")/$AV$1","v":{"$error":"#DIV/0!"}},{"$error":"#DIV/0!"}]
[619,{"$nulls":38},{"$error":"#DIV/0!"},{"$error":"#DIV/0!"},{"$error":"#DIV/0!"},{"$error":"#DIV/0!"},{"$f":"COUNTIF(D619:$AL619,\"NE\")/$AV$1","v":{"$error":"#DIV/0!"}},{"$error":"#DIV/0!"}]
[620,{"$nulls":38},{"$error":"#DIV/0!"},{"$error":"#DIV/0!"},{"$error":"#DIV/0!"},{"$error":"#DIV/0!"},{"$f":"COUNTIF(D620:$AL620,\"NE\")/$AV$1","v":{"$error":"#DIV/0!"}},{"$error":"#DIV/0!"}]
[621,{"$nulls":38},{"$error":"#DIV/0!"},{"$error":"#DIV/0!"},{"$error":"#DIV/0!"},{"$error":"#DIV/0!"},{"$f":"COUNTIF(D621:$AL621,\"NE\")/$AV$1","v":{"$error":"#DIV/0!"}},{"$error":"#DIV/0!"}]
[622,{"$nulls":38},{"$error":"#DIV/0!"},{"$error":"#DIV/0!"},{"$error":"#DIV/0!"},{"$error":"#DIV/0!"},{"$f":"COUNTIF(D622:$AL622,\"NE\")/$AV$1","v":{"$error":"#DIV/0!"}},{"$error":"#DIV/0!"}]
[623,{"$nulls":38},{"$error":"#DIV/0!"},{"$error":"#DIV/0!"},{"$error":"#DIV/0!"},{"$error":"#DIV/0!"},{"$f":"COUNTIF(D623:$AL623,\"NE\")/$AV$1","v":{"$error":"#DIV/0!"}},{"$error":"#DIV/0!"}]
[624,{"$nulls":38},{"$error":"#DIV/0!"},{"$error":"#DIV/0!"},{"$error":"#DIV/0!"},{"$error":"#DIV/0!"},{"$f":"COUNTIF(D624:$AL624,\"NE\")/$AV$1","v":{"$error":"#DIV/0!"}},{"$error":"#DIV/0!"}]
[625,{"$nulls":38},{"$error":"#DIV/0!"},{"$error":"#DIV/0!"},{"$error":"#DIV/0!"},{"$error":"#DIV/0!"},{"$f":"COUNTIF(D625:$AL625,\"NE\")/$AV$1","v":{"$error":"#DIV/0!"}},{"$error":"#DIV/0!"}]
[626,{"$nulls":38},{"$error":"#DIV/0!"},{"$error":"#DIV/0!"},{"$error":"#DIV/0!"},{"$error":"#DIV/0!"},{"$f":"COUNTIF(D626:$AL626,\"NE\")/$AV$1","v":{"$error":"#DIV/0!"}},{"$error":"#DIV/0!"}]
[627,{"$nulls":38},{"$error":"#DIV/0!"},{"$error":"#DIV/0!"},{"$error":"#DIV/0!"},{"$error":"#DIV/0!"},{"$f":"COUNTIF(D627:$AL627,\"NE\")/$AV$1","v":{"$error":"#DIV/0!"}},{"$error":"#DIV/0!"}]
[628,{"$nulls":38},{"$error":"#DIV/0!"},{"$error":"#DIV/0!"},{"$error":"#DIV/0!"},{"$error":"#DIV/0!"},{"$f":"COUNTIF(D628:$AL628,\"NE\")/$AV$1","v":{"$error":"#DIV/0!"}},{"$error":"#DIV/0!"}]
[629,{"$nulls":38},{"$error":"#DIV/0!"},{"$error":"#DIV/0!"},{"$error":"#DIV/0!"},{"$error":"#DIV/0!"},{"$f":"COUNTIF(D629:$AL629,\"NE\")/$AV$1","v":{"$error":"#DIV/0!"}},{"$error":"#DIV/0!"}]
[630,{"$nulls":38},{"$error":"#DIV/0!"},{"$error":"#DIV/0!"},{"$error":"#DIV/0!"},{"$error":"#DIV/0!"},{"$f":"COUNTIF(D630:$AL630,\"NE\")/$AV$1","v":{"$error":"#DIV/0!"}},{"$error":"#DIV/0!"}]
[631,{"$nulls":38},{"$error":"#DIV/0!"},{"$error":"#DIV/0!"},{"$error":"#DIV/0!"},{"$error":"#DIV/0!"},{"$f":"COUNTIF(D631:$AL631,\"NE\")/$AV$1","v":{"$error":"#DIV/0!"}},{"$error":"#DIV/0!"}]
[632,{"$nulls":38},{"$error":"#DIV/0!"},{"$error":"#DIV/0!"},{"$error":"#DIV/0!"},{"$error":"#DIV/0!"},{"$f":"COUNTIF(D632:$AL632,\"NE\")/$AV$1","v":{"$error":"#DIV/0!"}},{"$error":"#DIV/0!"}]
[633,{"$nulls":38},{"$error":"#DIV/0!"},{"$error":"#DIV/0!"},{"$error":"#DIV/0!"},{"$error":"#DIV/0!"},{"$f":"COUNTIF(D633:$AL633,\"NE\")/$AV$1","v":{"$error":"#DIV/0!"}},{"$error":"#DIV/0!"}]
[634,{"$nulls":38},{"$error":"#DIV/0!"},{"$error":"#DIV/0!"},{"$error":"#DIV/0!"},{"$error":"#DIV/0!"},{"$f":"COUNTIF(D634:$AL634,\"NE\")/$AV$1","v":{"$error":"#DIV/0!"}},{"$error":"#DIV/0!"}]
[635,{"$nulls":38},{"$error":"#DIV/0!"},{"$error":"#DIV/0!"},{"$error":"#DIV/0!"},{"$error":"#DIV/0!"},{"$f":"COUNTIF(D635:$AL635,\"NE\")/$AV$1","v":{"$error":"#DIV/0!"}},{"$error":"#DIV/0!"}]
[636,{"$nulls":38},{"$error":"#DIV/0!"},{"$error":"#DIV/0!"},{"$error":"#DIV/0!"},{"$error":"#DIV/0!"},{"$f":"COUNTIF(D636:$AL636,\"NE\")/$AV$1","v":{"$error":"#DIV/0!"}},{"$error":"#DIV/0!"}]
[637,{"$nulls":38},{"$error":"#DIV/0!"},{"$error":"#DIV/0!"},{"$error":"#DIV/0!"},{"$error":"#DIV/0!"},{"$f":"COUNTIF(D637:$AL637,\"NE\")/$AV$1","v":{"$error":"#DIV/0!"}},{"$error":"#DIV/0!"}]
[638,{"$nulls":38},{"$error":"#DIV/0!"},{"$error":"#DIV/0!"},{"$error":"#DIV/0!"},{"$error":"#DIV/0!"},{"$f":"COUNTIF(D638:$AL638,\"NE\")/$AV$1","v":{"$error":"#DIV/0!"}},{"$error":"#DIV/0!"}]
[639,{"$nulls":38},{"$error":"#DIV/0!"},{"$error":"#DIV/0!"},{"$error":"#DIV/0!"},{"$error":"#DIV/0!"},{"$f":"COUNTIF(D639:$AL639,\"NE\")/$AV$1","v":{"$error":"#DIV/0!"}},{"$error":"#DIV/0!"}]
[640,{"$nulls":38},{"$error":"#DIV/0!"},{"$error":"#DIV/0!"},{"$error":"#DIV/0!"},{"$error":"#DIV/0!"},{"$f":"COUNTIF(D640:$AL640,\"NE\")/$AV$1","v":{"$error":"#DIV/0!"}},{"$error":"#DIV/0!"}]
[641,{"$nulls":38},{"$error":"#DIV/0!"},{"$error":"#DIV/0!"},{"$error":"#DIV/0!"},{"$error":"#DIV/0!"},{"$f":"COUNTIF(D641:$AL641,\"NE\")/$AV$1","v":{"$error":"#DIV/0!"}},{"$error":"#DIV/0!"}]
[642,{"$nulls":38},{"$error":"#DIV/0!"},{"$error":"#DIV/0!"},{"$error":"#DIV/0!"},{"$error":"#DIV/0!"},{"$f":"COUNTIF(D642:$AL642,\"NE\")/$AV$1","v":{"$error":"#DIV/0!"}},{"$error":"#DIV/0!"}]
[643,{"$nulls":38},{"$error":"#DIV/0!"},{"$error":"#DIV/0!"},{"$error":"#DIV/0!"},{"$error":"#DIV/0!"},{"$f":"COUNTIF(D643:$AL643,\"NE\")/$AV$1","v":{"$error":"#DIV/0!"}},{"$error":"#DIV/0!"}]
[644,{"$nulls":38},{"$error":"#DIV/0!"},{"$error":"#DIV/0!"},{"$error":"#DIV/0!"},{"$error":"#DIV/0!"},{"$f":"COUNTIF(D644:$AL644,\"NE\")/$AV$1","v":{"$error":"#DIV/0!"}},{"$error":"#DIV/0!"}]
[645,{"$nulls":38},{"$error":"#DIV/0!"},{"$error":"#DIV/0!"},{"$error":"#DIV/0!"},{"$error":"#DIV/0!"},{"$f":"COUNTIF(D645:$AL645,\"NE\")/$AV$1","v":{"$error":"#DIV/0!"}},{"$error":"#DIV/0!"}]
[646,{"$nulls":38},{"$f":"COUNTIF($D646:$AL646,$AU$1)/$AV$1","v":{"$error":"#DIV/0!"}},{"$f":"COUNTIF($D646:$AL646,$AU$2)/$AV$1","v":{"$error":"#DIV/0!"}},{"$f":"COUNTIF($D646:$AL646,$AU$3)/$AV$1","v":{"$error":"#DIV/0!"}},{"$f":"COUNTIF($D646:$AL646,$AU$4)/$AV$1","v":{"$error":"#DIV/0!"}},{"$f":"COUNTIF(D646:$AL646,\"NE\")/$AV$1","v":{"$error":"#DIV/0!"}},{"$error":"#DIV/0!"}]
[647,{"$nulls":38},{"$error":"#DIV/0!"},{"$error":"#DIV/0!"},{"$error":"#DIV/0!"},{"$error":"#DIV/0!"},{"$f":"COUNTIF(D647:$AL647,\"NE\")/$AV$1","v":{"$error":"#DIV/0!"}},{"$f":"AN647+(AO647*0.66)+(AP647*0.33)","v":{"$error":"#DIV/0!"}}]
[648,{"$nulls":38},{"$error":"#DIV/0!"},{"$error":"#DIV/0!"},{"$error":"#DIV/0!"},{"$error":"#DIV/0!"},{"$f":"COUNTIF(D648:$AL648,\"NE\")/$AV$1","v":{"$error":"#DIV/0!"}},{"$error":"#DIV/0!"}]
[649,{"$nulls":38},{"$error":"#DIV/0!"},{"$error":"#DIV/0!"},{"$error":"#DIV/0!"},{"$error":"#DIV/0!"},{"$f":"COUNTIF(D649:$AL649,\"NE\")/$AV$1","v":{"$error":"#DIV/0!"}},{"$error":"#DIV/0!"}]
[650,{"$nulls":38},{"$error":"#DIV/0!"},{"$error":"#DIV/0!"},{"$error":"#DIV/0!"},{"$error":"#DIV/0!"},{"$f":"COUNTIF(D650:$AL650,\"NE\")/$AV$1","v":{"$error":"#DIV/0!"}},{"$error":"#DIV/0!"}]
[651,{"$nulls":38},{"$error":"#DIV/0!"},{"$error":"#DIV/0!"},{"$error":"#DIV/0!"},{"$error":"#DIV/0!"},{"$f":"COUNTIF(D651:$AL651,\"NE\")/$AV$1","v":{"$error":"#DIV/0!"}},{"$error":"#DIV/0!"}]
[652,{"$nulls":38},{"$error":"#DIV/0!"},{"$error":"#DIV/0!"},{"$error":"#DIV/0!"},{"$error":"#DIV/0!"},{"$f":"COUNTIF(D652:$AL652,\"NE\")/$AV$1","v":{"$error":"#DIV/0!"}},{"$error":"#DIV/0!"}]
[653,{"$nulls":38},{"$error":"#DIV/0!"},{"$error":"#DIV/0!"},{"$error":"#DIV/0!"},{"$error":"#DIV/0!"},{"$f":"COUNTIF(D653:$AL653,\"NE\")/$AV$1","v":{"$error":"#DIV/0!"}},{"$error":"#DIV/0!"}]
[654,{"$nulls":38},{"$error":"#DIV/0!"},{"$error":"#DIV/0!"},{"$error":"#DIV/0!"},{"$error":"#DIV/0!"},{"$f":"COUNTIF(D654:$AL654,\"NE\")/$AV$1","v":{"$error":"#DIV/0!"}},{"$error":"#DIV/0!"}]
[655,{"$nulls":38},{"$error":"#DIV/0!"},{"$error":"#DIV/0!"},{"$error":"#DIV/0!"},{"$error":"#DIV/0!"},{"$f":"COUNTIF(D655:$AL655,\"NE\")/$AV$1","v":{"$error":"#DIV/0!"}},{"$error":"#DIV/0!"}]
[656,{"$nulls":38},{"$error":"#DIV/0!"},{"$error":"#DIV/0!"},{"$error":"#DIV/0!"},{"$error":"#DIV/0!"},{"$f":"COUNTIF(D656:$AL656,\"NE\")/$AV$1","v":{"$error":"#DIV/0!"}},{"$error":"#DIV/0!"}]
[657,{"$nulls":38},{"$error":"#DIV/0!"},{"$error":"#DIV/0!"},{"$error":"#DIV/0!"},{"$error":"#DIV/0!"},{"$f":"COUNTIF(D657:$AL657,\"NE\")/$AV$1","v":{"$error":"#DIV/0!"}},{"$error":"#DIV/0!"}]
[658,{"$nulls":38},{"$error":"#DIV/0!"},{"$error":"#DIV/0!"},{"$error":"#DIV/0!"},{"$error":"#DIV/0!"},{"$f":"COUNTIF(D658:$AL658,\"NE\")/$AV$1","v":{"$error":"#DIV/0!"}},{"$error":"#DIV/0!"}]
[659,{"$nulls":38},{"$error":"#DIV/0!"},{"$error":"#DIV/0!"},{"$error":"#DIV/0!"},{"$error":"#DIV/0!"},{"$f":"COUNTIF(D659:$AL659,\"NE\")/$AV$1","v":{"$error":"#DIV/0!"}},{"$error":"#DIV/0!"}]
[660,{"$nulls":38},{"$error":"#DIV/0!"},{"$error":"#DIV/0!"},{"$error":"#DIV/0!"},{"$error":"#DIV/0!"},{"$f":"COUNTIF(D660:$AL660,\"NE\")/$AV$1","v":{"$error":"#DIV/0!"}},{"$error":"#DIV/0!"}]
[661,{"$nulls":38},{"$error":"#DIV/0!"},{"$error":"#DIV/0!"},{"$error":"#DIV/0!"},{"$error":"#DIV/0!"},{"$f":"COUNTIF(D661:$AL661,\"NE\")/$AV$1","v":{"$error":"#DIV/0!"}},{"$error":"#DIV/0!"}]
[662,{"$nulls":38},{"$error":"#DIV/0!"},{"$error":"#DIV/0!"},{"$error":"#DIV/0!"},{"$error":"#DIV/0!"},{"$f":"COUNTIF(D662:$AL662,\"NE\")/$AV$1","v":{"$error":"#DIV/0!"}},{"$error":"#DIV/0!"}]
[663,{"$nulls":38},{"$error":"#DIV/0!"},{"$error":"#DIV/0!"},{"$error":"#DIV/0!"},{"$error":"#DIV/0!"},{"$f":"COUNTIF(D663:$AL663,\"NE\")/$AV$1","v":{"$error":"#DIV/0!"}},{"$error":"#DIV/0!"}]
[664,{"$nulls":38},{"$error":"#DIV/0!"},{"$error":"#DIV/0!"},{"$error":"#DIV/0!"},{"$error":"#DIV/0!"},{"$f":"COUNTIF(D664:$AL664,\"NE\")/$AV$1","v":{"$error":"#DIV/0!"}},{"$error":"#DIV/0!"}]
[665,{"$nulls":38},{"$error":"#DIV/0!"},{"$error":"#DIV/0!"},{"$error":"#DIV/0!"},{"$error":"#DIV/0!"},{"$f":"COUNTIF(D665:$AL665,\"NE\")/$AV$1","v":{"$error":"#DIV/0!"}},{"$error":"#DIV/0!"}]
[666,{"$nulls":38},{"$error":"#DIV/0!"},{"$error":"#DIV/0!"},{"$error":"#DIV/0!"},{"$error":"#DIV/0!"},{"$f":"COUNTIF(D666:$AL666,\"NE\")/$AV$1","v":{"$error":"#DIV/0!"}},{"$error":"#DIV/0!"}]
[667,{"$nulls":38},{"$error":"#DIV/0!"},{"$error":"#DIV/0!"},{"$error":"#DIV/0!"},{"$error":"#DIV/0!"},{"$f":"COUNTIF(D667:$AL667,\"NE\")/$AV$1","v":{"$error":"#DIV/0!"}},{"$error":"#DIV/0!"}]
[668,{"$nulls":38},{"$error":"#DIV/0!"},{"$error":"#DIV/0!"},{"$error":"#DIV/0!"},{"$error":"#DIV/0!"},{"$f":"COUNTIF(D668:$AL668,\"NE\")/$AV$1","v":{"$error":"#DIV/0!"}},{"$error":"#DIV/0!"}]
[669,{"$nulls":38},{"$error":"#DIV/0!"},{"$error":"#DIV/0!"},{"$error":"#DIV/0!"},{"$error":"#DIV/0!"},{"$f":"COUNTIF(D669:$AL669,\"NE\")/$AV$1","v":{"$error":"#DIV/0!"}},{"$error":"#DIV/0!"}]
[670,{"$nulls":38},{"$error":"#DIV/0!"},{"$error":"#DIV/0!"},{"$error":"#DIV/0!"},{"$error":"#DIV/0!"},{"$f":"COUNTIF(D670:$AL670,\"NE\")/$AV$1","v":{"$error":"#DIV/0!"}},{"$error":"#DIV/0!"}]
[671,{"$nulls":38},{"$error":"#DIV/0!"},{"$error":"#DIV/0!"},{"$error":"#DIV/0!"},{"$error":"#DIV/0!"},{"$f":"COUNTIF(D671:$AL671,\"NE\")/$AV$1","v":{"$error":"#DIV/0!"}},{"$error":"#DIV/0!"}]
[672,{"$nulls":38},{"$error":"#DIV/0!"},{"$error":"#DIV/0!"},{"$error":"#DIV/0!"},{"$error":"#DIV/0!"},{"$f":"COUNTIF(D672:$AL672,\"NE\")/$AV$1","v":{"$error":"#DIV/0!"}},{"$error":"#DIV/0!"}]
[673,{"$nulls":38},{"$error":"#DIV/0!"},{"$error":"#DIV/0!"},{"$error":"#DIV/0!"},{"$error":"#DIV/0!"},{"$f":"COUNTIF(D673:$AL673,\"NE\")/$AV$1","v":{"$error":"#DIV/0!"}},{"$error":"#DIV/0!"}]
[674,{"$nulls":38},{"$error":"#DIV/0!"},{"$error":"#DIV/0!"},{"$error":"#DIV/0!"},{"$error":"#DIV/0!"},{"$f":"COUNTIF(D674:$AL674,\"NE\")/$AV$1","v":{"$error":"#DIV/0!"}},{"$error":"#DIV/0!"}]
[675,{"$nulls":38},{"$error":"#DIV/0!"},{"$error":"#DIV/0!"},{"$error":"#DIV/0!"},{"$error":"#DIV/0!"},{"$f":"COUNTIF(D675:$AL675,\"NE\")/$AV$1","v":{"$error":"#DIV/0!"}},{"$error":"#DIV/0!"}]
[676,{"$nulls":38},{"$error":"#DIV/0!"},{"$error":"#DIV/0!"},{"$error":"#DIV/0!"},{"$error":"#DIV/0!"},{"$f":"COUNTIF(D676:$AL676,\"NE\")/$AV$1","v":{"$error":"#DIV/0!"}},{"$error":"#DIV/0!"}]
[677,{"$nulls":38},{"$error":"#DIV/0!"},{"$error":"#DIV/0!"},{"$error":"#DIV/0!"},{"$error":"#DIV/0!"},{"$f":"COUNTIF(D677:$AL677,\"NE\")/$AV$1","v":{"$error":"#DIV/0!"}},{"$error":"#DIV/0!"}]
[678,{"$nulls":38},{"$error":"#DIV/0!"},{"$error":"#DIV/0!"},{"$error":"#DIV/0!"},{"$error":"#DIV/0!"},{"$f":"COUNTIF(D678:$AL678,\"NE\")/$AV$1","v":{"$error":"#DIV/0!"}},{"$error":"#DIV/0!"}]
[679,{"$nulls":38},{"$error":"#DIV/0!"},{"$error":"#DIV/0!"},{"$error":"#DIV/0!"},{"$error":"#DIV/0!"},{"$f":"COUNTIF(D679:$AL679,\"NE\")/$AV$1","v":{"$error":"#DIV/0!"}},{"$error":"#DIV/0!"}]
[680,{"$nulls":38},{"$error":"#DIV/0!"},{"$error":"#DIV/0!"},{"$error":"#DIV/0!"},{"$error":"#DIV/0!"},{"$f":"COUNTIF(D680:$AL680,\"NE\")/$AV$1","v":{"$error":"#DIV/0!"}},{"$error":"#DIV/0!"}]
[681,{"$nulls":38},{"$error":"#DIV/0!"},{"$error":"#DIV/0!"},{"$error":"#DIV/0!"},{"$error":"#DIV/0!"},{"$f":"COUNTIF(D681:$AL681,\"NE\")/$AV$1","v":{"$error":"#DIV/0!"}},{"$error":"#DIV/0!"}]
[682,{"$nulls":38},{"$error":"#DIV/0!"},{"$error":"#DIV/0!"},{"$error":"#DIV/0!"},{"$error":"#DIV/0!"},{"$f":"COUNTIF(D682:$AL682,\"NE\")/$AV$1","v":{"$error":"#DIV/0!"}},{"$error":"#DIV/0!"}]
[683,{"$nulls":38},{"$error":"#DIV/0!"},{"$error":"#DIV/0!"},{"$error":"#DIV/0!"},{"$error":"#DIV/0!"},{"$f":"COUNTIF(D683:$AL683,\"NE\")/$AV$1","v":{"$error":"#DIV/0!"}},{"$error":"#DIV/0!"}]
[684,{"$nulls":38},{"$error":"#DIV/0!"},{"$error":"#DIV/0!"},{"$error":"#DIV/0!"},{"$error":"#DIV/0!"},{"$f":"COUNTIF(D684:$AL684,\"NE\")/$AV$1","v":{"$error":"#DIV/0!"}},{"$error":"#DIV/0!"}]
[685,{"$nulls":38},{"$error":"#DIV/0!"},{"$error":"#DIV/0!"},{"$error":"#DIV/0!"},{"$error":"#DIV/0!"},{"$f":"COUNTIF(D685:$AL685,\"NE\")/$AV$1","v":{"$error":"#DIV/0!"}},{"$error":"#DIV/0!"}]
[686,{"$nulls":38},{"$error":"#DIV/0!"},{"$error":"#DIV/0!"},{"$error":"#DIV/0!"},{"$error":"#DIV/0!"},{"$f":"COUNTIF(D686:$AL686,\"NE\")/$AV$1","v":{"$error":"#DIV/0!"}},{"$error":"#DIV/0!"}]
[687,{"$nulls":38},{"$error":"#DIV/0!"},{"$error":"#DIV/0!"},{"$error":"#DIV/0!"},{"$error":"#DIV/0!"},{"$f":"COUNTIF(D687:$AL687,\"NE\")/$AV$1","v":{"$error":"#DIV/0!"}},{"$error":"#DIV/0!"}]
[688,{"$nulls":38},{"$error":"#DIV/0!"},{"$error":"#DIV/0!"},{"$error":"#DIV/0!"},{"$error":"#DIV/0!"},{"$f":"COUNTIF(D688:$AL688,\"NE\")/$AV$1","v":{"$error":"#DIV/0!"}},{"$error":"#DIV/0!"}]
[689,{"$nulls":38},{"$error":"#DIV/0!"},{"$error":"#DIV/0!"},{"$error":"#DIV/0!"},{"$error":"#DIV/0!"},{"$f":"COUNTIF(D689:$AL689,\"NE\")/$AV$1","v":{"$error":"#DIV/0!"}},{"$error":"#DIV/0!"}]
[690,{"$nulls":38},{"$error":"#DIV/0!"},{"$error":"#DIV/0!"},{"$error":"#DIV/0!"},{"$error":"#DIV/0!"},{"$f":"COUNTIF(D690:$AL690,\"NE\")/$AV$1","v":{"$error":"#DIV/0!"}},{"$error":"#DIV/0!"}]
[691,{"$nulls":38},{"$error":"#DIV/0!"},{"$error":"#DIV/0!"},{"$error":"#DIV/0!"},{"$error":"#DIV/0!"},{"$f":"COUNTIF(D691:$AL691,\"NE\")/$AV$1","v":{"$error":"#DIV/0!"}},{"$error":"#DIV/0!"}]
[692,{"$nulls":38},{"$error":"#DIV/0!"},{"$error":"#DIV/0!"},{"$error":"#DIV/0!"},{"$error":"#DIV/0!"},{"$f":"COUNTIF(D692:$AL692,\"NE\")/$AV$1","v":{"$error":"#DIV/0!"}},{"$error":"#DIV/0!"}]
[693,{"$nulls":38},{"$error":"#DIV/0!"},{"$error":"#DIV/0!"},{"$error":"#DIV/0!"},{"$error":"#DIV/0!"},{"$f":"COUNTIF(D693:$AL693,\"NE\")/$AV$1","v":{"$error":"#DIV/0!"}},{"$error":"#DIV/0!"}]
[694,{"$nulls":38},{"$error":"#DIV/0!"},{"$error":"#DIV/0!"},{"$error":"#DIV/0!"},{"$error":"#DIV/0!"},{"$f":"COUNTIF(D694:$AL694,\"NE\")/$AV$1","v":{"$error":"#DIV/0!"}},{"$error":"#DIV/0!"}]
[695,{"$nulls":38},{"$error":"#DIV/0!"},{"$error":"#DIV/0!"},{"$error":"#DIV/0!"},{"$error":"#DIV/0!"},{"$f":"COUNTIF(D695:$AL695,\"NE\")/$AV$1","v":{"$error":"#DIV/0!"}},{"$error":"#DIV/0!"}]
[696,{"$nulls":38},{"$error":"#DIV/0!"},{"$error":"#DIV/0!"},{"$error":"#DIV/0!"},{"$error":"#DIV/0!"},{"$f":"COUNTIF(D696:$AL696,\"NE\")/$AV$1","v":{"$error":"#DIV/0!"}},{"$error":"#DIV/0!"}]
[697,{"$nulls":38},{"$error":"#DIV/0!"},{"$error":"#DIV/0!"},{"$error":"#DIV/0!"},{"$error":"#DIV/0!"},{"$f":"COUNTIF(D697:$AL697,\"NE\")/$AV$1","v":{"$error":"#DIV/0!"}},{"$error":"#DIV/0!"}]
[698,{"$nulls":38},{"$error":"#DIV/0!"},{"$error":"#DIV/0!"},{"$error":"#DIV/0!"},{"$error":"#DIV/0!"},{"$f":"COUNTIF(D698:$AL698,\"NE\")/$AV$1","v":{"$error":"#DIV/0!"}},{"$error":"#DIV/0!"}]
[699,{"$nulls":38},{"$error":"#DIV/0!"},{"$error":"#DIV/0!"},{"$error":"#DIV/0!"},{"$error":"#DIV/0!"},{"$f":"COUNTIF(D699:$AL699,\"NE\")/$AV$1","v":{"$error":"#DIV/0!"}},{"$error":"#DIV/0!"}]
[700,{"$nulls":38},{"$error":"#DIV/0!"},{"$error":"#DIV/0!"},{"$error":"#DIV/0!"},{"$error":"#DIV/0!"},{"$f":"COUNTIF(D700:$AL700,\"NE\")/$AV$1","v":{"$error":"#DIV/0!"}},{"$error":"#DIV/0!"}]
[701,{"$nulls":38},{"$error":"#DIV/0!"},{"$error":"#DIV/0!"},{"$error":"#DIV/0!"},{"$error":"#DIV/0!"},{"$f":"COUNTIF(D701:$AL701,\"NE\")/$AV$1","v":{"$error":"#DIV/0!"}},{"$error":"#DIV/0!"}]
[702,{"$nulls":38},{"$error":"#DIV/0!"},{"$error":"#DIV/0!"},{"$error":"#DIV/0!"},{"$error":"#DIV/0!"},{"$f":"COUNTIF(D702:$AL702,\"NE\")/$AV$1","v":{"$error":"#DIV/0!"}},{"$error":"#DIV/0!"}]
[703,{"$nulls":38},{"$error":"#DIV/0!"},{"$error":"#DIV/0!"},{"$error":"#DIV/0!"},{"$error":"#DIV/0!"},{"$f":"COUNTIF(D703:$AL703,\"NE\")/$AV$1","v":{"$error":"#DIV/0!"}},{"$error":"#DIV/0!"}]
[704,{"$nulls":38},{"$error":"#DIV/0!"},{"$error":"#DIV/0!"},{"$error":"#DIV/0!"},{"$error":"#DIV/0!"},{"$f":"COUNTIF(D704:$AL704,\"NE\")/$AV$1","v":{"$error":"#DIV/0!"}},{"$error":"#DIV/0!"}]
[705,{"$nulls":38},{"$error":"#DIV/0!"},{"$error":"#DIV/0!"},{"$error":"#DIV/0!"},{"$error":"#DIV/0!"},{"$f":"COUNTIF(D705:$AL705,\"NE\")/$AV$1","v":{"$error":"#DIV/0!"}},{"$error":"#DIV/0!"}]
[706,{"$nulls":38},{"$error":"#DIV/0!"},{"$error":"#DIV/0!"},{"$error":"#DIV/0!"},{"$error":"#DIV/0!"},{"$f":"COUNTIF(D706:$AL706,\"NE\")/$AV$1","v":{"$error":"#DIV/0!"}},{"$error":"#DIV/0!"}]
[707,{"$nulls":38},{"$error":"#DIV/0!"},{"$error":"#DIV/0!"},{"$error":"#DIV/0!"},{"$error":"#DIV/0!"},{"$f":"COUNTIF(D707:$AL707,\"NE\")/$AV$1","v":{"$error":"#DIV/0!"}},{"$error":"#DIV/0!"}]
[708,{"$nulls":38},{"$error":"#DIV/0!"},{"$error":"#DIV/0!"},{"$error":"#DIV/0!"},{"$error":"#DIV/0!"},{"$f":"COUNTIF(D708:$AL708,\"NE\")/$AV$1","v":{"$error":"#DIV/0!"}},{"$error":"#DIV/0!"}]
[709,{"$nulls":38},{"$error":"#DIV/0!"},{"$error":"#DIV/0!"},{"$error":"#DIV/0!"},{"$error":"#DIV/0!"},{"$f":"COUNTIF(D709:$AL709,\"NE\")/$AV$1","v":{"$error":"#DIV/0!"}},{"$error":"#DIV/0!"}]
[710,{"$nulls":38},{"$f":"COUNTIF($D710:$AL710,$AU$1)/$AV$1","v":{"$error":"#DIV/0!"}},{"$f":"COUNTIF($D710:$AL710,$AU$2)/$AV$1","v":{"$error":"#DIV/0!"}},{"$f":"COUNTIF($D710:$AL710,$AU$3)/$AV$1","v":{"$error":"#DIV/0!"}},{"$f":"COUNTIF($D710:$AL710,$AU$4)/$AV$1","v":{"$error":"#DIV/0!"}},{"$f":"COUNTIF(D710:$AL710,\"NE\")/$AV$1","v":{"$error":"#DIV/0!"}},{"$error":"#DIV/0!"}]
[711,{"$nulls":38},{"$error":"#DIV/0!"},{"$error":"#DIV/0!"},{"$error":"#DIV/0!"},{"$error":"#DIV/0!"},{"$f":"COUNTIF(D711:$AL711,\"NE\")/$AV$1","v":{"$error":"#DIV/0!"}},{"$f":"AN711+(AO711*0.66)+(AP711*0.33)","v":{"$error":"#DIV/0!"}}]
[712,{"$nulls":38},{"$error":"#DIV/0!"},{"$error":"#DIV/0!"},{"$error":"#DIV/0!"},{"$error":"#DIV/0!"},{"$f":"COUNTIF(D712:$AL712,\"NE\")/$AV$1","v":{"$error":"#DIV/0!"}},{"$error":"#DIV/0!"}]
[713,{"$nulls":38},{"$error":"#DIV/0!"},{"$error":"#DIV/0!"},{"$error":"#DIV/0!"},{"$error":"#DIV/0!"},{"$f":"COUNTIF(D713:$AL713,\"NE\")/$AV$1","v":{"$error":"#DIV/0!"}},{"$error":"#DIV/0!"}]
[714,{"$nulls":38},{"$error":"#DIV/0!"},{"$error":"#DIV/0!"},{"$error":"#DIV/0!"},{"$error":"#DIV/0!"},{"$f":"COUNTIF(D714:$AL714,\"NE\")/$AV$1","v":{"$error":"#DIV/0!"}},{"$error":"#DIV/0!"}]
[715,{"$nulls":38},{"$error":"#DIV/0!"},{"$error":"#DIV/0!"},{"$error":"#DIV/0!"},{"$error":"#DIV/0!"},{"$f":"COUNTIF(D715:$AL715,\"NE\")/$AV$1","v":{"$error":"#DIV/0!"}},{"$error":"#DIV/0!"}]
[716,{"$nulls":38},{"$error":"#DIV/0!"},{"$error":"#DIV/0!"},{"$error":"#DIV/0!"},{"$error":"#DIV/0!"},{"$f":"COUNTIF(D716:$AL716,\"NE\")/$AV$1","v":{"$error":"#DIV/0!"}},{"$error":"#DIV/0!"}]
[717,{"$nulls":38},{"$error":"#DIV/0!"},{"$error":"#DIV/0!"},{"$error":"#DIV/0!"},{"$error":"#DIV/0!"},{"$f":"COUNTIF(D717:$AL717,\"NE\")/$AV$1","v":{"$error":"#DIV/0!"}},{"$error":"#DIV/0!"}]
[718,{"$nulls":38},{"$error":"#DIV/0!"},{"$error":"#DIV/0!"},{"$error":"#DIV/0!"},{"$error":"#DIV/0!"},{"$f":"COUNTIF(D718:$AL718,\"NE\")/$AV$1","v":{"$error":"#DIV/0!"}},{"$error":"#DIV/0!"}]
[719,{"$nulls":38},{"$error":"#DIV/0!"},{"$error":"#DIV/0!"},{"$error":"#DIV/0!"},{"$error":"#DIV/0!"},{"$f":"COUNTIF(D719:$AL719,\"NE\")/$AV$1","v":{"$error":"#DIV/0!"}},{"$error":"#DIV/0!"}]
[720,{"$nulls":38},{"$error":"#DIV/0!"},{"$error":"#DIV/0!"},{"$error":"#DIV/0!"},{"$error":"#DIV/0!"},{"$f":"COUNTIF(D720:$AL720,\"NE\")/$AV$1","v":{"$error":"#DIV/0!"}},{"$error":"#DIV/0!"}]
[721,{"$nulls":38},{"$error":"#DIV/0!"},{"$error":"#DIV/0!"},{"$error":"#DIV/0!"},{"$error":"#DIV/0!"},{"$f":"COUNTIF(D721:$AL721,\"NE\")/$AV$1","v":{"$error":"#DIV/0!"}},{"$error":"#DIV/0!"}]
[722,{"$nulls":38},{"$error":"#DIV/0!"},{"$error":"#DIV/0!"},{"$error":"#DIV/0!"},{"$error":"#DIV/0!"},{"$f":"COUNTIF(D722:$AL722,\"NE\")/$AV$1","v":{"$error":"#DIV/0!"}},{"$error":"#DIV/0!"}]
[723,{"$nulls":38},{"$error":"#DIV/0!"},{"$error":"#DIV/0!"},{"$error":"#DIV/0!"},{"$error":"#DIV/0!"},{"$f":"COUNTIF(D723:$AL723,\"NE\")/$AV$1","v":{"$error":"#DIV/0!"}},{"$error":"#DIV/0!"}]
[724,{"$nulls":38},{"$error":"#DIV/0!"},{"$error":"#DIV/0!"},{"$error":"#DIV/0!"},{"$error":"#DIV/0!"},{"$f":"COUNTIF(D724:$AL724,\"NE\")/$AV$1","v":{"$error":"#DIV/0!"}},{"$error":"#DIV/0!"}]
[725,{"$nulls":38},{"$error":"#DIV/0!"},{"$error":"#DIV/0!"},{"$error":"#DIV/0!"},{"$error":"#DIV/0!"},{"$f":"COUNTIF(D725:$AL725,\"NE\")/$AV$1","v":{"$error":"#DIV/0!"}},{"$error":"#DIV/0!"}]
[726,{"$nulls":38},{"$error":"#DIV/0!"},{"$error":"#DIV/0!"},{"$error":"#DIV/0!"},{"$error":"#DIV/0!"},{"$f":"COUNTIF(D726:$AL726,\"NE\")/$AV$1","v":{"$error":"#DIV/0!"}},{"$error":"#DIV/0!"}]
[727,{"$nulls":38},{"$error":"#DIV/0!"},{"$error":"#DIV/0!"},{"$error":"#DIV/0!"},{"$error":"#DIV/0!"},{"$f":"COUNTIF(D727:$AL727,\"NE\")/$AV$1","v":{"$error":"#DIV/0!"}},{"$error":"#DIV/0!"}]
[728,{"$nulls":38},{"$error":"#DIV/0!"},{"$error":"#DIV/0!"},{"$error":"#DIV/0!"},{"$error":"#DIV/0!"},{"$f":"COUNTIF(D728:$AL728,\"NE\")/$AV$1","v":{"$error":"#DIV/0!"}},{"$error":"#DIV/0!"}]
[729,{"$nulls":38},{"$error":"#DIV/0!"},{"$error":"#DIV/0!"},{"$error":"#DIV/0!"},{"$error":"#DIV/0!"},{"$f":"COUNTIF(D729:$AL729,\"NE\")/$AV$1","v":{"$error":"#DIV/0!"}},{"$error":"#DIV/0!"}]
[730,{"$nulls":38},{"$error":"#DIV/0!"},{"$error":"#DIV/0!"},{"$error":"#DIV/0!"},{"$error":"#DIV/0!"},{"$f":"COUNTIF(D730:$AL730,\"NE\")/$AV$1","v":{"$error":"#DIV/0!"}},{"$error":"#DIV/0!"}]
[731,{"$nulls":38},{"$error":"#DIV/0!"},{"$error":"#DIV/0!"},{"$error":"#DIV/0!"},{"$error":"#DIV/0!"},{"$f":"COUNTIF(D731:$AL731,\"NE\")/$AV$1","v":{"$error":"#DIV/0!"}},{"$error":"#DIV/0!"}]
[732,{"$nulls":38},{"$error":"#DIV/0!"},{"$error":"#DIV/0!"},{"$error":"#DIV/0!"},{"$error":"#DIV/0!"},{"$f":"COUNTIF(D732:$AL732,\"NE\")/$AV$1","v":{"$error":"#DIV/0!"}},{"$error":"#DIV/0!"}]
[733,{"$nulls":38},{"$error":"#DIV/0!"},{"$error":"#DIV/0!"},{"$error":"#DIV/0!"},{"$error":"#DIV/0!"},{"$f":"COUNTIF(D733:$AL733,\"NE\")/$AV$1","v":{"$error":"#DIV/0!"}},{"$error":"#DIV/0!"}]
[734,{"$nulls":38},{"$error":"#DIV/0!"},{"$error":"#DIV/0!"},{"$error":"#DIV/0!"},{"$error":"#DIV/0!"},{"$f":"COUNTIF(D734:$AL734,\"NE\")/$AV$1","v":{"$error":"#DIV/0!"}},{"$error":"#DIV/0!"}]
[735,{"$nulls":38},{"$error":"#DIV/0!"},{"$error":"#DIV/0!"},{"$error":"#DIV/0!"},{"$error":"#DIV/0!"},{"$f":"COUNTIF(D735:$AL735,\"NE\")/$AV$1","v":{"$error":"#DIV/0!"}},{"$error":"#DIV/0!"}]
[736,{"$nulls":38},{"$error":"#DIV/0!"},{"$error":"#DIV/0!"},{"$error":"#DIV/0!"},{"$error":"#DIV/0!"},{"$f":"COUNTIF(D736:$AL736,\"NE\")/$AV$1","v":{"$error":"#DIV/0!"}},{"$error":"#DIV/0!"}]
[737,{"$nulls":38},{"$error":"#DIV/0!"},{"$error":"#DIV/0!"},{"$error":"#DIV/0!"},{"$error":"#DIV/0!"},{"$f":"COUNTIF(D737:$AL737,\"NE\")/$AV$1","v":{"$error":"#DIV/0!"}},{"$error":"#DIV/0!"}]
[738,{"$nulls":38},{"$error":"#DIV/0!"},{"$error":"#DIV/0!"},{"$error":"#DIV/0!"},{"$error":"#DIV/0!"},{"$f":"COUNTIF(D738:$AL738,\"NE\")/$AV$1","v":{"$error":"#DIV/0!"}},{"$error":"#DIV/0!"}]
[739,{"$nulls":38},{"$error":"#DIV/0!"},{"$error":"#DIV/0!"},{"$error":"#DIV/0!"},{"$error":"#DIV/0!"},{"$f":"COUNTIF(D739:$AL739,\"NE\")/$AV$1","v":{"$error":"#DIV/0!"}},{"$error":"#DIV/0!"}]
[740,{"$nulls":38},{"$error":"#DIV/0!"},{"$error":"#DIV/0!"},{"$error":"#DIV/0!"},{"$error":"#DIV/0!"},{"$f":"COUNTIF(D740:$AL740,\"NE\")/$AV$1","v":{"$error":"#DIV/0!"}},{"$error":"#DIV/0!"}]
[741,{"$nulls":38},{"$error":"#DIV/0!"},{"$error":"#DIV/0!"},{"$error":"#DIV/0!"},{"$error":"#DIV/0!"},{"$f":"COUNTIF(D741:$AL741,\"NE\")/$AV$1","v":{"$error":"#DIV/0!"}},{"$error":"#DIV/0!"}]
[742,{"$nulls":38},{"$error":"#DIV/0!"},{"$error":"#DIV/0!"},{"$error":"#DIV/0!"},{"$error":"#DIV/0!"},{"$f":"COUNTIF(D742:$AL742,\"NE\")/$AV$1","v":{"$error":"#DIV/0!"}},{"$error":"#DIV/0!"}]
[743,{"$nulls":38},{"$error":"#DIV/0!"},{"$error":"#DIV/0!"},{"$error":"#DIV/0!"},{"$error":"#DIV/0!"},{"$f":"COUNTIF(D743:$AL743,\"NE\")/$AV$1","v":{"$error":"#DIV/0!"}},{"$error":"#DIV/0!"}]
[744,{"$nulls":38},{"$error":"#DIV/0!"},{"$error":"#DIV/0!"},{"$error":"#DIV/0!"},{"$error":"#DIV/0!"},{"$f":"COUNTIF(D744:$AL744,\"NE\")/$AV$1","v":{"$error":"#DIV/0!"}},{"$error":"#DIV/0!"}]
[745,{"$nulls":38},{"$error":"#DIV/0!"},{"$error":"#DIV/0!"},{"$error":"#DIV/0!"},{"$error":"#DIV/0!"},{"$f":"COUNTIF(D745:$AL745,\"NE\")/$AV$1","v":{"$error":"#DIV/0!"}},{"$error":"#DIV/0!"}]
[746,{"$nulls":38},{"$error":"#DIV/0!"},{"$error":"#DIV/0!"},{"$error":"#DIV/0!"},{"$error":"#DIV/0!"},{"$f":"COUNTIF(D746:$AL746,\"NE\")/$AV$1","v":{"$error":"#DIV/0!"}},{"$error":"#DIV/0!"}]
[747,{"$nulls":38},{"$error":"#DIV/0!"},{"$error":"#DIV/0!"},{"$error":"#DIV/0!"},{"$error":"#DIV/0!"},{"$f":"COUNTIF(D747:$AL747,\"NE\")/$AV$1","v":{"$error":"#DIV/0!"}},{"$error":"#DIV/0!"}]
[748,{"$nulls":38},{"$error":"#DIV/0!"},{"$error":"#DIV/0!"},{"$error":"#DIV/0!"},{"$error":"#DIV/0!"},{"$f":"COUNTIF(D748:$AL748,\"NE\")/$AV$1","v":{"$error":"#DIV/0!"}},{"$error":"#DIV/0!"}]
[749,{"$nulls":38},{"$error":"#DIV/0!"},{"$error":"#DIV/0!"},{"$error":"#DIV/0!"},{"$error":"#DIV/0!"},{"$f":"COUNTIF(D749:$AL749,\"NE\")/$AV$1","v":{"$error":"#DIV/0!"}},{"$error":"#DIV/0!"}]
[750,{"$nulls":38},{"$error":"#DIV/0!"},{"$error":"#DIV/0!"},{"$error":"#DIV/0!"},{"$error":"#DIV/0!"},{"$f":"COUNTIF(D750:$AL750,\"NE\")/$AV$1","v":{"$error":"#DIV/0!"}},{"$error":"#DIV/0!"}]
[751,{"$nulls":38},{"$error":"#DIV/0!"},{"$error":"#DIV/0!"},{"$error":"#DIV/0!"},{"$error":"#DIV/0!"},{"$f":"COUNTIF(D751:$AL751,\"NE\")/$AV$1","v":{"$error":"#DIV/0!"}},{"$error":"#DIV/0!"}]
[752,{"$nulls":38},{"$error":"#DIV/0!"},{"$error":"#DIV/0!"},{"$error":"#DIV/0!"},{"$error":"#DIV/0!"},{"$f":"COUNTIF(D752:$AL752,\"NE\")/$AV$1","v":{"$error":"#DIV/0!"}},{"$error":"#DIV/0!"}]
[753,{"$nulls":38},{"$error":"#DIV/0!"},{"$error":"#DIV/0!"},{"$error":"#DIV/0!"},{"$error":"#DIV/0!"},{"$f":"COUNTIF(D753:$AL753,\"NE\")/$AV$1","v":{"$error":"#DIV/0!"}},{"$error":"#DIV/0!"}]
[754,{"$nulls":38},{"$error":"#DIV/0!"},{"$error":"#DIV/0!"},{"$error":"#DIV/0!"},{"$error":"#DIV/0!"},{"$f":"COUNTIF(D754:$AL754,\"NE\")/$AV$1","v":{"$error":"#DIV/0!"}},{"$error":"#DIV/0!"}]
[755,{"$nulls":38},{"$error":"#DIV/0!"},{"$error":"#DIV/0!"},{"$error":"#DIV/0!"},{"$error":"#DIV/0!"},{"$f":"COUNTIF(D755:$AL755,\"NE\")/$AV$1","v":{"$error":"#DIV/0!"}},{"$error":"#DIV/0!"}]
[756,{"$nulls":38},{"$error":"#DIV/0!"},{"$error":"#DIV/0!"},{"$error":"#DIV/0!"},{"$error":"#DIV/0!"},{"$f":"COUNTIF(D756:$AL756,\"NE\")/$AV$1","v":{"$error":"#DIV/0!"}},{"$error":"#DIV/0!"}]
[757,{"$nulls":38},{"$error":"#DIV/0!"},{"$error":"#DIV/0!"},{"$error":"#DIV/0!"},{"$error":"#DIV/0!"},{"$f":"COUNTIF(D757:$AL757,\"NE\")/$AV$1","v":{"$error":"#DIV/0!"}},{"$error":"#DIV/0!"}]
[758,{"$nulls":38},{"$error":"#DIV/0!"},{"$error":"#DIV/0!"},{"$error":"#DIV/0!"},{"$error":"#DIV/0!"},{"$f":"COUNTIF(D758:$AL758,\"NE\")/$AV$1","v":{"$error":"#DIV/0!"}},{"$error":"#DIV/0!"}]
[759,{"$nulls":38},{"$error":"#DIV/0!"},{"$error":"#DIV/0!"},{"$error":"#DIV/0!"},{"$error":"#DIV/0!"},{"$f":"COUNTIF(D759:$AL759,\"NE\")/$AV$1","v":{"$error":"#DIV/0!"}},{"$error":"#DIV/0!"}]
[760,{"$nulls":38},{"$error":"#DIV/0!"},{"$error":"#DIV/0!"},{"$error":"#DIV/0!"},{"$error":"#DIV/0!"},{"$f":"COUNTIF(D760:$AL760,\"NE\")/$AV$1","v":{"$error":"#DIV/0!"}},{"$error":"#DIV/0!"}]
[761,{"$nulls":38},{"$error":"#DIV/0!"},{"$error":"#DIV/0!"},{"$error":"#DIV/0!"},{"$error":"#DIV/0!"},{"$f":"COUNTIF(D761:$AL761,\"NE\")/$AV$1","v":{"$error":"#DIV/0!"}},{"$error":"#DIV/0!"}]
[762,{"$nulls":38},{"$error":"#DIV/0!"},{"$error":"#DIV/0!"},{"$error":"#DIV/0!"},{"$error":"#DIV/0!"},{"$f":"COUNTIF(D762:$AL762,\"NE\")/$AV$1","v":{"$error":"#DIV/0!"}},{"$error":"#DIV/0!"}]
[763,{"$nulls":38},{"$error":"#DIV/0!"},{"$error":"#DIV/0!"},{"$error":"#DIV/0!"},{"$error":"#DIV/0!"},{"$f":"COUNTIF(D763:$AL763,\"NE\")/$AV$1","v":{"$error":"#DIV/0!"}},{"$error":"#DIV/0!"}]
[764,{"$nulls":38},{"$error":"#DIV/0!"},{"$error":"#DIV/0!"},{"$error":"#DIV/0!"},{"$error":"#DIV/0!"},{"$f":"COUNTIF(D764:$AL764,\"NE\")/$AV$1","v":{"$error":"#DIV/0!"}},{"$error":"#DIV/0!"}]
[765,{"$nulls":38},{"$error":"#DIV/0!"},{"$error":"#DIV/0!"},{"$error":"#DIV/0!"},{"$error":"#DIV/0!"},{"$f":"COUNTIF(D765:$AL765,\"NE\")/$AV$1","v":{"$error":"#DIV/0!"}},{"$error":"#DIV/0!"}]
[766,{"$nulls":38},{"$error":"#DIV/0!"},{"$error":"#DIV/0!"},{"$error":"#DIV/0!"},{"$error":"#DIV/0!"},{"$f":"COUNTIF(D766:$AL766,\"NE\")/$AV$1","v":{"$error":"#DIV/0!"}},{"$error":"#DIV/0!"}]
[767,{"$nulls":38},{"$error":"#DIV/0!"},{"$error":"#DIV/0!"},{"$error":"#DIV/0!"},{"$error":"#DIV/0!"},{"$f":"COUNTIF(D767:$AL767,\"NE\")/$AV$1","v":{"$error":"#DIV/0!"}},{"$error":"#DIV/0!"}]
[768,{"$nulls":38},{"$error":"#DIV/0!"},{"$error":"#DIV/0!"},{"$error":"#DIV/0!"},{"$error":"#DIV/0!"},{"$f":"COUNTIF(D768:$AL768,\"NE\")/$AV$1","v":{"$error":"#DIV/0!"}},{"$error":"#DIV/0!"}]
[769,{"$nulls":38},{"$error":"#DIV/0!"},{"$error":"#DIV/0!"},{"$error":"#DIV/0!"},{"$error":"#DIV/0!"},{"$f":"COUNTIF(D769:$AL769,\"NE\")/$AV$1","v":{"$error":"#DIV/0!"}},{"$error":"#DIV/0!"}]
[770,{"$nulls":38},{"$error":"#DIV/0!"},{"$error":"#DIV/0!"},{"$error":"#DIV/0!"},{"$error":"#DIV/0!"},{"$f":"COUNTIF(D770:$AL770,\"NE\")/$AV$1","v":{"$error":"#DIV/0!"}},{"$error":"#DIV/0!"}]
[771,{"$nulls":38},{"$error":"#DIV/0!"},{"$error":"#DIV/0!"},{"$error":"#DIV/0!"},{"$error":"#DIV/0!"},{"$f":"COUNTIF(D771:$AL771,\"NE\")/$AV$1","v":{"$error":"#DIV/0!"}},{"$error":"#DIV/0!"}]
[772,{"$nulls":38},{"$error":"#DIV/0!"},{"$error":"#DIV/0!"},{"$error":"#DIV/0!"},{"$error":"#DIV/0!"},{"$f":"COUNTIF(D772:$AL772,\"NE\")/$AV$1","v":{"$error":"#DIV/0!"}},{"$error":"#DIV/0!"}]
[773,{"$nulls":38},{"$error":"#DIV/0!"},{"$error":"#DIV/0!"},{"$error":"#DIV/0!"},{"$error":"#DIV/0!"},{"$f":"COUNTIF(D773:$AL773,\"NE\")/$AV$1","v":{"$error":"#DIV/0!"}},{"$error":"#DIV/0!"}]
[774,{"$nulls":38},{"$f":"COUNTIF($D774:$AL774,$AU$1)/$AV$1","v":{"$error":"#DIV/0!"}},{"$f":"COUNTIF($D774:$AL774,$AU$2)/$AV$1","v":{"$error":"#DIV/0!"}},{"$f":"COUNTIF($D774:$AL774,$AU$3)/$AV$1","v":{"$error":"#DIV/0!"}},{"$f":"COUNTIF($D774:$AL774,$AU$4)/$AV$1","v":{"$error":"#DIV/0!"}},{"$f":"COUNTIF(D774:$AL774,\"NE\")/$AV$1","v":{"$error":"#DIV/0!"}},{"$error":"#DIV/0!"}]
[775,{"$nulls":38},{"$error":"#DIV/0!"},{"$error":"#DIV/0!"},{"$error":"#DIV/0!"},{"$error":"#DIV/0!"},{"$f":"COUNTIF(D775:$AL775,\"NE\")/$AV$1","v":{"$error":"#DIV/0!"}},{"$f":"AN775+(AO775*0.66)+(AP775*0.33)","v":{"$error":"#DIV/0!"}}]
[776,{"$nulls":38},{"$error":"#DIV/0!"},{"$error":"#DIV/0!"},{"$error":"#DIV/0!"},{"$error":"#DIV/0!"},{"$f":"COUNTIF(D776:$AL776,\"NE\")/$AV$1","v":{"$error":"#DIV/0!"}},{"$error":"#DIV/0!"}]
[777,{"$nulls":38},{"$error":"#DIV/0!"},{"$error":"#DIV/0!"},{"$error":"#DIV/0!"},{"$error":"#DIV/0!"},{"$f":"COUNTIF(D777:$AL777,\"NE\")/$AV$1","v":{"$error":"#DIV/0!"}},{"$error":"#DIV/0!"}]
[778,{"$nulls":38},{"$error":"#DIV/0!"},{"$error":"#DIV/0!"},{"$error":"#DIV/0!"},{"$error":"#DIV/0!"},{"$f":"COUNTIF(D778:$AL778,\"NE\")/$AV$1","v":{"$error":"#DIV/0!"}},{"$error":"#DIV/0!"}]
[779,{"$nulls":38},{"$error":"#DIV/0!"},{"$error":"#DIV/0!"},{"$error":"#DIV/0!"},{"$error":"#DIV/0!"},{"$f":"COUNTIF(D779:$AL779,\"NE\")/$AV$1","v":{"$error":"#DIV/0!"}},{"$error":"#DIV/0!"}]
[780,{"$nulls":38},{"$error":"#DIV/0!"},{"$error":"#DIV/0!"},{"$error":"#DIV/0!"},{"$error":"#DIV/0!"},{"$f":"COUNTIF(D780:$AL780,\"NE\")/$AV$1","v":{"$error":"#DIV/0!"}},{"$error":"#DIV/0!"}]
[781,{"$nulls":38},{"$error":"#DIV/0!"},{"$error":"#DIV/0!"},{"$error":"#DIV/0!"},{"$error":"#DIV/0!"},{"$f":"COUNTIF(D781:$AL781,\"NE\")/$AV$1","v":{"$error":"#DIV/0!"}},{"$error":"#DIV/0!"}]
[782,{"$nulls":38},{"$error":"#DIV/0!"},{"$error":"#DIV/0!"},{"$error":"#DIV/0!"},{"$error":"#DIV/0!"},{"$f":"COUNTIF(D782:$AL782,\"NE\")/$AV$1","v":{"$error":"#DIV/0!"}},{"$error":"#DIV/0!"}]
[783,{"$nulls":38},{"$error":"#DIV/0!"},{"$error":"#DIV/0!"},{"$error":"#DIV/0!"},{"$error":"#DIV/0!"},{"$f":"COUNTIF(D783:$AL783,\"NE\")/$AV$1","v":{"$error":"#DIV/0!"}},{"$error":"#DIV/0!"}]
[784,{"$nulls":38},{"$error":"#DIV/0!"},{"$error":"#DIV/0!"},{"$error":"#DIV/0!"},{"$error":"#DIV/0!"},{"$f":"COUNTIF(D784:$AL784,\"NE\")/$AV$1","v":{"$error":"#DIV/0!"}},{"$error":"#DIV/0!"}]
[785,{"$nulls":38},{"$error":"#DIV/0!"},{"$error":"#DIV/0!"},{"$error":"#DIV/0!"},{"$error":"#DIV/0!"},{"$f":"COUNTIF(D785:$AL785,\"NE\")/$AV$1","v":{"$error":"#DIV/0!"}},{"$error":"#DIV/0!"}]
[786,{"$nulls":38},{"$error":"#DIV/0!"},{"$error":"#DIV/0!"},{"$error":"#DIV/0!"},{"$error":"#DIV/0!"},{"$f":"COUNTIF(D786:$AL786,\"NE\")/$AV$1","v":{"$error":"#DIV/0!"}},{"$error":"#DIV/0!"}]
[787,{"$nulls":38},{"$error":"#DIV/0!"},{"$error":"#DIV/0!"},{"$error":"#DIV/0!"},{"$error":"#DIV/0!"},{"$f":"COUNTIF(D787:$AL787,\"NE\")/$AV$1","v":{"$error":"#DIV/0!"}},{"$error":"#DIV/0!"}]
[788,{"$nulls":38},{"$error":"#DIV/0!"},{"$error":"#DIV/0!"},{"$error":"#DIV/0!"},{"$error":"#DIV/0!"},{"$f":"COUNTIF(D788:$AL788,\"NE\")/$AV$1","v":{"$error":"#DIV/0!"}},{"$error":"#DIV/0!"}]
[789,{"$nulls":38},{"$error":"#DIV/0!"},{"$error":"#DIV/0!"},{"$error":"#DIV/0!"},{"$error":"#DIV/0!"},{"$f":"COUNTIF(D789:$AL789,\"NE\")/$AV$1","v":{"$error":"#DIV/0!"}},{"$error":"#DIV/0!"}]
[790,{"$nulls":38},{"$error":"#DIV/0!"},{"$error":"#DIV/0!"},{"$error":"#DIV/0!"},{"$error":"#DIV/0!"},{"$f":"COUNTIF(D790:$AL790,\"NE\")/$AV$1","v":{"$error":"#DIV/0!"}},{"$error":"#DIV/0!"}]
[791,{"$nulls":38},{"$error":"#DIV/0!"},{"$error":"#DIV/0!"},{"$error":"#DIV/0!"},{"$error":"#DIV/0!"},{"$f":"COUNTIF(D791:$AL791,\"NE\")/$AV$1","v":{"$error":"#DIV/0!"}},{"$error":"#DIV/0!"}]
[792,{"$nulls":38},{"$error":"#DIV/0!"},{"$error":"#DIV/0!"},{"$error":"#DIV/0!"},{"$error":"#DIV/0!"},{"$f":"COUNTIF(D792:$AL792,\"NE\")/$AV$1","v":{"$error":"#DIV/0!"}},{"$error":"#DIV/0!"}]
[793,{"$nulls":38},{"$error":"#DIV/0!"},{"$error":"#DIV/0!"},{"$error":"#DIV/0!"},{"$error":"#DIV/0!"},{"$f":"COUNTIF(D793:$AL793,\"NE\")/$AV$1","v":{"$error":"#DIV/0!"}},{"$error":"#DIV/0!"}]
[794,{"$nulls":38},{"$error":"#DIV/0!"},{"$error":"#DIV/0!"},{"$error":"#DIV/0!"},{"$error":"#DIV/0!"},{"$f":"COUNTIF(D794:$AL794,\"NE\")/$AV$1","v":{"$error":"#DIV/0!"}},{"$error":"#DIV/0!"}]
[795,{"$nulls":38},{"$error":"#DIV/0!"},{"$error":"#DIV/0!"},{"$error":"#DIV/0!"},{"$error":"#DIV/0!"},{"$f":"COUNTIF(D795:$AL795,\"NE\")/$AV$1","v":{"$error":"#DIV/0!"}},{"$error":"#DIV/0!"}]
[796,{"$nulls":38},{"$error":"#DIV/0!"},{"$error":"#DIV/0!"},{"$error":"#DIV/0!"},{"$error":"#DIV/0!"},{"$f":"COUNTIF(D796:$AL796,\"NE\")/$AV$1","v":{"$error":"#DIV/0!"}},{"$error":"#DIV/0!"}]
[797,{"$nulls":38},{"$error":"#DIV/0!"},{"$error":"#DIV/0!"},{"$error":"#DIV/0!"},{"$error":"#DIV/0!"},{"$f":"COUNTIF(D797:$AL797,\"NE\")/$AV$1","v":{"$error":"#DIV/0!"}},{"$error":"#DIV/0!"}]
[798,{"$nulls":38},{"$error":"#DIV/0!"},{"$error":"#DIV/0!"},{"$error":"#DIV/0!"},{"$error":"#DIV/0!"},{"$f":"COUNTIF(D798:$AL798,\"NE\")/$AV$1","v":{"$error":"#DIV/0!"}},{"$error":"#DIV/0!"}]
[799,{"$nulls":38},{"$error":"#DIV/0!"},{"$error":"#DIV/0!"},{"$error":"#DIV/0!"},{"$error":"#DIV/0!"},{"$f":"COUNTIF(D799:$AL799,\"NE\")/$AV$1","v":{"$error":"#DIV/0!"}},{"$error":"#DIV/0!"}]
[800,{"$nulls":38},{"$error":"#DIV/0!"},{"$error":"#DIV/0!"},{"$error":"#DIV/0!"},{"$error":"#DIV/0!"},{"$f":"COUNTIF(D800:$AL800,\"NE\")/$AV$1","v":{"$error":"#DIV/0!"}},{"$error":"#DIV/0!"}]

{"sheet":"Appréciations","index":8,"n_rows":36,"n_cols":16,"rows_kept":36}
[]
[{"$nulls":4},"PERIODE 1","Jours d'absences","PERIODE 2 \n","Jours d'absences","PERIODE 3","Jours d'absences","PERIODE 4\n","Jours d'absences","PERIODE 5\n","Jours d'absences","Décision du conseil des maîtres concernant les passages","Jours d'absences l'année"]
[]
[null,{"$f":"Renseignements!C16","v":"Marc"},{"$f":"Renseignements!D16","v":"Aurèle"},null,"appreciation P1",3,"appréciation P2",4,"appréciation P3",5,"appréciation P4",6,"appréciation P5",7,"Passe en CM2",{"$f":"N4+L4+J4+H4+F4","v":25}]
[null,{"$f":"Renseignements!C17","v":"Jérôme"},{"$f":"Renseignements!D17","v":"Lenoir"},null,"appréciation lenoir P1",null,"appréciation lenoir P2",null,"appréciation lenoir P3",null,"appréciation lenoir P4",null,"appréciation lenoir P5",null,null,{"$f":"N5+L5+J5+H5+F5","v":0}]
[null,{"$f":"Renseignements!C18","v":"Fabien"},{"$f":"Renseignements!D18","v":"Léglise"},{"$nulls":12},0]
[null,{"$f":"Renseignements!C19","v":"Aicha"},{"$f":"Renseignements!D19","v":"Samarahoui"},{"$nulls":12},0]
[null,{"$f":"Renseignements!C20","v":"Karim"},{"$f":"Renseignements!D20","v":"Maha"},{"$nulls":12},0]
[null,{"$f":"Renseignements!C21","v":0},{"$f":"Renseignements!D21","v":0},{"$nulls":12},0]
[null,{"$f":"Renseignements!C22","v":0},{"$f":"Renseignements!D22","v":0},{"$nulls":12},0]
[null,{"$f":"Renseignements!C23","v":0},{"$f":"Renseignements!D23","v":0},{"$nulls":12},0]
[null,{"$f":"Renseignements!C24","v":0},{"$f":"Renseignements!D24","v":0},{"$nulls":12},0]
[null,{"$f":"Renseignements!C25","v":0},{"$f":"Renseignements!D25","v":0},{"$nulls":12},0]
[null,{"$f":"Renseignements!C26","v":0},{"$f":"Renseignements!D26","v":0},{"$nulls":12},0]
[null,{"$f":"Renseignements!C27","v":0},{"$f":"Renseignements!D27","v":0},{"$nulls":12},0]
[null,{"$f":"Renseignements!C28","v":0},{"$f":"Renseignements!D28","v":0},{"$nulls":12},0]
[null,{"$f":"Renseignements!C29","v":0},{"$f":"Renseignements!D29","v":0},{"$nulls":12},0]
[null,{"$f":"Renseignements!C30","v":0},{"$f":"Renseignements!D30","v":0},{"$nulls":12},0]
[null,{"$f":"Renseignements!C31","v":0},{"$f":"Renseignements!D31","v":0},{"$nulls":12},0]
[null,{"$f":"Renseignements!C32","v":0},{"$f":"Renseignements!D32","v":0},{"$nulls":12},0]
[null,{"$f":"Renseignements!C33","v":0},{"$f":"Renseignements!D33","v":0},{"$nulls":12},0]
[null,{"$f":"Renseignements!C34","v":0},{"$f":"Renseignements!D34","v":0},{"$nulls":12},0]
[null,{"$f":"Renseignements!C35","v":0},{"$f":"Renseignements!D35","v":0},{"$nulls":12},0]
[null,{"$f":"Renseignements!C36","v":0},{"$f":"Renseignements!D36","v":0},{"$nulls":12},0]
[null,{"$f":"Renseignements!C37","v":0},{"$f":"Renseignements!D37","v":0},{"$nulls":12},0]
[null,{"$f":"Renseignements!C38","v":0},{"$f":"Renseignements!D38","v":0},{"$nulls":12},0]
[null,{"$f":"Renseignements!C39","v":0},{"$f":"Renseignements!D39","v":0},{"$nulls":12},0]
[null,{"$f":"Renseignements!C40","v":0},{"$f":"Renseignements!D40","v":0},{"$nulls":12},0]
[null,{"$f":"Renseignements!C41","v":0},{"$f":"Renseignements!D41","v":0},{"$nulls":12},0]
[null,{"$f":"Renseignements!C42","v":0},{"$f":"Renseignements!D42","v":0},{"$nulls":12},0]
[null,{"$f":"Renseignements!C43","v":0},{"$f":"Renseignements!D43","v":0},{"$nulls":12},0]
[null,{"$f":"Renseignements!C44","v":0},{"$f":"Renseignements!D44","v":0},{"$nulls":12},0]
[null,{"$f":"Renseignements!C45","v":0},{"$f":"Renseignements!D45","v":0},{"$nulls":12},0]
[null,{"$f":"Renseignements!C46","v":0},{"$f":"Renseignements!D46","v":0},{"$nulls":12},0]
[null,{"$f":"Renseignements!C47","v":0},{"$f":"Renseignements!D47","v":0},{"$nulls":12},0]
[null,{"$f":"Renseignements!C48","v":0},{"$f":"Renseignements!D48","v":0},{"$nulls":12},0]

{"sheet":"Socle","index":9,"n_rows":78,"n_cols":76,"rows_kept":78,"merged":[[5,36,19,41],[7,43,13,43],[7,44,13,44],[7,45,13,45],[7,46,13,46],[7,47,13,47],[7,48,13,48],[7,49,13,49],[7,50,13,50],[7,51,13,51],[7,52,13,52],[7,53,13,53],[7,54,13,54],[7,55,13,55],[7,56,13,56],[7,57,13,57],[7,58,13,58],[7,59,13,59],[7,60,13,60],[7,61,13,61],[7,62,13,62],[7,63,13,63],[7,64,13,64],[7,65,13,65],[7,66,13,66],[7,67,13,67],[7,68,13,68],[7,69,13,69],[7,70,13,70],[7,71,13,71],[7,72,13,72],[7,73,13,73],[7,74,13,74],[7,75,13,75]]}
[{"$nulls":43},1,{"$f":"AR1+1","v":2},{"$f":"AS1+1","v":3},4,5,6,7,8,9,10,11,12,13,14,15,16,17,18,19,20,21,22,23,24,25,26,27,28,29,30,31,32,33]
[{"$nulls":15},{"$f":"Période!AU1","v":"A"},{"$f":"Période!AU2","v":"B"},{"$f":"Période!AU3","v":"C"},null,{"v":1,"d":"1 "},null,{"v":1,"d":"1 "},null,{"$f":"INDEX(NOMS,nomenfant,1)","v":"Marc  Aurèle"},{"$nulls":4},{"v":5,"d":"5 "}]
[]
[]
[{"$nulls":43},1,{"$f":"AR5+1","v":2},{"$f":"AS5+1","v":3},4,5,6,7,8,9,10,11,12,13,14,15,16,17,18,19,20,21,22,23,24,25,26,27,28,29,30,31,32,33]
[{"$nulls":12},{"$f":"CONCATENATE(\"Ecole  \"&ecole)","v":"Ecole  Léonard de Vinci"},{"$nulls":23},"                             VALIDER LE SOCLE\n\nValidation automatique\nQuand vous cliquez sur le bouton ci dessus, les compétences du socle qui sont réussies seront validées à la date du jour. \n\nCette validation est définitive,  la date ne changera plus, sauf si vous effacez le tableau de droite.\n\nCette opération de validation demande un certain temps de calcul.\n\nValidation manuelle\nEn écrivant une date dans la case du tableau de droite correspondant à la compétence et à l'élève, vous forcez le OUI et validez manuellement cette compétence."]
[]
[{"$nulls":12},"Attestation de maîtrise des connaissances et compétences\n au cours moyen deuxième année",{"$nulls":30},{"$f":"IF(ISBLANK(INDEX(nom,lignenom,1)),\"\",(INDEX(nom,lignenom,1))&\" \" &(INDEX(prénom,lignenom,1)))","v":"Aurèle Prénom"},"Lenoir Marc","Léglise Jérôme","Samarahoui Fabien","Maha Aicha","","","","","","","","","","","","","","","","","","","","","","","","","","","",""]
[]
[{"$nulls":12},{"$f":"X2","v":"Marc  Aurèle"}]
[]
[{"$nulls":12},"La maîtrise de la langue française"]
[{"$nulls":31},"oui","Date"]
[{"$nulls":12},"DIRE"]
[null,null,1,2,250,250,250,250,250,250,null,null,"S'exprimer clairement à l'oral en utilisant un vocabulaire approprié",{"$f":"IF(INDEX(synt,socle1,nomenfant)=\"\",\"\",INDEX(synt,socle1,nomenfant))","v":{"$error":"#NAME?"}},{"$f":"IF(N15=P2,1,IF(N15=Q2,0.65,IF(N15=R2,0.35,\"\")))","v":{"$error":"#NAME?"}},{"$f":"IF(INDEX(synt,socle2,nomenfant)=\"\",\"\",INDEX(synt,socle2,nomenfant))","v":{"$error":"#NAME?"}},{"$f":"IF(P15=P2,1,IF(P15=Q2,0.65,IF(P15=R2,0.35,\"\")))","v":{"$error":"#NAME?"}},{"$f":"IF(INDEX(synt,socle3,nomenfant)=\"\",\"\",INDEX(synt,socle3,nomenfant))","v":{"$error":"#NAME?"}},{"$f":"IF(R15=P2,1,IF(R15=Q2,0.65,IF(R15=R2,0.35,\"\")))","v":{"$error":"#NAME?"}},{"$f":"IF(INDEX(synt,socle4,nomenfant)=\"\",\"\",INDEX(synt,socle4,nomenfant))","v":{"$error":"#NAME?"}},{"$f":"IF(T15=P2,1,IF(T15=Q2,0.65,IF(T15=R2,0.35,\"\")))","v":{"$error":"#NAME?"}},{"$f":"IF(INDEX(synt,socle5,nomenfant)=\"\",\"\",INDEX(synt,socle5,nomenfant))","v":{"$error":"#NAME?"}},{"$f":"IF(V15=P2,1,IF(V15=Q2,0.65,IF(V15=R2,0.35,\"\")))","v":{"$error":"#NAME?"}},{"$f":"IF(INDEX(synt,socle6,nomenfant)=\"\",\"\",INDEX(synt,socle6,nomenfant))","v":{"$error":"#NAME?"}},{"$f":"IF(X15=P2,1,IF(X15=Q2,0.65,IF(X15=R2,0.35,\"\")))","v":{"$error":"#NAME?"}},{"$f":"IF(INDEX(synt,socle7,nomenfant)=\"\",\"\",INDEX(synt,socle7,nomenfant))","v":{"$error":"#NAME?"}},{"$f":"IF(Z15=P2,1,IF(Z15=Q2,0.65,IF(Z15=R2,0.35,\"\")))","v":{"$error":"#NAME?"}},{"$f":"IF(INDEX(synt,socle8,nomenfant)=\"\",\"\",INDEX(synt,socle8,nomenfant))","v":{"$error":"#NAME?"}},{"$f":"IF(AB15=P2,1,IF(AB15=Q2,0.65,IF(AB15=R2,0.35,\"\")))","v":{"$error":"#NAME?"}},{"$f":"IF(SUM(N15:AC15)=0,0,SUM(N15:AC15)/COUNTIF(N15:AC15,\">0\"))","v":{"$error":"#NAME?"}},null,{"$f":"IF(OR(AD15>0.7,AG15>0),\"OUI\",\"\")","v":{"$error":"#NAME?"}},{"$f":"INDEX(validationsocle,AI15,nomenfant)","v":"00:00:00"},null,1]
[null,null,3,4,60,250,250,250,250,250,null,null,"Participer en classe à un échange verbal en respectant les règles de la communication",{"$f":"IF(INDEX(synt,socle1,nomenfant)=\"\",\"\",INDEX(synt,socle1,nomenfant))","v":{"$error":"#NAME?"}},{"$f":"IF(N16=P2,1,IF(N16=Q2,0.65,IF(N16=R2,0.35,\"\")))","v":{"$error":"#NAME?"}},{"$f":"IF(INDEX(synt,socle2,nomenfant)=\"\",\"\",INDEX(synt,socle2,nomenfant))","v":{"$error":"#NAME?"}},{"$f":"IF(P16=P2,1,IF(P16=Q2,0.65,IF(P16=R2,0.35,\"\")))","v":{"$error":"#NAME?"}},{"$f":"IF(INDEX(synt,socle3,nomenfant)=\"\",\"\",INDEX(synt,socle3,nomenfant))","v":{"$error":"#NAME?"}},{"$f":"IF(R16=P2,1,IF(R16=Q2,0.65,IF(R16=R2,0.35,\"\")))","v":{"$error":"#NAME?"}},{"$f":"IF(INDEX(synt,socle4,nomenfant)=\"\",\"\",INDEX(synt,socle4,nomenfant))","v":{"$error":"#NAME?"}},{"$f":"IF(T16=P2,1,IF(T16=Q2,0.65,IF(T16=R2,0.35,\"\")))","v":{"$error":"#NAME?"}},{"$f":"IF(INDEX(synt,socle5,nomenfant)=\"\",\"\",INDEX(synt,socle5,nomenfant))","v":{"$error":"#NAME?"}},{"$f":"IF(V16=P2,1,IF(V16=Q2,0.65,IF(V16=R2,0.35,\"\")))","v":{"$error":"#NAME?"}},{"$f":"IF(INDEX(synt,socle6,nomenfant)=\"\",\"\",INDEX(synt,socle6,nomenfant))","v":{"$error":"#NAME?"}},{"$f":"IF(X16=P2,1,IF(X16=Q2,0.65,IF(X16=R2,0.35,\"\")))","v":{"$error":"#NAME?"}},{"$f":"IF(INDEX(synt,socle7,nomenfant)=\"\",\"\",INDEX(synt,socle7,nomenfant))","v":{"$error":"#NAME?"}},{"$f":"IF(Z16=P2,1,IF(Z16=Q2,0.65,IF(Z16=R2,0.35,\"\")))","v":{"$error":"#NAME?"}},{"$f":"IF(INDEX(synt,socle8,nomenfant)=\"\",\"\",INDEX(synt,socle8,nomenfant))","v":{"$error":"#NAME?"}},{"$f":"IF(AB16=P2,1,IF(AB16=Q2,0.65,IF(AB16=R2,0.35,\"\")))","v":{"$error":"#NAME?"}},{"$f":"IF(SUM(N16:AC16)=0,0,SUM(N16:AC16)/COUNTIF(N16:AC16,\">0\"))","v":{"$error":"#NAME?"}},null,{"$f":"IF(OR(AD16>0.7,AG16>0),\"OUI\",\"\")","v":{"$error":"#NAME?"}},{"$f":"INDEX(validationsocle,AI16,nomenfant)","v":"00:00:00"},null,2]
[null,null,5,250,250,250,250,250,250,250,null,null,"Dire de mémoire quelques textes en prose ou poèmes courts ",{"$f":"IF(INDEX(synt,socle1,nomenfant)=\"\",\"\",INDEX(synt,socle1,nomenfant))","v":{"$error":"#NAME?"}},{"$f":"IF(N17=P2,1,IF(N17=Q2,0.65,IF(N17=R2,0.35,\"\")))","v":{"$error":"#NAME?"}},{"$f":"IF(INDEX(synt,socle2,nomenfant)=\"\",\"\",INDEX(synt,socle2,nomenfant))","v":{"$error":"#NAME?"}},{"$f":"IF(P17=P2,1,IF(P17=Q2,0.65,IF(P17=R2,0.35,\"\")))","v":{"$error":"#NAME?"}},{"$f":"IF(INDEX(synt,socle3,nomenfant)=\"\",\"\",INDEX(synt,socle3,nomenfant))","v":{"$error":"#NAME?"}},{"$f":"IF(R17=P2,1,IF(R17=Q2,0.65,IF(R17=R2,0.35,\"\")))","v":{"$error":"#NAME?"}},{"$f":"IF(INDEX(synt,socle4,nomenfant)=\"\",\"\",INDEX(synt,socle4,nomenfant))","v":{"$error":"#NAME?"}},{"$f":"IF(T17=P2,1,IF(T17=Q2,0.65,IF(T17=R2,0.35,\"\")))","v":{"$error":"#NAME?"}},{"$f":"IF(INDEX(synt,socle5,nomenfant)=\"\",\"\",INDEX(synt,socle5,nomenfant))","v":{"$error":"#NAME?"}},{"$f":"IF(V17=P2,1,IF(V17=Q2,0.65,IF(V17=R2,0.35,\"\")))","v":{"$error":"#NAME?"}},{"$f":"IF(INDEX(synt,socle6,nomenfant)=\"\",\"\",INDEX(synt,socle6,nomenfant))","v":{"$error":"#NAME?"}},{"$f":"IF(X17=P2,1,IF(X17=Q2,0.65,IF(X17=R2,0.35,\"\")))","v":{"$error":"#NAME?"}},{"$f":"IF(INDEX(synt,socle7,nomenfant)=\"\",\"\",INDEX(synt,socle7,nomenfant))","v":{"$error":"#NAME?"}},{"$f":"IF(Z17=P2,1,IF(Z17=Q2,0.65,IF(Z17=R2,0.35,\"\")))","v":{"$error":"#NAME?"}},{"$f":"IF(INDEX(synt,socle8,nomenfant)=\"\",\"\",INDEX(synt,socle8,nomenfant))","v":{"$error":"#NAME?"}},{"$f":"IF(AB17=P2,1,IF(AB17=Q2,0.65,IF(AB17=R2,0.35,\"\")))","v":{"$error":"#NAME?"}},{"$f":"IF(SUM(N17:AC17)=0,0,SUM(N17:AC17)/COUNTIF(N17:AC17,\">0\"))","v":{"$error":"#NAME?"}},null,{"$f":"IF(OR(AD17>0.7,AG17>0),\"OUI\",\"\")","v":{"$error":"#NAME?"}},{"$f":"INDEX(validationsocle,AI17,nomenfant)","v":"00:00:00"},null,{"$f":"AI16+1","v":3}]
[{"$nulls":12},"LIRE",{"$nulls":21},3]
[null,null,6,250,250,250,250,250,250,250,null,null,"Lire seul, à haute voix, un texte comprenant des mots connus et inconnus",{"$f":"IF(INDEX(synt,socle1,nomenfant)=\"\",\"\",INDEX(synt,socle1,nomenfant))","v":{"$error":"#NAME?"}},{"$f":"IF(N19=P2,1,IF(N19=Q2,0.65,IF(N19=R2,0.35,\"\")))","v":{"$error":"#NAME?"}},{"$f":"IF(INDEX(synt,socle2,nomenfant)=\"\",\"\",INDEX(synt,socle2,nomenfant))","v":{"$error":"#NAME?"}},{"$f":"IF(P19=P2,1,IF(P19=Q2,0.65,IF(P19=R2,0.35,\"\")))","v":{"$error":"#NAME?"}},{"$f":"IF(INDEX(synt,socle3,nomenfant)=\"\",\"\",INDEX(synt,socle3,nomenfant))","v":{"$error":"#NAME?"}},{"$f":"IF(R19=P2,1,IF(R19=Q2,0.65,IF(R19=R2,0.35,\"\")))","v":{"$error":"#NAME?"}},{"$f":"IF(INDEX(synt,socle4,nomenfant)=\"\",\"\",INDEX(synt,socle4,nomenfant))","v":{"$error":"#NAME?"}},{"$f":"IF(T19=P2,1,IF(T19=Q2,0.65,IF(T19=R2,0.35,\"\")))","v":{"$error":"#NAME?"}},{"$f":"IF(INDEX(synt,socle5,nomenfant)=\"\",\"\",INDEX(synt,socle5,nomenfant))","v":{"$error":"#NAME?"}},{"$f":"IF(V19=P2,1,IF(V19=Q2,0.65,IF(V19=R2,0.35,\"\")))","v":{"$error":"#NAME?"}},{"$f":"IF(INDEX(synt,socle6,nomenfant)=\"\",\"\",INDEX(synt,socle6,nomenfant))","v":{"$error":"#NAME?"}},{"$f":"IF(X19=P2,1,IF(X19=Q2,0.65,IF(X19=R2,0.35,\"\")))","v":{"$error":"#NAME?"}},{"$f":"IF(INDEX(synt,socle7,nomenfant)=\"\",\"\",INDEX(synt,socle7,nomenfant))","v":{"$error":"#NAME?"}},{"$f":"IF(Z19=P2,1,IF(Z19=Q2,0.65,IF(Z19=R2,0.35,\"\")))","v":{"$error":"#NAME?"}},{"$f":"IF(INDEX(synt,socle8,nomenfant)=\"\",\"\",INDEX(synt,socle8,nomenfant))","v":{"$error":"#NAME?"}},{"$f":"IF(AB19=P2,1,IF(AB19=Q2,0.65,IF(AB19=R2,0.35,\"\")))","v":{"$error":"#NAME?"}},{"$f":"IF(SUM(N19:AC19)=0,0,SUM(N19:AC19)/COUNTIF(N19:AC19,\">0\"))","v":{"$error":"#NAME?"}},null,{"$f":"IF(OR(AD19>0.7,AG19>0),\"OUI\",\"\")","v":{"$error":"#NAME?"}},{"$f":"INDEX(validationsocle,AI19,nomenfant)","v":"00:00:00"},null,3]
[null,null,8,250,250,250,250,250,250,250,null,null,"Lire seul et écouter lire des textes du patrimoine et des œuvres intégrales de la littérature de jeunesse adaptés à son âge",{"$error":"#NAME?"},{"$f":"IF(N20=P2,1,IF(N20=Q2,0.65,IF(N20=R2,0.35,\"\")))","v":{"$error":"#NAME?"}},{"$error":"#NAME?"},{"$f":"IF(P20=P2,1,IF(P20=Q2,0.65,IF(P20=R2,0.35,\"\")))","v":{"$error":"#NAME?"}},{"$error":"#NAME?"},{"$f":"IF(R20=P2,1,IF(R20=Q2,0.65,IF(R20=R2,0.35,\"\")))","v":{"$error":"#NAME?"}},{"$error":"#NAME?"},{"$f":"IF(T20=P2,1,IF(T20=Q2,0.65,IF(T20=R2,0.35,\"\")))","v":{"$error":"#NAME?"}},{"$error":"#NAME?"},{"$f":"IF(V20=P2,1,IF(V20=Q2,0.65,IF(V20=R2,0.35,\"\")))","v":{"$error":"#NAME?"}},{"$error":"#NAME?"},{"$f":"IF(X20=P2,1,IF(X20=Q2,0.65,IF(X20=R2,0.35,\"\")))","v":{"$error":"#NAME?"}},{"$error":"#NAME?"},{"$f":"IF(Z20=P2,1,IF(Z20=Q2,0.65,IF(Z20=R2,0.35,\"\")))","v":{"$error":"#NAME?"}},{"$error":"#NAME?"},{"$f":"IF(AB20=P2,1,IF(AB20=Q2,0.65,IF(AB20=R2,0.35,\"\")))","v":{"$error":"#NAME?"}},{"$f":"IF(SUM(N20:AC20)=0,0,SUM(N20:AC20)/COUNTIF(N20:AC20,\">0\"))","v":{"$error":"#NAME?"}},null,{"$error":"#NAME?"},"00:00:00",null,3]
[null,null,7,250,250,250,250,250,250,250,null,null,"Lire seul et comprendre un énoncé, une consigne simple",{"$error":"#NAME?"},{"$f":"IF(N21=P2,1,IF(N21=Q2,0.65,IF(N21=R2,0.35,\"\")))","v":{"$error":"#NAME?"}},{"$error":"#NAME?"},{"$f":"IF(P21=P2,1,IF(P21=Q2,0.65,IF(P21=R2,0.35,\"\")))","v":{"$error":"#NAME?"}},{"$error":"#NAME?"},{"$f":"IF(R21=P2,1,IF(R21=Q2,0.65,IF(R21=R2,0.35,\"\")))","v":{"$error":"#NAME?"}},{"$error":"#NAME?"},{"$f":"IF(T21=P2,1,IF(T21=Q2,0.65,IF(T21=R2,0.35,\"\")))","v":{"$error":"#NAME?"}},{"$error":"#NAME?"},{"$f":"IF(V21=P2,1,IF(V21=Q2,0.65,IF(V21=R2,0.35,\"\")))","v":{"$error":"#NAME?"}},{"$error":"#NAME?"},{"$f":"IF(X21=P2,1,IF(X21=Q2,0.65,IF(X21=R2,0.35,\"\")))","v":{"$error":"#NAME?"}},{"$error":"#NAME?"},{"$f":"IF(Z21=P2,1,IF(Z21=Q2,0.65,IF(Z21=R2,0.35,\"\")))","v":{"$error":"#NAME?"}},{"$error":"#NAME?"},{"$f":"IF(AB21=P2,1,IF(AB21=Q2,0.65,IF(AB21=R2,0.35,\"\")))","v":{"$error":"#NAME?"}},{"$error":"#NAME?"},null,{"$error":"#NAME?"},"00:00:00",null,3]
[null,null,9,10,250,250,250,250,250,250,null,null,"Dégager le thème d'un paragraphe ou d'un texte court",{"$error":"#NAME?"},{"$f":"IF(N22=P2,1,IF(N22=Q2,0.65,IF(N22=R2,0.35,\"\")))","v":{"$error":"#NAME?"}},{"$error":"#NAME?"},{"$f":"IF(P22=P2,1,IF(P22=Q2,0.65,IF(P22=R2,0.35,\"\")))","v":{"$error":"#NAME?"}},{"$error":"#NAME?"},{"$f":"IF(R22=P2,1,IF(R22=Q2,0.65,IF(R22=R2,0.35,\"\")))","v":{"$error":"#NAME?"}},{"$error":"#NAME?"},{"$f":"IF(T22=P2,1,IF(T22=Q2,0.65,IF(T22=R2,0.35,\"\")))","v":{"$error":"#NAME?"}},{"$error":"#NAME?"},{"$f":"IF(V22=P2,1,IF(V22=Q2,0.65,IF(V22=R2,0.35,\"\")))","v":{"$error":"#NAME?"}},{"$error":"#NAME?"},{"$f":"IF(X22=P2,1,IF(X22=Q2,0.65,IF(X22=R2,0.35,\"\")))","v":{"$error":"#NAME?"}},{"$error":"#NAME?"},{"$f":"IF(Z22=P2,1,IF(Z22=Q2,0.65,IF(Z22=R2,0.35,\"\")))","v":{"$error":"#NAME?"}},{"$error":"#NAME?"},{"$f":"IF(AB22=P2,1,IF(AB22=Q2,0.65,IF(AB22=R2,0.35,\"\")))","v":{"$error":"#NAME?"}},{"$error":"#NAME?"},null,{"$error":"#NAME?"},"00:00:00",null,3]
[null,null,7,250,250,250,250,250,250,250,null,null,"Lire silencieusement un texte en déchiffrant les mots inconnus et manifester sa compréhension dans un résumé, une reformulation, des réponses à des questions",{"$error":"#NAME?"},{"$f":"IF(N23=P2,1,IF(N23=Q2,0.65,IF(N23=R2,0.35,\"\")))","v":{"$error":"#NAME?"}},{"$error":"#NAME?"},{"$f":"IF(P23=P2,1,IF(P23=Q2,0.65,IF(P23=R2,0.35,\"\")))","v":{"$error":"#NAME?"}},{"$error":"#NAME?"},{"$f":"IF(R23=P2,1,IF(R23=Q2,0.65,IF(R23=R2,0.35,\"\")))","v":{"$error":"#NAME?"}},{"$error":"#NAME?"},{"$f":"IF(T23=P2,1,IF(T23=Q2,0.65,IF(T23=R2,0.35,\"\")))","v":{"$error":"#NAME?"}},{"$error":"#NAME?"},{"$f":"IF(V23=P2,1,IF(V23=Q2,0.65,IF(V23=R2,0.35,\"\")))","v":{"$error":"#NAME?"}},{"$error":"#NAME?"},{"$f":"IF(X23=P2,1,IF(X23=Q2,0.65,IF(X23=R2,0.35,\"\")))","v":{"$error":"#NAME?"}},{"$error":"#NAME?"},{"$f":"IF(Z23=P2,1,IF(Z23=Q2,0.65,IF(Z23=R2,0.35,\"\")))","v":{"$error":"#NAME?"}},{"$error":"#NAME?"},{"$f":"IF(AB23=P2,1,IF(AB23=Q2,0.65,IF(AB23=R2,0.35,\"\")))","v":{"$error":"#NAME?"}},{"$error":"#NAME?"},null,{"$error":"#NAME?"},"00:00:00",null,3]
[{"$nulls":12},"ÉCRIRE",{"$nulls":21},3]
[null,null,11,12,250,250,250,250,250,250,null,null,"Copier un texte court sans erreur dans une écriture cursive lisible et avec une présentation soignée",{"$f":"IF(INDEX(synt,socle1,nomenfant)=\"\",\"\",INDEX(synt,socle1,nomenfant))","v":{"$error":"#NAME?"}},{"$f":"IF(N25=P2,1,IF(N25=Q2,0.65,IF(N25=R2,0.35,\"\")))","v":{"$error":"#NAME?"}},{"$f":"IF(INDEX(synt,socle2,nomenfant)=\"\",\"\",INDEX(synt,socle2,nomenfant))","v":{"$error":"#NAME?"}},{"$f":"IF(P25=P2,1,IF(P25=Q2,0.65,IF(P25=R2,0.35,\"\")))","v":{"$error":"#NAME?"}},{"$f":"IF(INDEX(synt,socle3,nomenfant)=\"\",\"\",INDEX(synt,socle3,nomenfant))","v":{"$error":"#NAME?"}},{"$f":"IF(R25=P2,1,IF(R25=Q2,0.65,IF(R25=R2,0.35,\"\")))","v":{"$error":"#NAME?"}},{"$f":"IF(INDEX(synt,socle4,nomenfant)=\"\",\"\",INDEX(synt,socle4,nomenfant))","v":{"$error":"#NAME?"}},{"$f":"IF(T25=P2,1,IF(T25=Q2,0.65,IF(T25=R2,0.35,\"\")))","v":{"$error":"#NAME?"}},{"$f":"IF(INDEX(synt,socle5,nomenfant)=\"\",\"\",INDEX(synt,socle5,nomenfant))","v":{"$error":"#NAME?"}},{"$f":"IF(V25=P2,1,IF(V25=Q2,0.65,IF(V25=R2,0.35,\"\")))","v":{"$error":"#NAME?"}},{"$f":"IF(INDEX(synt,socle6,nomenfant)=\"\",\"\",INDEX(synt,socle6,nomenfant))","v":{"$error":"#NAME?"}},{"$f":"IF(X25=P2,1,IF(X25=Q2,0.65,IF(X25=R2,0.35,\"\")))","v":{"$error":"#NAME?"}},{"$f":"IF(INDEX(synt,socle7,nomenfant)=\"\",\"\",INDEX(synt,socle7,nomenfant))","v":{"$error":"#NAME?"}},{"$f":"IF(Z25=P2,1,IF(Z25=Q2,0.65,IF(Z25=R2,0.35,\"\")))","v":{"$error":"#NAME?"}},{"$f":"IF(INDEX(synt,socle8,nomenfant)=\"\",\"\",INDEX(synt,socle8,nomenfant))","v":{"$error":"#NAME?"}},{"$f":"IF(AB25=P2,1,IF(AB25=Q2,0.65,IF(AB25=R2,0.35,\"\")))","v":{"$error":"#NAME?"}},{"$error":"#NAME?"},null,{"$f":"IF(OR(AD25>0.7,AG25>0),\"OUI\",\"\")","v":{"$error":"#NAME?"}},{"$f":"INDEX(validationsocle,AI25,nomenfant)","v":"00:00:00"},null,3]
[null,null,13,250,250,250,250,250,250,250,null,null,"Utiliser ses connaissances pour mieux écrire un texte court ",{"$f":"IF(INDEX(synt,socle1,nomenfant)=\"\",\"\",INDEX(synt,socle1,nomenfant))","v":{"$error":"#NAME?"}},{"$f":"IF(N26=P2,1,IF(N26=Q2,0.65,IF(N26=R2,0.35,\"\")))","v":{"$error":"#NAME?"}},{"$f":"IF(INDEX(synt,socle2,nomenfant)=\"\",\"\",INDEX(synt,socle2,nomenfant))","v":{"$error":"#NAME?"}},{"$f":"IF(P26=P2,1,IF(P26=Q2,0.65,IF(P26=R2,0.35,\"\")))","v":{"$error":"#NAME?"}},{"$f":"IF(INDEX(synt,socle3,nomenfant)=\"\",\"\",INDEX(synt,socle3,nomenfant))","v":{"$error":"#NAME?"}},{"$f":"IF(R26=P2,1,IF(R26=Q2,0.65,IF(R26=R2,0.35,\"\")))","v":{"$error":"#NAME?"}},{"$f":"IF(INDEX(synt,socle4,nomenfant)=\"\",\"\",INDEX(synt,socle4,nomenfant))","v":{"$error":"#NAME?"}},{"$f":"IF(T26=P2,1,IF(T26=Q2,0.65,IF(T26=R2,0.35,\"\")))","v":{"$error":"#NAME?"}},{"$f":"IF(INDEX(synt,socle5,nomenfant)=\"\",\"\",INDEX(synt,socle5,nomenfant))","v":{"$error":"#NAME?"}},{"$f":"IF(V26=P2,1,IF(V26=Q2,0.65,IF(V26=R2,0.35,\"\")))","v":{"$error":"#NAME?"}},{"$f":"IF(INDEX(synt,socle6,nomenfant)=\"\",\"\",INDEX(synt,socle6,nomenfant))","v":{"$error":"#NAME?"}},{"$f":"IF(X26=P2,1,IF(X26=Q2,0.65,IF(X26=R2,0.35,\"\")))","v":{"$error":"#NAME?"}},{"$f":"IF(INDEX(synt,socle7,nomenfant)=\"\",\"\",INDEX(synt,socle7,nomenfant))","v":{"$error":"#NAME?"}},{"$f":"IF(Z26=P2,1,IF(Z26=Q2,0.65,IF(Z26=R2,0.35,\"\")))","v":{"$error":"#NAME?"}},{"$f":"IF(INDEX(synt,socle8,nomenfant)=\"\",\"\",INDEX(synt,socle8,nomenfant))","v":{"$error":"#NAME?"}},{"$f":"IF(AB26=P2,1,IF(AB26=Q2,0.65,IF(AB26=R2,0.35,\"\")))","v":{"$error":"#NAME?"}},{"$error":"#NAME?"},null,{"$f":"IF(OR(AD26>0.7,AG26>0),\"OUI\",\"\")","v":{"$error":"#NAME?"}},{"$f":"INDEX(validationsocle,AI26,nomenfant)","v":"00:00:00"},null,3]
[null,null,14,15,250,250,250,250,250,250,null,null,"Écrire de manière autonome un texte de cinq à dix lignes",{"$f":"IF(INDEX(synt,socle1,nomenfant)=\"\",\"\",INDEX(synt,socle1,nomenfant))","v":{"$error":"#NAME?"}},{"$f":"IF(N27=P2,1,IF(N27=Q2,0.65,IF(N27=R2,0.35,\"\")))","v":{"$error":"#NAME?"}},{"$f":"IF(INDEX(synt,socle2,nomenfant)=\"\",\"\",INDEX(synt,socle2,nomenfant))","v":{"$error":"#NAME?"}},{"$f":"IF(P27=P2,1,IF(P27=Q2,0.65,IF(P27=R2,0.35,\"\")))","v":{"$error":"#NAME?"}},{"$f":"IF(INDEX(synt,socle3,nomenfant)=\"\",\"\",INDEX(synt,socle3,nomenfant))","v":{"$error":"#NAME?"}},{"$f":"IF(R27=P2,1,IF(R27=Q2,0.65,IF(R27=R2,0.35,\"\")))","v":{"$error":"#NAME?"}},{"$f":"IF(INDEX(synt,socle4,nomenfant)=\"\",\"\",INDEX(synt,socle4,nomenfant))","v":{"$error":"#NAME?"}},{"$f":"IF(T27=P2,1,IF(T27=Q2,0.65,IF(T27=R2,0.35,\"\")))","v":{"$error":"#NAME?"}},{"$f":"IF(INDEX(synt,socle5,nomenfant)=\"\",\"\",INDEX(synt,socle5,nomenfant))","v":{"$error":"#NAME?"}},{"$f":"IF(V27=P2,1,IF(V27=Q2,0.65,IF(V27=R2,0.35,\"\")))","v":{"$error":"#NAME?"}},{"$f":"IF(INDEX(synt,socle6,nomenfant)=\"\",\"\",INDEX(synt,socle6,nomenfant))","v":{"$error":"#NAME?"}},{"$f":"IF(X27=P2,1,IF(X27=Q2,0.65,IF(X27=R2,0.35,\"\")))","v":{"$error":"#NAME?"}},{"$f":"IF(INDEX(synt,socle7,nomenfant)=\"\",\"\",INDEX(synt,socle7,nomenfant))","v":{"$error":"#NAME?"}},{"$f":"IF(Z27=P2,1,IF(Z27=Q2,0.65,IF(Z27=R2,0.35,\"\")))","v":{"$error":"#NAME?"}},{"$f":"IF(INDEX(synt,socle8,nomenfant)=\"\",\"\",INDEX(synt,socle8,nomenfant))","v":{"$error":"#NAME?"}},{"$f":"IF(AB27=P2,1,IF(AB27=Q2,0.65,IF(AB27=R2,0.35,\"\")))","v":{"$error":"#NAME?"}},{"$error":"#NAME?"},null,{"$f":"IF(OR(AD27>0.7,AG27>0),\"OUI\",\"\")","v":{"$error":"#NAME?"}},{"$f":"INDEX(validationsocle,AI27,nomenfant)","v":"00:00:00"},null,3]
[{"$nulls":12},"ÉTUDE DE LA LANGUE : VOCABULAIRE",{"$nulls":21},3]
[null,null,16,250,250,250,250,250,250,250,null,null,"Utiliser des mots précis pour s’exprimer ",{"$f":"IF(INDEX(synt,socle1,nomenfant)=\"\",\"\",INDEX(synt,socle1,nomenfant))","v":{"$error":"#NAME?"}},{"$f":"IF(N29=P2,1,IF(N29=Q2,0.65,IF(N29=R2,0.35,\"\")))","v":{"$error":"#NAME?"}},{"$f":"IF(INDEX(synt,socle2,nomenfant)=\"\",\"\",INDEX(synt,socle2,nomenfant))","v":{"$error":"#NAME?"}},{"$f":"IF(P29=P2,1,IF(P29=Q2,0.65,IF(P29=R2,0.35,\"\")))","v":{"$error":"#NAME?"}},{"$f":"IF(INDEX(synt,socle3,nomenfant)=\"\",\"\",INDEX(synt,socle3,nomenfant))","v":{"$error":"#NAME?"}},{"$f":"IF(R29=P2,1,IF(R29=Q2,0.65,IF(R29=R2,0.35,\"\")))","v":{"$error":"#NAME?"}},{"$f":"IF(INDEX(synt,socle4,nomenfant)=\"\",\"\",INDEX(synt,socle4,nomenfant))","v":{"$error":"#NAME?"}},{"$f":"IF(T29=P2,1,IF(T29=Q2,0.65,IF(T29=R2,0.35,\"\")))","v":{"$error":"#NAME?"}},{"$f":"IF(INDEX(synt,socle5,nomenfant)=\"\",\"\",INDEX(synt,socle5,nomenfant))","v":{"$error":"#NAME?"}},{"$f":"IF(V29=P2,1,IF(V29=Q2,0.65,IF(V29=R2,0.35,\"\")))","v":{"$error":"#NAME?"}},{"$f":"IF(INDEX(synt,socle6,nomenfant)=\"\",\"\",INDEX(synt,socle6,nomenfant))","v":{"$error":"#NAME?"}},{"$f":"IF(X29=P2,1,IF(X29=Q2,0.65,IF(X29=R2,0.35,\"\")))","v":{"$error":"#NAME?"}},{"$f":"IF(INDEX(synt,socle7,nomenfant)=\"\",\"\",INDEX(synt,socle7,nomenfant))","v":{"$error":"#NAME?"}},{"$f":"IF(Z29=P2,1,IF(Z29=Q2,0.65,IF(Z29=R2,0.35,\"\")))","v":{"$error":"#NAME?"}},{"$f":"IF(INDEX(synt,socle8,nomenfant)=\"\",\"\",INDEX(synt,socle8,nomenfant))","v":{"$error":"#NAME?"}},{"$f":"IF(AB29=P2,1,IF(AB29=Q2,0.65,IF(AB29=R2,0.35,\"\")))","v":{"$error":"#NAME?"}},{"$error":"#NAME?"},null,{"$f":"IF(OR(AD29>0.7,AG29>0),\"OUI\",\"\")","v":{"$error":"#NAME?"}},{"$f":"INDEX(validationsocle,AI29,nomenfant)","v":"00:00:00"},null,3]
[null,null,17,250,250,250,250,250,250,250,null,null,"Donner des synonymes",{"$f":"IF(INDEX(synt,socle1,nomenfant)=\"\",\"\",INDEX(synt,socle1,nomenfant))","v":{"$error":"#NAME?"}},{"$f":"IF(N30=P2,1,IF(N30=Q2,0.65,IF(N30=R2,0.35,\"\")))","v":{"$error":"#NAME?"}},{"$f":"IF(INDEX(synt,socle2,nomenfant)=\"\",\"\",INDEX(synt,socle2,nomenfant))","v":{"$error":"#NAME?"}},{"$f":"IF(P20=P2,1,IF(P20=Q2,0.65,IF(P20=R2,0.35,\"\")))","v":{"$error":"#NAME?"}},{"$f":"IF(INDEX(synt,socle3,nomenfant)=\"\",\"\",INDEX(synt,socle3,nomenfant))","v":{"$error":"#NAME?"}},{"$f":"IF(R20=P2,1,IF(R20=Q2,0.65,IF(R20=R2,0.35,\"\")))","v":{"$error":"#NAME?"}},{"$f":"IF(INDEX(synt,socle4,nomenfant)=\"\",\"\",INDEX(synt,socle4,nomenfant))","v":{"$error":"#NAME?"}},{"$f":"IF(T30=P2,1,IF(T30=Q2,0.65,IF(T30=R2,0.35,\"\")))","v":{"$error":"#NAME?"}},{"$f":"IF(INDEX(synt,socle5,nomenfant)=\"\",\"\",INDEX(synt,socle5,nomenfant))","v":{"$error":"#NAME?"}},{"$f":"IF(V30=P2,1,IF(V30=Q2,0.65,IF(V30=R2,0.35,\"\")))","v":{"$error":"#NAME?"}},{"$f":"IF(INDEX(synt,socle6,nomenfant)=\"\",\"\",INDEX(synt,socle6,nomenfant))","v":{"$error":"#NAME?"}},{"$f":"IF(X30=P2,1,IF(X30=Q2,0.65,IF(X30=R2,0.35,\"\")))","v":{"$error":"#NAME?"}},{"$f":"IF(INDEX(synt,socle7,nomenfant)=\"\",\"\",INDEX(synt,socle7,nomenfant))","v":{"$error":"#NAME?"}},{"$f":"IF(Z30=P2,1,IF(Z30=Q2,0.65,IF(Z30=R2,0.35,\"\")))","v":{"$error":"#NAME?"}},{"$f":"IF(INDEX(synt,socle8,nomenfant)=\"\",\"\",INDEX(synt,socle8,nomenfant))","v":{"$error":"#NAME?"}},{"$f":"IF(AB30=P2,1,IF(AB30=Q2,0.65,IF(AB30=R2,0.35,\"\")))","v":{"$error":"#NAME?"}},{"$error":"#NAME?"},null,{"$f":"IF(OR(AD30>0.7,AG30>0),\"OUI\",\"\")","v":{"$error":"#NAME?"}},{"$f":"INDEX(validationsocle,AI30,nomenfant)","v":"00:00:00"},null,3]
[null,null,18,250,250,250,250,250,250,250,null,null,"Trouver un mot de sens opposé",{"$f":"IF(INDEX(synt,socle1,nomenfant)=\"\",\"\",INDEX(synt,socle1,nomenfant))","v":{"$error":"#NAME?"}},{"$f":"IF(N31=P2,1,IF(N31=Q2,0.65,IF(N31=R2,0.35,\"\")))","v":{"$error":"#NAME?"}},{"$f":"IF(INDEX(synt,socle2,nomenfant)=\"\",\"\",INDEX(synt,socle2,nomenfant))","v":{"$error":"#NAME?"}},{"$f":"IF(P21=P2,1,IF(P21=Q2,0.65,IF(P21=R2,0.35,\"\")))","v":{"$error":"#NAME?"}},{"$f":"IF(INDEX(synt,socle3,nomenfant)=\"\",\"\",INDEX(synt,socle3,nomenfant))","v":{"$error":"#NAME?"}},{"$f":"IF(R21=P2,1,IF(R21=Q2,0.65,IF(R21=R2,0.35,\"\")))","v":{"$error":"#NAME?"}},{"$f":"IF(INDEX(synt,socle4,nomenfant)=\"\",\"\",INDEX(synt,socle4,nomenfant))","v":{"$error":"#NAME?"}},{"$f":"IF(T31=P2,1,IF(T31=Q2,0.65,IF(T31=R2,0.35,\"\")))","v":{"$error":"#NAME?"}},{"$f":"IF(INDEX(synt,socle5,nomenfant)=\"\",\"\",INDEX(synt,socle5,nomenfant))","v":{"$error":"#NAME?"}},{"$f":"IF(V31=P2,1,IF(V31=Q2,0.65,IF(V31=R2,0.35,\"\")))","v":{"$error":"#NAME?"}},{"$f":"IF(INDEX(synt,socle6,nomenfant)=\"\",\"\",INDEX(synt,socle6,nomenfant))","v":{"$error":"#NAME?"}},{"$f":"IF(X31=P2,1,IF(X31=Q2,0.65,IF(X31=R2,0.35,\"\")))","v":{"$error":"#NAME?"}},{"$f":"IF(INDEX(synt,socle7,nomenfant)=\"\",\"\",INDEX(synt,socle7,nomenfant))","v":{"$error":"#NAME?"}},{"$f":"IF(Z31=P2,1,IF(Z31=Q2,0.65,IF(Z31=R2,0.35,\"\")))","v":{"$error":"#NAME?"}},{"$f":"IF(INDEX(synt,socle8,nomenfant)=\"\",\"\",INDEX(synt,socle8,nomenfant))","v":{"$error":"#NAME?"}},{"$f":"IF(AB31=P2,1,IF(AB31=Q2,0.65,IF(AB31=R2,0.35,\"\")))","v":{"$error":"#NAME?"}},{"$f":"IF(SUM(N31:AC31)=0,0,SUM(N31:AC31)/COUNTIF(N31:AC31,\">0\"))","v":{"$error":"#NAME?"}},null,{"$f":"IF(OR(AD31>0.7,AG31>0),\"OUI\",\"\")","v":{"$error":"#NAME?"}},{"$f":"INDEX(validationsocle,AI31,nomenfant)","v":"00:00:00"},null,3]
[null,null,19,250,250,250,250,250,250,250,null,null,"Regrouper des mots par familles",{"$f":"IF(INDEX(synt,socle1,nomenfant)=\"\",\"\",INDEX(synt,socle1,nomenfant))","v":{"$error":"#NAME?"}},{"$f":"IF(N32=P2,1,IF(N32=Q2,0.65,IF(N32=R2,0.35,\"\")))","v":{"$error":"#NAME?"}},{"$f":"IF(INDEX(synt,socle2,nomenfant)=\"\",\"\",INDEX(synt,socle2,nomenfant))","v":{"$error":"#NAME?"}},{"$f":"IF(P22=P2,1,IF(P22=Q2,0.65,IF(P22=R2,0.35,\"\")))","v":{"$error":"#NAME?"}},{"$f":"IF(INDEX(synt,socle3,nomenfant)=\"\",\"\",INDEX(synt,socle3,nomenfant))","v":{"$error":"#NAME?"}},{"$f":"IF(R22=P2,1,IF(R22=Q2,0.65,IF(R22=R2,0.35,\"\")))","v":{"$error":"#NAME?"}},{"$f":"IF(INDEX(synt,socle4,nomenfant)=\"\",\"\",INDEX(synt,socle4,nomenfant))","v":{"$error":"#NAME?"}},{"$f":"IF(T32=P2,1,IF(T32=Q2,0.65,IF(T32=R2,0.35,\"\")))","v":{"$error":"#NAME?"}},{"$f":"IF(INDEX(synt,socle5,nomenfant)=\"\",\"\",INDEX(synt,socle5,nomenfant))","v":{"$error":"#NAME?"}},{"$f":"IF(V32=P2,1,IF(V32=Q2,0.65,IF(V32=R2,0.35,\"\")))","v":{"$error":"#NAME?"}},{"$f":"IF(INDEX(synt,socle6,nomenfant)=\"\",\"\",INDEX(synt,socle6,nomenfant))","v":{"$error":"#NAME?"}},{"$f":"IF(X32=P2,1,IF(X32=Q2,0.65,IF(X32=R2,0.35,\"\")))","v":{"$error":"#NAME?"}},{"$f":"IF(INDEX(synt,socle7,nomenfant)=\"\",\"\",INDEX(synt,socle7,nomenfant))","v":{"$error":"#NAME?"}},{"$f":"IF(Z32=P2,1,IF(Z32=Q2,0.65,IF(Z32=R2,0.35,\"\")))","v":{"$error":"#NAME?"}},{"$f":"IF(INDEX(synt,socle8,nomenfant)=\"\",\"\",INDEX(synt,socle8,nomenfant))","v":{"$error":"#NAME?"}},{"$f":"IF(AB32=P2,1,IF(AB32=Q2,0.65,IF(AB32=R2,0.35,\"\")))","v":{"$error":"#NAME?"}},{"$error":"#NAME?"},null,{"$f":"IF(OR(AD32>0.7,AG32>0),\"OUI\",\"\")","v":{"$error":"#NAME?"}},{"$f":"INDEX(validationsocle,AI32,nomenfant)","v":"00:00:00"},null,3]
[null,null,20,250,250,250,250,250,250,250,null,null,"Commencer à utiliser l’ordre alphabétique",{"$f":"IF(INDEX(synt,socle1,nomenfant)=\"\",\"\",INDEX(synt,socle1,nomenfant))","v":{"$error":"#NAME?"}},{"$f":"IF(N33=P2,1,IF(N33=Q2,0.65,IF(N33=R2,0.35,\"\")))","v":{"$error":"#NAME?"}},{"$f":"IF(INDEX(synt,socle2,nomenfant)=\"\",\"\",INDEX(synt,socle2,nomenfant))","v":{"$error":"#NAME?"}},{"$f":"IF(P23=P2,1,IF(P23=Q2,0.65,IF(P23=R2,0.35,\"\")))","v":{"$error":"#NAME?"}},{"$f":"IF(INDEX(synt,socle3,nomenfant)=\"\",\"\",INDEX(synt,socle3,nomenfant))","v":{"$error":"#NAME?"}},{"$f":"IF(R23=P2,1,IF(R23=Q2,0.65,IF(R23=R2,0.35,\"\")))","v":{"$error":"#NAME?"}},{"$f":"IF(INDEX(synt,socle4,nomenfant)=\"\",\"\",INDEX(synt,socle4,nomenfant))","v":{"$error":"#NAME?"}},{"$f":"IF(T33=P2,1,IF(T33=Q2,0.65,IF(T33=R2,0.35,\"\")))","v":{"$error":"#NAME?"}},{"$f":"IF(INDEX(synt,socle5,nomenfant)=\"\",\"\",INDEX(synt,socle5,nomenfant))","v":{"$error":"#NAME?"}},{"$f":"IF(V33=P2,1,IF(V33=Q2,0.65,IF(V33=R2,0.35,\"\")))","v":{"$error":"#NAME?"}},{"$f":"IF(INDEX(synt,socle6,nomenfant)=\"\",\"\",INDEX(synt,socle6,nomenfant))","v":{"$error":"#NAME?"}},{"$f":"IF(X33=P2,1,IF(X33=Q2,0.65,IF(X33=R2,0.35,\"\")))","v":{"$error":"#NAME?"}},{"$f":"IF(INDEX(synt,socle7,nomenfant)=\"\",\"\",INDEX(synt,socle7,nomenfant))","v":{"$error":"#NAME?"}},{"$f":"IF(Z33=P2,1,IF(Z33=Q2,0.65,IF(Z33=R2,0.35,\"\")))","v":{"$error":"#NAME?"}},{"$f":"IF(INDEX(synt,socle8,nomenfant)=\"\",\"\",INDEX(synt,socle8,nomenfant))","v":{"$error":"#NAME?"}},{"$f":"IF(AB33=P2,1,IF(AB33=Q2,0.65,IF(AB33=R2,0.35,\"\")))","v":{"$error":"#NAME?"}},{"$error":"#NAME?"},null,{"$f":"IF(OR(AD33>0.7,AG33>0),\"OUI\",\"\")","v":{"$error":"#NAME?"}},{"$f":"INDEX(validationsocle,AI33,nomenfant)","v":"00:00:00"},null,3]
[{"$nulls":12},"ÉTUDE DE LA LANGUE : GRAMMAIRE",{"$nulls":21},3]
[null,null,21,22,250,250,250,250,250,250,null,null,"Identifier la phrase, le verbe, le nom, l’article, l’adjectif qualificatif, le pronom personnel (sujet)",{"$f":"IF(INDEX(synt,socle1,nomenfant)=\"\",\"\",INDEX(synt,socle1,nomenfant))","v":{"$error":"#NAME?"}},{"$f":"IF(N35=P2,1,IF(N35=Q2,0.65,IF(N35=R2,0.35,\"\")))","v":{"$error":"#NAME?"}},{"$f":"IF(INDEX(synt,socle2,nomenfant)=\"\",\"\",INDEX(synt,socle2,nomenfant))","v":{"$error":"#NAME?"}},{"$f":"IF(P25=P2,1,IF(P25=Q2,0.65,IF(P25=R2,0.35,\"\")))","v":{"$error":"#NAME?"}},{"$f":"IF(INDEX(synt,socle3,nomenfant)=\"\",\"\",INDEX(synt,socle3,nomenfant))","v":{"$error":"#NAME?"}},{"$f":"IF(R25=P2,1,IF(R25=Q2,0.65,IF(R25=R2,0.35,\"\")))","v":{"$error":"#NAME?"}},{"$f":"IF(INDEX(synt,socle4,nomenfant)=\"\",\"\",INDEX(synt,socle4,nomenfant))","v":{"$error":"#NAME?"}},{"$f":"IF(T35=P2,1,IF(T35=Q2,0.65,IF(T35=R2,0.35,\"\")))","v":{"$error":"#NAME?"}},{"$f":"IF(INDEX(synt,socle5,nomenfant)=\"\",\"\",INDEX(synt,socle5,nomenfant))","v":{"$error":"#NAME?"}},{"$f":"IF(V35=P2,1,IF(V35=Q2,0.65,IF(V35=R2,0.35,\"\")))","v":{"$error":"#NAME?"}},{"$f":"IF(INDEX(synt,socle6,nomenfant)=\"\",\"\",INDEX(synt,socle6,nomenfant))","v":{"$error":"#NAME?"}},{"$f":"IF(X35=P2,1,IF(X35=Q2,0.65,IF(X35=R2,0.35,\"\")))","v":{"$error":"#NAME?"}},{"$f":"IF(INDEX(synt,socle7,nomenfant)=\"\",\"\",INDEX(synt,socle7,nomenfant))","v":{"$error":"#NAME?"}},{"$f":"IF(Z35=P2,1,IF(Z35=Q2,0.65,IF(Z35=R2,0.35,\"\")))","v":{"$error":"#NAME?"}},{"$f":"IF(INDEX(synt,socle8,nomenfant)=\"\",\"\",INDEX(synt,socle8,nomenfant))","v":{"$error":"#NAME?"}},{"$f":"IF(AB35=P2,1,IF(AB35=Q2,0.65,IF(AB35=R2,0.35,\"\")))","v":{"$error":"#NAME?"}},{"$error":"#NAME?"},null,{"$f":"IF(OR(AD35>0.7,AG35>0),\"OUI\",\"\")","v":{"$error":"#NAME?"}},{"$f":"INDEX(validationsocle,AI35,nomenfant)","v":"00:00:00"},null,3]
[null,null,22,250,250,250,250,250,250,250,null,null,"Repérer le verbe d’une phrase et son sujet",{"$f":"IF(INDEX(synt,socle1,nomenfant)=\"\",\"\",INDEX(synt,socle1,nomenfant))","v":{"$error":"#NAME?"}},{"$f":"IF(N36=P2,1,IF(N36=Q2,0.65,IF(N36=R2,0.35,\"\")))","v":{"$error":"#NAME?"}},{"$f":"IF(INDEX(synt,socle2,nomenfant)=\"\",\"\",INDEX(synt,socle2,nomenfant))","v":{"$error":"#NAME?"}},{"$f":"IF(P26=P2,1,IF(P26=Q2,0.65,IF(P26=R2,0.35,\"\")))","v":{"$error":"#NAME?"}},{"$f":"IF(INDEX(synt,socle3,nomenfant)=\"\",\"\",INDEX(synt,socle3,nomenfant))","v":{"$error":"#NAME?"}},{"$f":"IF(R26=P2,1,IF(R26=Q2,0.65,IF(R26=R2,0.35,\"\")))","v":{"$error":"#NAME?"}},{"$f":"IF(INDEX(synt,socle4,nomenfant)=\"\",\"\",INDEX(synt,socle4,nomenfant))","v":{"$error":"#NAME?"}},{"$f":"IF(T36=P2,1,IF(T36=Q2,0.65,IF(T36=R2,0.35,\"\")))","v":{"$error":"#NAME?"}},{"$f":"IF(INDEX(synt,socle5,nomenfant)=\"\",\"\",INDEX(synt,socle5,nomenfant))","v":{"$error":"#NAME?"}},{"$f":"IF(V36=P2,1,IF(V36=Q2,0.65,IF(V36=R2,0.35,\"\")))","v":{"$error":"#NAME?"}},{"$f":"IF(INDEX(synt,socle6,nomenfant)=\"\",\"\",INDEX(synt,socle6,nomenfant))","v":{"$error":"#NAME?"}},{"$f":"IF(X36=P2,1,IF(X36=Q2,0.65,IF(X36=R2,0.35,\"\")))","v":{"$error":"#NAME?"}},{"$f":"IF(INDEX(synt,socle7,nomenfant)=\"\",\"\",INDEX(synt,socle7,nomenfant))","v":{"$error":"#NAME?"}},{"$f":"IF(Z36=P2,1,IF(Z36=Q2,0.65,IF(Z36=R2,0.35,\"\")))","v":{"$error":"#NAME?"}},{"$f":"IF(INDEX(synt,socle8,nomenfant)=\"\",\"\",INDEX(synt,socle8,nomenfant))","v":{"$error":"#NAME?"}},{"$f":"IF(AB36=P2,1,IF(AB36=Q2,0.65,IF(AB36=R2,0.35,\"\")))","v":{"$error":"#NAME?"}},{"$error":"#NAME?"},null,{"$f":"IF(OR(AD36>0.7,AG36>0),\"OUI\",\"\")","v":{"$error":"#NAME?"}},{"$f":"INDEX(validationsocle,AI36,nomenfant)","v":"00:00:00"},null,3]
[null,null,25,250,250,250,250,250,250,250,null,null,"Conjuguer les verbes du 1er groupe, être et avoir, au présent, au futur, au passé composé de l’indicatif; conjuguer les verbes faire, aller, dire, venir, au présent de l’indicatif",{"$f":"IF(INDEX(synt,socle1,nomenfant)=\"\",\"\",INDEX(synt,socle1,nomenfant))","v":{"$error":"#NAME?"}},{"$f":"IF(N37=P2,1,IF(N37=Q2,0.65,IF(N37=R2,0.35,\"\")))","v":{"$error":"#NAME?"}},{"$f":"IF(INDEX(synt,socle2,nomenfant)=\"\",\"\",INDEX(synt,socle2,nomenfant))","v":{"$error":"#NAME?"}},{"$f":"IF(P27=P2,1,IF(P27=Q2,0.65,IF(P27=R2,0.35,\"\")))","v":{"$error":"#NAME?"}},{"$f":"IF(INDEX(synt,socle3,nomenfant)=\"\",\"\",INDEX(synt,socle3,nomenfant))","v":{"$error":"#NAME?"}},{"$f":"IF(R27=P2,1,IF(R27=Q2,0.65,IF(R27=R2,0.35,\"\")))","v":{"$error":"#NAME?"}},{"$f":"IF(INDEX(synt,socle4,nomenfant)=\"\",\"\",INDEX(synt,socle4,nomenfant))","v":{"$error":"#NAME?"}},{"$f":"IF(T37=P2,1,IF(T37=Q2,0.65,IF(T37=R2,0.35,\"\")))","v":{"$error":"#NAME?"}},{"$f":"IF(INDEX(synt,socle5,nomenfant)=\"\",\"\",INDEX(synt,socle5,nomenfant))","v":{"$error":"#NAME?"}},{"$f":"IF(V37=P2,1,IF(V37=Q2,0.65,IF(V37=R2,0.35,\"\")))","v":{"$error":"#NAME?"}},{"$f":"IF(INDEX(synt,socle6,nomenfant)=\"\",\"\",INDEX(synt,socle6,nomenfant))","v":{"$error":"#NAME?"}},{"$f":"IF(X37=P2,1,IF(X37=Q2,0.65,IF(X37=R2,0.35,\"\")))","v":{"$error":"#NAME?"}},{"$f":"IF(INDEX(synt,socle7,nomenfant)=\"\",\"\",INDEX(synt,socle7,nomenfant))","v":{"$error":"#NAME?"}},{"$f":"IF(Z37=P2,1,IF(Z37=Q2,0.65,IF(Z37=R2,0.35,\"\")))","v":{"$error":"#NAME?"}},{"$f":"IF(INDEX(synt,socle8,nomenfant)=\"\",\"\",INDEX(synt,socle8,nomenfant))","v":{"$error":"#NAME?"}},{"$f":"IF(AB37=P2,1,IF(AB37=Q2,0.65,IF(AB37=R2,0.35,\"\")))","v":{"$error":"#NAME?"}},{"$f":"IF(SUM(N37:AC37)=0,0,SUM(N37:AC37)/COUNTIF(N37:AC37,\">0\"))","v":{"$error":"#NAME?"}},null,{"$f":"IF(OR(AD37>0.7,AG37>0),\"OUI\",\"\")","v":{"$error":"#NAME?"}},{"$f":"INDEX(validationsocle,AI37,nomenfant)","v":"00:00:00"},null,3]
[null,null,23,24,250,250,250,250,250,250,null,null,"Distinguer le présent, du futur et du passé",{"$f":"IF(INDEX(synt,socle1,nomenfant)=\"\",\"\",INDEX(synt,socle1,nomenfant))","v":{"$error":"#NAME?"}},{"$f":"IF(N38=P2,1,IF(N38=Q2,0.65,IF(N38=R2,0.35,\"\")))","v":{"$error":"#NAME?"}},{"$f":"IF(INDEX(synt,socle2,nomenfant)=\"\",\"\",INDEX(synt,socle2,nomenfant))","v":{"$error":"#NAME?"}},{"$f":"IF(P28=P2,1,IF(P28=Q2,0.65,IF(P28=R2,0.35,\"\")))","v":""},{"$f":"IF(INDEX(synt,socle3,nomenfant)=\"\",\"\",INDEX(synt,socle3,nomenfant))","v":{"$error":"#NAME?"}},{"$f":"IF(R28=P2,1,IF(R28=Q2,0.65,IF(R28=R2,0.35,\"\")))","v":""},{"$f":"IF(INDEX(synt,socle4,nomenfant)=\"\",\"\",INDEX(synt,socle4,nomenfant))","v":{"$error":"#NAME?"}},{"$f":"IF(T38=P2,1,IF(T38=Q2,0.65,IF(T38=R2,0.35,\"\")))","v":{"$error":"#NAME?"}},{"$f":"IF(INDEX(synt,socle5,nomenfant)=\"\",\"\",INDEX(synt,socle5,nomenfant))","v":{"$error":"#NAME?"}},{"$f":"IF(V38=P2,1,IF(V38=Q2,0.65,IF(V38=R2,0.35,\"\")))","v":{"$error":"#NAME?"}},{"$f":"IF(INDEX(synt,socle6,nomenfant)=\"\",\"\",INDEX(synt,socle6,nomenfant))","v":{"$error":"#NAME?"}},{"$f":"IF(X38=P2,1,IF(X38=Q2,0.65,IF(X38=R2,0.35,\"\")))","v":{"$error":"#NAME?"}},{"$f":"IF(INDEX(synt,socle7,nomenfant)=\"\",\"\",INDEX(synt,socle7,nomenfant))","v":{"$error":"#NAME?"}},{"$f":"IF(Z38=P2,1,IF(Z38=Q2,0.65,IF(Z38=R2,0.35,\"\")))","v":{"$error":"#NAME?"}},{"$f":"IF(INDEX(synt,socle8,nomenfant)=\"\",\"\",INDEX(synt,socle8,nomenfant))","v":{"$error":"#NAME?"}},{"$f":"IF(AB38=P2,1,IF(AB38=Q2,0.65,IF(AB38=R2,0.35,\"\")))","v":{"$error":"#NAME?"}},{"$f":"IF(SUM(N38:AC38)=0,0,SUM(N38:AC38)/COUNTIF(N38:AC38,\">0\"))","v":{"$error":"#NAME?"}},null,{"$f":"IF(OR(AD38>0.7,AG38>0),\"OUI\",\"\")","v":{"$error":"#NAME?"}},{"$f":"INDEX(validationsocle,AI38,nomenfant)","v":"00:00:00"},null,3]
[{"$nulls":12},"ÉTUDE DE LA LANGUE : ORTHOGRAPHE",{"$nulls":21},3]
[null,null,27,28,250,250,250,250,250,250,null,null,"Écrire en respectant les correspondances entre lettres et sons et les règles relatives à la valeur des lettres",{"$f":"IF(INDEX(synt,socle1,nomenfant)=\"\",\"\",INDEX(synt,socle1,nomenfant))","v":{"$error":"#NAME?"}},{"$f":"IF(N40=P2,1,IF(N40=Q2,0.65,IF(N40=R2,0.35,\"\")))","v":{"$error":"#NAME?"}},{"$f":"IF(INDEX(synt,socle2,nomenfant)=\"\",\"\",INDEX(synt,socle2,nomenfant))","v":{"$error":"#NAME?"}},{"$f":"IF(P40=P2,1,IF(P40=Q2,0.65,IF(P40=R2,0.35,\"\")))","v":{"$error":"#NAME?"}},{"$f":"IF(INDEX(synt,socle3,nomenfant)=\"\",\"\",INDEX(synt,socle3,nomenfant))","v":{"$error":"#NAME?"}},{"$f":"IF(R40=P2,1,IF(R40=Q2,0.65,IF(R40=R2,0.35,\"\")))","v":{"$error":"#NAME?"}},{"$f":"IF(INDEX(synt,socle4,nomenfant)=\"\",\"\",INDEX(synt,socle4,nomenfant))","v":{"$error":"#NAME?"}},{"$f":"IF(T40=P2,1,IF(T40=Q2,0.65,IF(T40=R2,0.35,\"\")))","v":{"$error":"#NAME?"}},{"$f":"IF(INDEX(synt,socle5,nomenfant)=\"\",\"\",INDEX(synt,socle5,nomenfant))","v":{"$error":"#NAME?"}},{"$f":"IF(V40=P2,1,IF(V40=Q2,0.65,IF(V40=R2,0.35,\"\")))","v":{"$error":"#NAME?"}},{"$f":"IF(INDEX(synt,socle6,nomenfant)=\"\",\"\",INDEX(synt,socle6,nomenfant))","v":{"$error":"#NAME?"}},{"$f":"IF(X40=P2,1,IF(X40=Q2,0.65,IF(X40=R2,0.35,\"\")))","v":{"$error":"#NAME?"}},{"$f":"IF(INDEX(synt,socle7,nomenfant)=\"\",\"\",INDEX(synt,socle7,nomenfant))","v":{"$error":"#NAME?"}},{"$f":"IF(Z40=P2,1,IF(Z40=Q2,0.65,IF(Z40=R2,0.35,\"\")))","v":{"$error":"#NAME?"}},{"$f":"IF(INDEX(synt,socle8,nomenfant)=\"\",\"\",INDEX(synt,socle8,nomenfant))","v":{"$error":"#NAME?"}},{"$f":"IF(AB40=P2,1,IF(AB40=Q2,0.65,IF(AB40=R2,0.35,\"\")))","v":{"$error":"#NAME?"}},{"$error":"#NAME?"},null,{"$f":"IF(OR(AD40>0.7,AG40>0),\"OUI\",\"\")","v":{"$error":"#NAME?"}},{"$f":"INDEX(validationsocle,AI40,nomenfant)","v":"00:00:00"},null,3]
[null,null,26,250,250,250,250,250,250,250,null,null,"Écrire sans erreur des mots mémorisés",{"$f":"IF(INDEX(synt,socle1,nomenfant)=\"\",\"\",INDEX(synt,socle1,nomenfant))","v":{"$error":"#NAME?"}},{"$f":"IF(N41=P2,1,IF(N41=Q2,0.65,IF(N41=R2,0.35,\"\")))","v":{"$error":"#NAME?"}},{"$f":"IF(INDEX(synt,socle2,nomenfant)=\"\",\"\",INDEX(synt,socle2,nomenfant))","v":{"$error":"#NAME?"}},{"$f":"IF(P41=P2,1,IF(P41=Q2,0.65,IF(P41=R2,0.35,\"\")))","v":{"$error":"#NAME?"}},{"$f":"IF(INDEX(synt,socle3,nomenfant)=\"\",\"\",INDEX(synt,socle3,nomenfant))","v":{"$error":"#NAME?"}},{"$f":"IF(R41=P2,1,IF(R41=Q2,0.65,IF(R41=R2,0.35,\"\")))","v":{"$error":"#NAME?"}},{"$f":"IF(INDEX(synt,socle4,nomenfant)=\"\",\"\",INDEX(synt,socle4,nomenfant))","v":{"$error":"#NAME?"}},{"$f":"IF(T41=P2,1,IF(T41=Q2,0.65,IF(T41=R2,0.35,\"\")))","v":{"$error":"#NAME?"}},{"$f":"IF(INDEX(synt,socle5,nomenfant)=\"\",\"\",INDEX(synt,socle5,nomenfant))","v":{"$error":"#NAME?"}},{"$f":"IF(V41=P2,1,IF(V41=Q2,0.65,IF(V41=R2,0.35,\"\")))","v":{"$error":"#NAME?"}},{"$f":"IF(INDEX(synt,socle6,nomenfant)=\"\",\"\",INDEX(synt,socle6,nomenfant))","v":{"$error":"#NAME?"}},{"$f":"IF(X41=P2,1,IF(X41=Q2,0.65,IF(X41=R2,0.35,\"\")))","v":{"$error":"#NAME?"}},{"$f":"IF(INDEX(synt,socle7,nomenfant)=\"\",\"\",INDEX(synt,socle7,nomenfant))","v":{"$error":"#NAME?"}},{"$f":"IF(Z41=P2,1,IF(Z41=Q2,0.65,IF(Z41=R2,0.35,\"\")))","v":{"$error":"#NAME?"}},{"$f":"IF(INDEX(synt,socle8,nomenfant)=\"\",\"\",INDEX(synt,socle8,nomenfant))","v":{"$error":"#NAME?"}},{"$f":"IF(AB41=P2,1,IF(AB41=Q2,0.65,IF(AB41=R2,0.35,\"\")))","v":{"$error":"#NAME?"}},{"$error":"#NAME?"},null,{"$f":"IF(OR(AD41>0.7,AG41>0),\"OUI\",\"\")","v":{"$error":"#NAME?"}},{"$f":"INDEX(validationsocle,AI41,nomenfant)","v":"00:00:00"},null,3]
[null,null,29,30,31,250,250,250,250,250,null,null,"Orthographier correctement des formes conjuguées, respecter l’accord entre le sujet et le verbe, ainsi que les accords en genre et en nombre dans le groupe nominal",{"$f":"IF(INDEX(synt,socle1,nomenfant)=\"\",\"\",INDEX(synt,socle1,nomenfant))","v":{"$error":"#NAME?"}},{"$f":"IF(N42=P2,1,IF(N42=Q2,0.65,IF(N42=R2,0.35,\"\")))","v":{"$error":"#NAME?"}},{"$f":"IF(INDEX(synt,socle2,nomenfant)=\"\",\"\",INDEX(synt,socle2,nomenfant))","v":{"$error":"#NAME?"}},{"$f":"IF(P42=P2,1,IF(P42=Q2,0.65,IF(P42=R2,0.35,\"\")))","v":{"$error":"#NAME?"}},{"$f":"IF(INDEX(synt,socle3,nomenfant)=\"\",\"\",INDEX(synt,socle3,nomenfant))","v":{"$error":"#NAME?"}},{"$f":"IF(R42=P2,1,IF(R42=Q2,0.65,IF(R42=R2,0.35,\"\")))","v":{"$error":"#NAME?"}},{"$f":"IF(INDEX(synt,socle4,nomenfant)=\"\",\"\",INDEX(synt,socle4,nomenfant))","v":{"$error":"#NAME?"}},{"$f":"IF(T42=P2,1,IF(T42=Q2,0.65,IF(T42=R2,0.35,\"\")))","v":{"$error":"#NAME?"}},{"$f":"IF(INDEX(synt,socle5,nomenfant)=\"\",\"\",INDEX(synt,socle5,nomenfant))","v":{"$error":"#NAME?"}},{"$f":"IF(V42=P2,1,IF(V42=Q2,0.65,IF(V42=R2,0.35,\"\")))","v":{"$error":"#NAME?"}},{"$f":"IF(INDEX(synt,socle6,nomenfant)=\"\",\"\",INDEX(synt,socle6,nomenfant))","v":{"$error":"#NAME?"}},{"$f":"IF(X42=P2,1,IF(X42=Q2,0.65,IF(X42=R2,0.35,\"\")))","v":{"$error":"#NAME?"}},{"$f":"IF(INDEX(synt,socle7,nomenfant)=\"\",\"\",INDEX(synt,socle7,nomenfant))","v":{"$error":"#NAME?"}},{"$f":"IF(Z42=P2,1,IF(Z42=Q2,0.65,IF(Z42=R2,0.35,\"\")))","v":{"$error":"#NAME?"}},{"$f":"IF(INDEX(synt,socle8,nomenfant)=\"\",\"\",INDEX(synt,socle8,nomenfant))","v":{"$error":"#NAME?"}},{"$f":"IF(AB42=P2,1,IF(AB42=Q2,0.65,IF(AB42=R2,0.35,\"\")))","v":{"$error":"#NAME?"}},{"$error":"#NAME?"},null,{"$f":"IF(OR(AD42>0.7,AG42>0),\"OUI\",\"\")","v":{"$error":"#NAME?"}},{"$f":"INDEX(validationsocle,AI42,nomenfant)","v":"00:00:00"},null,3]
[{"$nulls":34},3]
[{"$nulls":34},3]
[{"$nulls":12},"Les principaux éléments de mathématiques",{"$nulls":21},3]
[{"$nulls":34},3]
[{"$nulls":12},"NOMBRES ET CALCUL",{"$nulls":21},3]
[null,null,32,250,250,250,250,250,250,250,null,null,"Écrire, nommer, comparer, ranger les nombres entiers naturels inférieurs à 1000",{"$f":"IF(INDEX(synt,socle1,nomenfant)=\"\",\"\",INDEX(synt,socle1,nomenfant))","v":{"$error":"#NAME?"}},{"$f":"IF(N48=P2,1,IF(N48=Q2,0.65,IF(N48=R2,0.35,\"\")))","v":{"$error":"#NAME?"}},{"$f":"IF(INDEX(synt,socle2,nomenfant)=\"\",\"\",INDEX(synt,socle2,nomenfant))","v":{"$error":"#NAME?"}},{"$f":"IF(P48=P2,1,IF(P48=Q2,0.65,IF(P48=R2,0.35,\"\")))","v":{"$error":"#NAME?"}},{"$f":"IF(INDEX(synt,socle3,nomenfant)=\"\",\"\",INDEX(synt,socle3,nomenfant))","v":{"$error":"#NAME?"}},{"$f":"IF(R48=P2,1,IF(R48=Q2,0.65,IF(R48=R2,0.35,\"\")))","v":{"$error":"#NAME?"}},{"$f":"IF(INDEX(synt,socle4,nomenfant)=\"\",\"\",INDEX(synt,socle4,nomenfant))","v":{"$error":"#NAME?"}},{"$f":"IF(T48=P2,1,IF(T48=Q2,0.65,IF(T48=R2,0.35,\"\")))","v":{"$error":"#NAME?"}},{"$f":"IF(INDEX(synt,socle5,nomenfant)=\"\",\"\",INDEX(synt,socle5,nomenfant))","v":{"$error":"#NAME?"}},{"$f":"IF(V48=P2,1,IF(V48=Q2,0.65,IF(V48=R2,0.35,\"\")))","v":{"$error":"#NAME?"}},{"$f":"IF(INDEX(synt,socle6,nomenfant)=\"\",\"\",INDEX(synt,socle6,nomenfant))","v":{"$error":"#NAME?"}},{"$f":"IF(X48=P2,1,IF(X48=Q2,0.65,IF(X48=R2,0.35,\"\")))","v":{"$error":"#NAME?"}},{"$f":"IF(INDEX(synt,socle7,nomenfant)=\"\",\"\",INDEX(synt,socle7,nomenfant))","v":{"$error":"#NAME?"}},{"$f":"IF(Z48=P2,1,IF(Z48=Q2,0.65,IF(Z48=R2,0.35,\"\")))","v":{"$error":"#NAME?"}},{"$f":"IF(INDEX(synt,socle8,nomenfant)=\"\",\"\",INDEX(synt,socle8,nomenfant))","v":{"$error":"#NAME?"}},{"$f":"IF(AB48=P2,1,IF(AB48=Q2,0.65,IF(AB48=R2,0.35,\"\")))","v":{"$error":"#NAME?"}},{"$f":"IF(SUM(N48:AC48)=0,0,SUM(N48:AC48)/COUNTIF(N48:AC48,\">0\"))","v":{"$error":"#NAME?"}},null,{"$f":"IF(OR(AD48>0.7,AG48>0),\"OUI\",\"\")","v":{"$error":"#NAME?"}},{"$f":"INDEX(validationsocle,AI48,nomenfant)","v":"00:00:00"},null,3]
[null,null,33,250,250,250,250,250,250,250,null,null,"Résoudre des problèmes de dénombrement",{"$error":"#NAME?"},{"$f":"IF(N49=P2,1,IF(N49=Q2,0.65,IF(N49=R2,0.35,\"\")))","v":{"$error":"#NAME?"}},{"$error":"#NAME?"},{"$f":"IF(P49=P2,1,IF(P49=Q2,0.65,IF(P49=R2,0.35,\"\")))","v":{"$error":"#NAME?"}},{"$error":"#NAME?"},{"$f":"IF(R49=P2,1,IF(R49=Q2,0.65,IF(R49=R2,0.35,\"\")))","v":{"$error":"#NAME?"}},{"$error":"#NAME?"},{"$f":"IF(T49=P2,1,IF(T49=Q2,0.65,IF(T49=R2,0.35,\"\")))","v":{"$error":"#NAME?"}},{"$error":"#NAME?"},{"$f":"IF(V49=P2,1,IF(V49=Q2,0.65,IF(V49=R2,0.35,\"\")))","v":{"$error":"#NAME?"}},{"$error":"#NAME?"},{"$f":"IF(X49=P2,1,IF(X49=Q2,0.65,IF(X49=R2,0.35,\"\")))","v":{"$error":"#NAME?"}},{"$error":"#NAME?"},{"$f":"IF(Z49=P2,1,IF(Z49=Q2,0.65,IF(Z49=R2,0.35,\"\")))","v":{"$error":"#NAME?"}},{"$error":"#NAME?"},{"$f":"IF(AB49=P2,1,IF(AB49=Q2,0.65,IF(AB49=R2,0.35,\"\")))","v":{"$error":"#NAME?"}},{"$error":"#NAME?"},null,{"$error":"#NAME?"},"00:00:00",null,3]
[null,null,35,36,37,38,250,250,250,250,null,null,"Calculer: addition, soustraction, multiplication",{"$error":"#NAME?"},{"$f":"IF(N50=P2,1,IF(N50=Q2,0.65,IF(N50=R2,0.35,\"\")))","v":{"$error":"#NAME?"}},{"$error":"#NAME?"},{"$f":"IF(P50=P2,1,IF(P50=Q2,0.65,IF(P50=R2,0.35,\"\")))","v":{"$error":"#NAME?"}},{"$error":"#NAME?"},{"$f":"IF(R50=P2,1,IF(R50=Q2,0.65,IF(R50=R2,0.35,\"\")))","v":{"$error":"#NAME?"}},{"$error":"#NAME?"},{"$f":"IF(T50=P2,1,IF(T50=Q2,0.65,IF(T50=R2,0.35,\"\")))","v":{"$error":"#NAME?"}},{"$error":"#NAME?"},{"$f":"IF(V50=P2,1,IF(V50=Q2,0.65,IF(V50=R2,0.35,\"\")))","v":{"$error":"#NAME?"}},{"$error":"#NAME?"},{"$f":"IF(X50=P2,1,IF(X50=Q2,0.65,IF(X50=R2,0.35,\"\")))","v":{"$error":"#NAME?"}},{"$error":"#NAME?"},{"$f":"IF(Z50=P2,1,IF(Z50=Q2,0.65,IF(Z50=R2,0.35,\"\")))","v":{"$error":"#NAME?"}},{"$error":"#NAME?"},{"$f":"IF(AB50=P2,1,IF(AB50=Q2,0.65,IF(AB50=R2,0.35,\"\")))","v":{"$error":"#NAME?"}},{"$error":"#NAME?"},null,{"$error":"#NAME?"},"00:00:00",null,3]
[null,null,39,250,250,250,250,250,250,250,null,null,"Diviser par 2 et par 5 dans le cas où le quotient exact est entier",{"$error":"#NAME?"},{"$f":"IF(N51=P2,1,IF(N51=Q2,0.65,IF(N51=R2,0.35,\"\")))","v":{"$error":"#NAME?"}},{"$error":"#NAME?"},{"$f":"IF(P51=P2,1,IF(P51=Q2,0.65,IF(P51=R2,0.35,\"\")))","v":{"$error":"#NAME?"}},{"$error":"#NAME?"},{"$f":"IF(R51=P2,1,IF(R51=Q2,0.65,IF(R51=R2,0.35,\"\")))","v":{"$error":"#NAME?"}},{"$error":"#NAME?"},{"$f":"IF(T51=P2,1,IF(T51=Q2,0.65,IF(T51=R2,0.35,\"\")))","v":{"$error":"#NAME?"}},{"$error":"#NAME?"},{"$f":"IF(V51=P2,1,IF(V51=Q2,0.65,IF(V51=R2,0.35,\"\")))","v":{"$error":"#NAME?"}},{"$error":"#NAME?"},{"$f":"IF(X51=P2,1,IF(X51=Q2,0.65,IF(X51=R2,0.35,\"\")))","v":{"$error":"#NAME?"}},{"$error":"#NAME?"},{"$f":"IF(Z51=P2,1,IF(Z51=Q2,0.65,IF(Z51=R2,0.35,\"\")))","v":{"$error":"#NAME?"}},{"$error":"#NAME?"},{"$f":"IF(AB51=P2,1,IF(AB51=Q2,0.65,IF(AB51=R2,0.35,\"\")))","v":{"$error":"#NAME?"}},{"$error":"#NAME?"},null,{"$error":"#NAME?"},"00:00:00",null,3]
[null,null,34,250,250,250,250,250,250,250,null,null,"Restituer et utiliser les tables d'addition et de multiplication par 2,3,4 et 5",{"$error":"#NAME?"},{"$f":"IF(N52=P2,1,IF(N52=Q2,0.65,IF(N52=R2,0.35,\"\")))","v":{"$error":"#NAME?"}},{"$error":"#NAME?"},{"$f":"IF(P52=P2,1,IF(P52=Q2,0.65,IF(P52=R2,0.35,\"\")))","v":{"$error":"#NAME?"}},{"$error":"#NAME?"},{"$f":"IF(R52=P2,1,IF(R52=Q2,0.65,IF(R52=R2,0.35,\"\")))","v":{"$error":"#NAME?"}},{"$error":"#NAME?"},{"$f":"IF(T52=P2,1,IF(T52=Q2,0.65,IF(T52=R2,0.35,\"\")))","v":{"$error":"#NAME?"}},{"$error":"#NAME?"},{"$f":"IF(V52=P2,1,IF(V52=Q2,0.65,IF(V52=R2,0.35,\"\")))","v":{"$error":"#NAME?"}},{"$error":"#NAME?"},{"$f":"IF(X52=P2,1,IF(X52=Q2,0.65,IF(X52=R2,0.35,\"\")))","v":{"$error":"#NAME?"}},{"$error":"#NAME?"},{"$f":"IF(Z52=P2,1,IF(Z52=Q2,0.65,IF(Z52=R2,0.35,\"\")))","v":{"$error":"#NAME?"}},{"$error":"#NAME?"},{"$f":"IF(AB52=P2,1,IF(AB52=Q2,0.65,IF(AB52=R2,0.35,\"\")))","v":{"$error":"#NAME?"}},{"$error":"#NAME?"},null,{"$error":"#NAME?"},"00:00:00",null,3]
[null,null,34,36,250,250,250,250,250,250,null,null,"Calculer mentalement en utilisant des additions, des soustractions et des multiplications simples",{"$error":"#NAME?"},{"$f":"IF(N53=P2,1,IF(N53=Q2,0.65,IF(N53=R2,0.35,\"\")))","v":{"$error":"#NAME?"}},{"$error":"#NAME?"},{"$f":"IF(P53=P2,1,IF(P53=Q2,0.65,IF(P53=R2,0.35,\"\")))","v":{"$error":"#NAME?"}},{"$error":"#NAME?"},{"$f":"IF(R53=P2,1,IF(R53=Q2,0.65,IF(R53=R2,0.35,\"\")))","v":{"$error":"#NAME?"}},{"$error":"#NAME?"},{"$f":"IF(T53=P2,1,IF(T53=Q2,0.65,IF(T53=R2,0.35,\"\")))","v":{"$error":"#NAME?"}},{"$error":"#NAME?"},{"$f":"IF(V53=P2,1,IF(V53=Q2,0.65,IF(V53=R2,0.35,\"\")))","v":{"$error":"#NAME?"}},{"$error":"#NAME?"},{"$f":"IF(X53=P2,1,IF(X53=Q2,0.65,IF(X53=R2,0.35,\"\")))","v":{"$error":"#NAME?"}},{"$error":"#NAME?"},{"$f":"IF(Z53=P2,1,IF(Z53=Q2,0.65,IF(Z53=R2,0.35,\"\")))","v":{"$error":"#NAME?"}},{"$error":"#NAME?"},{"$f":"IF(AB53=P2,1,IF(AB53=Q2,0.65,IF(AB53=R2,0.35,\"\")))","v":{"$error":"#NAME?"}},{"$error":"#NAME?"},null,{"$error":"#NAME?"},"00:00:00",null,3]
[null,null,40,250,250,250,250,250,250,250,null,null,"Résoudre des problèmes relevant de l’addition, de la soustraction et de la multiplication",{"$error":"#NAME?"},{"$f":"IF(N54=P2,1,IF(N54=Q2,0.65,IF(N54=R2,0.35,\"\")))","v":{"$error":"#NAME?"}},{"$error":"#NAME?"},{"$f":"IF(P54=P2,1,IF(P54=Q2,0.65,IF(P54=R2,0.35,\"\")))","v":{"$error":"#NAME?"}},{"$error":"#NAME?"},{"$f":"IF(R54=P2,1,IF(R54=Q2,0.65,IF(R54=R2,0.35,\"\")))","v":{"$error":"#NAME?"}},{"$error":"#NAME?"},{"$f":"IF(T54=P2,1,IF(T54=Q2,0.65,IF(T54=R2,0.35,\"\")))","v":{"$error":"#NAME?"}},{"$error":"#NAME?"},{"$f":"IF(V54=P2,1,IF(V54=Q2,0.65,IF(V54=R2,0.35,\"\")))","v":{"$error":"#NAME?"}},{"$error":"#NAME?"},{"$f":"IF(X54=P2,1,IF(X54=Q2,0.65,IF(X54=R2,0.35,\"\")))","v":{"$error":"#NAME?"}},{"$error":"#NAME?"},{"$f":"IF(Z54=P2,1,IF(Z54=Q2,0.65,IF(Z54=R2,0.35,\"\")))","v":{"$error":"#NAME?"}},{"$error":"#NAME?"},{"$f":"IF(AB54=P2,1,IF(AB54=Q2,0.65,IF(AB54=R2,0.35,\"\")))","v":{"$error":"#NAME?"}},{"$error":"#NAME?"},null,{"$error":"#NAME?"},"00:00:00",null,3]
[null,null,41,250,250,250,250,250,250,250,null,null,"Utiliser les fonctions de base de la calculatrice",{"$error":"#NAME?"},{"$f":"IF(N55=P2,1,IF(N55=Q2,0.65,IF(N55=R2,0.35,\"\")))","v":{"$error":"#NAME?"}},{"$error":"#NAME?"},{"$f":"IF(P55=P2,1,IF(P55=Q2,0.65,IF(P55=R2,0.35,\"\")))","v":{"$error":"#NAME?"}},{"$error":"#NAME?"},{"$f":"IF(R55=P2,1,IF(R55=Q2,0.65,IF(R55=R2,0.35,\"\")))","v":{"$error":"#NAME?"}},{"$error":"#NAME?"},{"$f":"IF(T55=P2,1,IF(T55=Q2,0.65,IF(T55=R2,0.35,\"\")))","v":{"$error":"#NAME?"}},{"$error":"#NAME?"},{"$f":"IF(V55=P2,1,IF(V55=Q2,0.65,IF(V55=R2,0.35,\"\")))","v":{"$error":"#NAME?"}},{"$error":"#NAME?"},{"$f":"IF(X55=P2,1,IF(X55=Q2,0.65,IF(X55=R2,0.35,\"\")))","v":{"$error":"#NAME?"}},{"$error":"#NAME?"},{"$f":"IF(Z55=P2,1,IF(Z55=Q2,0.65,IF(Z55=R2,0.35,\"\")))","v":{"$error":"#NAME?"}},{"$error":"#NAME?"},{"$f":"IF(AB55=P2,1,IF(AB55=Q2,0.65,IF(AB55=R2,0.35,\"\")))","v":{"$error":"#NAME?"}},{"$error":"#NAME?"},null,{"$error":"#NAME?"},"00:00:00",null,3]
[{"$nulls":12},"GÉOMÉTRIE",{"$nulls":21},3]
[null,null,42,250,250,250,250,250,250,250,null,null,"Situer un objet par rapport à soi ou à un autre objet, donner sa position et décrire son déplacement",{"$f":"IF(INDEX(synt,socle1,nomenfant)=\"\",\"\",INDEX(synt,socle1,nomenfant))","v":{"$error":"#NAME?"}},{"$f":"IF(N57=P2,1,IF(N57=Q2,0.65,IF(N57=R2,0.35,\"\")))","v":{"$error":"#NAME?"}},{"$f":"IF(INDEX(synt,socle2,nomenfant)=\"\",\"\",INDEX(synt,socle2,nomenfant))","v":{"$error":"#NAME?"}},{"$f":"IF(P57=P2,1,IF(P57=Q2,0.65,IF(P57=R2,0.35,\"\")))","v":{"$error":"#NAME?"}},{"$f":"IF(INDEX(synt,socle3,nomenfant)=\"\",\"\",INDEX(synt,socle3,nomenfant))","v":{"$error":"#NAME?"}},{"$f":"IF(R57=P2,1,IF(R57=Q2,0.65,IF(R57=R2,0.35,\"\")))","v":{"$error":"#NAME?"}},{"$f":"IF(INDEX(synt,socle4,nomenfant)=\"\",\"\",INDEX(synt,socle4,nomenfant))","v":{"$error":"#NAME?"}},{"$f":"IF(T57=P2,1,IF(T57=Q2,0.65,IF(T57=R2,0.35,\"\")))","v":{"$error":"#NAME?"}},{"$f":"IF(INDEX(synt,socle5,nomenfant)=\"\",\"\",INDEX(synt,socle5,nomenfant))","v":{"$error":"#NAME?"}},{"$f":"IF(V57=P2,1,IF(V57=Q2,0.65,IF(V57=R2,0.35,\"\")))","v":{"$error":"#NAME?"}},{"$f":"IF(INDEX(synt,socle6,nomenfant)=\"\",\"\",INDEX(synt,socle6,nomenfant))","v":{"$error":"#NAME?"}},{"$f":"IF(X57=P2,1,IF(X57=Q2,0.65,IF(X57=R2,0.35,\"\")))","v":{"$error":"#NAME?"}},{"$f":"IF(INDEX(synt,socle7,nomenfant)=\"\",\"\",INDEX(synt,socle7,nomenfant))","v":{"$error":"#NAME?"}},{"$f":"IF(Z57=P2,1,IF(Z57=Q2,0.65,IF(Z57=R2,0.35,\"\")))","v":{"$error":"#NAME?"}},{"$f":"IF(INDEX(synt,socle8,nomenfant)=\"\",\"\",INDEX(synt,socle8,nomenfant))","v":{"$error":"#NAME?"}},{"$f":"IF(AB57=P2,1,IF(AB57=Q2,0.65,IF(AB57=R2,0.35,\"\")))","v":{"$error":"#NAME?"}},{"$error":"#NAME?"},null,{"$f":"IF(OR(AD57>0.7,AG57>0),\"OUI\",\"\")","v":{"$error":"#NAME?"}},{"$f":"INDEX(validationsocle,AI57,nomenfant)","v":"00:00:00"},null,3]
[null,null,43,47,48,250,250,250,250,250,null,null,"Reconnaître, nommer et décrire les figures planes et les solides usuels",{"$error":"#NAME?"},{"$f":"IF(N58=P2,1,IF(N58=Q2,0.65,IF(N58=R2,0.35,\"\")))","v":{"$error":"#NAME?"}},{"$error":"#NAME?"},{"$f":"IF(P58=P2,1,IF(P58=Q2,0.65,IF(P58=R2,0.35,\"\")))","v":{"$error":"#NAME?"}},{"$error":"#NAME?"},{"$f":"IF(R58=P2,1,IF(R58=Q2,0.65,IF(R58=R2,0.35,\"\")))","v":{"$error":"#NAME?"}},{"$error":"#NAME?"},{"$f":"IF(T58=P2,1,IF(T58=Q2,0.65,IF(T58=R2,0.35,\"\")))","v":{"$error":"#NAME?"}},{"$error":"#NAME?"},{"$f":"IF(V58=P2,1,IF(V58=Q2,0.65,IF(V58=R2,0.35,\"\")))","v":{"$error":"#NAME?"}},{"$error":"#NAME?"},{"$f":"IF(X58=P2,1,IF(X58=Q2,0.65,IF(X58=R2,0.35,\"\")))","v":{"$error":"#NAME?"}},{"$error":"#NAME?"},{"$f":"IF(Z58=P2,1,IF(Z58=Q2,0.65,IF(Z58=R2,0.35,\"\")))","v":{"$error":"#NAME?"}},{"$error":"#NAME?"},{"$f":"IF(AB58=P2,1,IF(AB58=Q2,0.65,IF(AB58=R2,0.35,\"\")))","v":{"$error":"#NAME?"}},{"$f":"IF(SUM(N58:AC58)=0,0,SUM(N58:AC58)/COUNTIF(N58:AC58,\">0\"))","v":{"$error":"#NAME?"}},null,{"$f":"IF(OR(AD58>0.7,AG58>0),\"OUI\",\"\")","v":{"$error":"#NAME?"}},"00:00:00",null,3]
[null,null,44,250,250,250,250,250,250,250,null,null,"Utiliser la règle et l'équerre pour tracer avec soin et précision un carré, un rectangle, un triangle rectangle",{"$error":"#NAME?"},{"$f":"IF(N59=P4,1,IF(N59=Q4,0.65,IF(N59=R4,0.35,\"\")))","v":{"$error":"#NAME?"}},{"$error":"#NAME?"},{"$f":"IF(P59=P4,1,IF(P59=Q4,0.65,IF(P59=R4,0.35,\"\")))","v":{"$error":"#NAME?"}},{"$error":"#NAME?"},{"$f":"IF(R59=P4,1,IF(R59=Q4,0.65,IF(R59=R4,0.35,\"\")))","v":{"$error":"#NAME?"}},{"$error":"#NAME?"},{"$f":"IF(T59=P4,1,IF(T59=Q4,0.65,IF(T59=R4,0.35,\"\")))","v":{"$error":"#NAME?"}},{"$error":"#NAME?"},{"$f":"IF(V59=P4,1,IF(V59=Q4,0.65,IF(V59=R4,0.35,\"\")))","v":{"$error":"#NAME?"}},{"$error":"#NAME?"},{"$f":"IF(X59=P4,1,IF(X59=Q4,0.65,IF(X59=R4,0.35,\"\")))","v":{"$error":"#NAME?"}},{"$error":"#NAME?"},{"$f":"IF(Z59=P4,1,IF(Z59=Q4,0.65,IF(Z59=R4,0.35,\"\")))","v":{"$error":"#NAME?"}},{"$error":"#NAME?"},{"$f":"IF(AB59=P4,1,IF(AB59=Q4,0.65,IF(AB59=R4,0.35,\"\")))","v":{"$error":"#NAME?"}},{"$error":"#NAME?"},null,{"$error":"#NAME?"},"00:00:00",null,3]
[null,null,45,47,250,250,250,250,250,250,null,null,"Percevoir et reconnaître quelques relations et propriétés géométriques: alignement, angle droit, axe de symétrie, égalité de longueurs",{"$error":"#NAME?"},{"$f":"IF(N60=P5,1,IF(N60=Q5,0.65,IF(N60=R5,0.35,\"\")))","v":{"$error":"#NAME?"}},{"$error":"#NAME?"},{"$f":"IF(P60=P5,1,IF(P60=Q5,0.65,IF(P60=R5,0.35,\"\")))","v":{"$error":"#NAME?"}},{"$error":"#NAME?"},{"$f":"IF(R60=P5,1,IF(R60=Q5,0.65,IF(R60=R5,0.35,\"\")))","v":{"$error":"#NAME?"}},{"$error":"#NAME?"},{"$f":"IF(T60=P5,1,IF(T60=Q5,0.65,IF(T60=R5,0.35,\"\")))","v":{"$error":"#NAME?"}},{"$error":"#NAME?"},{"$f":"IF(V60=P5,1,IF(V60=Q5,0.65,IF(V60=R5,0.35,\"\")))","v":{"$error":"#NAME?"}},{"$error":"#NAME?"},{"$f":"IF(X60=P5,1,IF(X60=Q5,0.65,IF(X60=R5,0.35,\"\")))","v":{"$error":"#NAME?"}},{"$error":"#NAME?"},{"$f":"IF(Z60=P5,1,IF(Z60=Q5,0.65,IF(Z60=R5,0.35,\"\")))","v":{"$error":"#NAME?"}},{"$error":"#NAME?"},{"$f":"IF(AB60=P5,1,IF(AB60=Q5,0.65,IF(AB60=R5,0.35,\"\")))","v":{"$error":"#NAME?"}},{"$error":"#NAME?"},null,{"$error":"#NAME?"},"00:00:00",null,3]
[null,null,46,250,250,250,250,250,250,250,null,null,"Repérer des cases, des nœuds d’un quadrillage",{"$error":"#NAME?"},{"$f":"IF(N61=P6,1,IF(N61=Q6,0.65,IF(N61=R6,0.35,\"\")))","v":{"$error":"#NAME?"}},{"$error":"#NAME?"},{"$f":"IF(P61=P6,1,IF(P61=Q6,0.65,IF(P61=R6,0.35,\"\")))","v":{"$error":"#NAME?"}},{"$error":"#NAME?"},{"$f":"IF(R61=P6,1,IF(R61=Q6,0.65,IF(R61=R6,0.35,\"\")))","v":{"$error":"#NAME?"}},{"$error":"#NAME?"},{"$f":"IF(T61=P6,1,IF(T61=Q6,0.65,IF(T61=R6,0.35,\"\")))","v":{"$error":"#NAME?"}},{"$error":"#NAME?"},{"$f":"IF(V61=P6,1,IF(V61=Q6,0.65,IF(V61=R6,0.35,\"\")))","v":{"$error":"#NAME?"}},{"$error":"#NAME?"},{"$f":"IF(X61=P6,1,IF(X61=Q6,0.65,IF(X61=R6,0.35,\"\")))","v":{"$error":"#NAME?"}},{"$error":"#NAME?"},{"$f":"IF(Z61=P6,1,IF(Z61=Q6,0.65,IF(Z61=R6,0.35,\"\")))","v":{"$error":"#NAME?"}},{"$error":"#NAME?"},{"$f":"IF(AB61=P6,1,IF(AB61=Q6,0.65,IF(AB61=R6,0.35,\"\")))","v":{"$error":"#NAME?"}},{"$error":"#NAME?"},null,{"$error":"#NAME?"},"00:00:00",null,3]
[{"$nulls":12},"Résoudre un problème géométrique",{"$error":"#NAME?"},{"$f":"IF(N62=P2,1,IF(N62=Q2,0.65,IF(N62=R2,0.35,\"\")))","v":{"$error":"#NAME?"}},{"$error":"#NAME?"},{"$f":"IF(P62=P2,1,IF(P62=Q2,0.65,IF(P62=R2,0.35,\"\")))","v":{"$error":"#NAME?"}},{"$error":"#NAME?"},{"$f":"IF(R62=P2,1,IF(R62=Q2,0.65,IF(R62=R2,0.35,\"\")))","v":{"$error":"#NAME?"}},{"$error":"#NAME?"},{"$f":"IF(T62=P2,1,IF(T62=Q2,0.65,IF(T62=R2,0.35,\"\")))","v":{"$error":"#NAME?"}},{"$error":"#NAME?"},{"$f":"IF(V62=P2,1,IF(V62=Q2,0.65,IF(V62=R2,0.35,\"\")))","v":{"$error":"#NAME?"}},{"$error":"#NAME?"},{"$f":"IF(X62=P2,1,IF(X62=Q2,0.65,IF(X62=R2,0.35,\"\")))","v":{"$error":"#NAME?"}},{"$error":"#NAME?"},{"$f":"IF(Z62=P2,1,IF(Z62=Q2,0.65,IF(Z62=R2,0.35,\"\")))","v":{"$error":"#NAME?"}},{"$error":"#NAME?"},{"$f":"IF(AB62=P2,1,IF(AB62=Q2,0.65,IF(AB62=R2,0.35,\"\")))","v":{"$error":"#NAME?"}},{"$error":"#NAME?"},null,{"$f":"IF(OR(AD62>0.7,AG62>0),\"OUI\",\"\")","v":{"$error":"#NAME?"}},"00:00:00",null,3]
[{"$nulls":12},"GRANDEURS ET MESURES",{"$nulls":21},3]
[null,null,50,51,250,250,250,250,250,250,null,null,"Utiliser les unités usuelles de mesure ; estimer une mesure",{"$f":"IF(INDEX(synt,socle1,nomenfant)=\"\",\"\",INDEX(synt,socle1,nomenfant))","v":{"$error":"#NAME?"}},{"$f":"IF(N64=P2,1,IF(N64=Q2,0.65,IF(N64=R2,0.35,\"\")))","v":{"$error":"#NAME?"}},{"$f":"IF(INDEX(synt,socle2,nomenfant)=\"\",\"\",INDEX(synt,socle2,nomenfant))","v":{"$error":"#NAME?"}},{"$f":"IF(P64=P2,1,IF(P64=Q2,0.65,IF(P64=R2,0.35,\"\")))","v":{"$error":"#NAME?"}},{"$f":"IF(INDEX(synt,socle3,nomenfant)=\"\",\"\",INDEX(synt,socle3,nomenfant))","v":{"$error":"#NAME?"}},{"$f":"IF(R64=P2,1,IF(R64=Q2,0.65,IF(R64=R2,0.35,\"\")))","v":{"$error":"#NAME?"}},{"$f":"IF(INDEX(synt,socle4,nomenfant)=\"\",\"\",INDEX(synt,socle4,nomenfant))","v":{"$error":"#NAME?"}},{"$f":"IF(T64=P2,1,IF(T64=Q2,0.65,IF(T64=R2,0.35,\"\")))","v":{"$error":"#NAME?"}},{"$f":"IF(INDEX(synt,socle5,nomenfant)=\"\",\"\",INDEX(synt,socle5,nomenfant))","v":{"$error":"#NAME?"}},{"$f":"IF(V64=P2,1,IF(V64=Q2,0.65,IF(V64=R2,0.35,\"\")))","v":{"$error":"#NAME?"}},{"$f":"IF(INDEX(synt,socle6,nomenfant)=\"\",\"\",INDEX(synt,socle6,nomenfant))","v":{"$error":"#NAME?"}},{"$f":"IF(X64=P2,1,IF(X64=Q2,0.65,IF(X64=R2,0.35,\"\")))","v":{"$error":"#NAME?"}},{"$f":"IF(INDEX(synt,socle7,nomenfant)=\"\",\"\",INDEX(synt,socle7,nomenfant))","v":{"$error":"#NAME?"}},{"$f":"IF(Z64=P2,1,IF(Z64=Q2,0.65,IF(Z64=R2,0.35,\"\")))","v":{"$error":"#NAME?"}},{"$f":"IF(INDEX(synt,socle8,nomenfant)=\"\",\"\",INDEX(synt,socle8,nomenfant))","v":{"$error":"#NAME?"}},{"$f":"IF(AB64=P2,1,IF(AB64=Q2,0.65,IF(AB64=R2,0.35,\"\")))","v":{"$error":"#NAME?"}},{"$error":"#NAME?"},null,{"$f":"IF(OR(AD64>0.7,AG64>0),\"OUI\",\"\")","v":{"$error":"#NAME?"}},{"$f":"INDEX(validationsocle,AI64,nomenfant)","v":"00:00:00"},null,3]
[null,null,52,44,250,250,250,250,250,250,null,null,"Être précis et soigneux dans les tracés, les mesures et les calculs",{"$f":"IF(INDEX(synt,socle1,nomenfant)=\"\",\"\",INDEX(synt,socle1,nomenfant))","v":{"$error":"#NAME?"}},{"$f":"IF(N65=P2,1,IF(N65=Q2,0.65,IF(N65=R2,0.35,\"\")))","v":{"$error":"#NAME?"}},{"$f":"IF(INDEX(synt,socle2,nomenfant)=\"\",\"\",INDEX(synt,socle2,nomenfant))","v":{"$error":"#NAME?"}},{"$f":"IF(P65=P2,1,IF(P65=Q2,0.65,IF(P65=R2,0.35,\"\")))","v":{"$error":"#NAME?"}},{"$f":"IF(INDEX(synt,socle3,nomenfant)=\"\",\"\",INDEX(synt,socle3,nomenfant))","v":{"$error":"#NAME?"}},{"$f":"IF(R65=P2,1,IF(R65=Q2,0.65,IF(R65=R2,0.35,\"\")))","v":{"$error":"#NAME?"}},{"$f":"IF(INDEX(synt,socle4,nomenfant)=\"\",\"\",INDEX(synt,socle4,nomenfant))","v":{"$error":"#NAME?"}},{"$f":"IF(T65=P2,1,IF(T65=Q2,0.65,IF(T65=R2,0.35,\"\")))","v":{"$error":"#NAME?"}},{"$f":"IF(INDEX(synt,socle5,nomenfant)=\"\",\"\",INDEX(synt,socle5,nomenfant))","v":{"$error":"#NAME?"}},{"$f":"IF(V65=P2,1,IF(V65=Q2,0.65,IF(V65=R2,0.35,\"\")))","v":{"$error":"#NAME?"}},{"$f":"IF(INDEX(synt,socle6,nomenfant)=\"\",\"\",INDEX(synt,socle6,nomenfant))","v":{"$error":"#NAME?"}},{"$f":"IF(X65=P2,1,IF(X65=Q2,0.65,IF(X65=R2,0.35,\"\")))","v":{"$error":"#NAME?"}},{"$f":"IF(INDEX(synt,socle7,nomenfant)=\"\",\"\",INDEX(synt,socle7,nomenfant))","v":{"$error":"#NAME?"}},{"$f":"IF(Z65=P2,1,IF(Z65=Q2,0.65,IF(Z65=R2,0.35,\"\")))","v":{"$error":"#NAME?"}},{"$f":"IF(INDEX(synt,socle8,nomenfant)=\"\",\"\",INDEX(synt,socle8,nomenfant))","v":{"$error":"#NAME?"}},{"$f":"IF(AB65=P2,1,IF(AB65=Q2,0.65,IF(AB65=R2,0.35,\"\")))","v":{"$error":"#NAME?"}},{"$error":"#NAME?"},null,{"$f":"IF(OR(AD65>0.7,AG65>0),\"OUI\",\"\")","v":{"$error":"#NAME?"}},{"$f":"INDEX(validationsocle,AI65,nomenfant)","v":"00:00:00"},null,3]
[null,null,53,250,250,250,250,250,250,250,null,null,"Résoudre des problèmes de longueur et de masse",{"$f":"IF(INDEX(synt,socle1,nomenfant)=\"\",\"\",INDEX(synt,socle1,nomenfant))","v":{"$error":"#NAME?"}},{"$f":"IF(N66=P2,1,IF(N66=Q2,0.65,IF(N66=R2,0.35,\"\")))","v":{"$error":"#NAME?"}},{"$f":"IF(INDEX(synt,socle2,nomenfant)=\"\",\"\",INDEX(synt,socle2,nomenfant))","v":{"$error":"#NAME?"}},{"$f":"IF(P66=P2,1,IF(P66=Q2,0.65,IF(P66=R2,0.35,\"\")))","v":{"$error":"#NAME?"}},{"$f":"IF(INDEX(synt,socle3,nomenfant)=\"\",\"\",INDEX(synt,socle3,nomenfant))","v":{"$error":"#NAME?"}},{"$f":"IF(R66=P2,1,IF(R66=Q2,0.65,IF(R66=R2,0.35,\"\")))","v":{"$error":"#NAME?"}},{"$f":"IF(INDEX(synt,socle4,nomenfant)=\"\",\"\",INDEX(synt,socle4,nomenfant))","v":{"$error":"#NAME?"}},{"$f":"IF(T66=P2,1,IF(T66=Q2,0.65,IF(T66=R2,0.35,\"\")))","v":{"$error":"#NAME?"}},{"$f":"IF(INDEX(synt,socle5,nomenfant)=\"\",\"\",INDEX(synt,socle5,nomenfant))","v":{"$error":"#NAME?"}},{"$f":"IF(V66=P2,1,IF(V66=Q2,0.65,IF(V66=R2,0.35,\"\")))","v":{"$error":"#NAME?"}},{"$f":"IF(INDEX(synt,socle6,nomenfant)=\"\",\"\",INDEX(synt,socle6,nomenfant))","v":{"$error":"#NAME?"}},{"$f":"IF(X66=P2,1,IF(X66=Q2,0.65,IF(X66=R2,0.35,\"\")))","v":{"$error":"#NAME?"}},{"$f":"IF(INDEX(synt,socle7,nomenfant)=\"\",\"\",INDEX(synt,socle7,nomenfant))","v":{"$error":"#NAME?"}},{"$f":"IF(Z66=P2,1,IF(Z66=Q2,0.65,IF(Z66=R2,0.35,\"\")))","v":{"$error":"#NAME?"}},{"$f":"IF(INDEX(synt,socle8,nomenfant)=\"\",\"\",INDEX(synt,socle8,nomenfant))","v":{"$error":"#NAME?"}},{"$f":"IF(AB66=P2,1,IF(AB66=Q2,0.65,IF(AB66=R2,0.35,\"\")))","v":{"$error":"#NAME?"}},{"$error":"#NAME?"},null,{"$f":"IF(OR(AD66>0.7,AG66>0),\"OUI\",\"\")","v":{"$error":"#NAME?"}},{"$f":"INDEX(validationsocle,AI66,nomenfant)","v":"00:00:00"},null,3]
[{"$nulls":12},"ORGANISATION ET GESTION DE DONNÉES",{"$nulls":21},3]
[null,null,54,250,250,250,250,250,250,250,null,null,"Utiliser un tableau, un graphique",{"$f":"IF(INDEX(synt,socle1,nomenfant)=\"\",\"\",INDEX(synt,socle1,nomenfant))","v":{"$error":"#NAME?"}},{"$f":"IF(N68=P2,1,IF(N68=Q2,0.65,IF(N68=R2,0.35,\"\")))","v":{"$error":"#NAME?"}},{"$f":"IF(INDEX(synt,socle2,nomenfant)=\"\",\"\",INDEX(synt,socle2,nomenfant))","v":{"$error":"#NAME?"}},{"$f":"IF(P68=P2,1,IF(P68=Q2,0.65,IF(P68=R2,0.35,\"\")))","v":{"$error":"#NAME?"}},{"$f":"IF(INDEX(synt,socle3,nomenfant)=\"\",\"\",INDEX(synt,socle3,nomenfant))","v":{"$error":"#NAME?"}},{"$f":"IF(R68=P2,1,IF(R68=Q2,0.65,IF(R68=R2,0.35,\"\")))","v":{"$error":"#NAME?"}},{"$f":"IF(INDEX(synt,socle4,nomenfant)=\"\",\"\",INDEX(synt,socle4,nomenfant))","v":{"$error":"#NAME?"}},{"$f":"IF(T68=P2,1,IF(T68=Q2,0.65,IF(T68=R2,0.35,\"\")))","v":{"$error":"#NAME?"}},{"$f":"IF(INDEX(synt,socle5,nomenfant)=\"\",\"\",INDEX(synt,socle5,nomenfant))","v":{"$error":"#NAME?"}},{"$f":"IF(V68=P2,1,IF(V68=Q2,0.65,IF(V68=R2,0.35,\"\")))","v":{"$error":"#NAME?"}},{"$f":"IF(INDEX(synt,socle6,nomenfant)=\"\",\"\",INDEX(synt,socle6,nomenfant))","v":{"$error":"#NAME?"}},{"$f":"IF(X68=P2,1,IF(X68=Q2,0.65,IF(X68=R2,0.35,\"\")))","v":{"$error":"#NAME?"}},{"$f":"IF(INDEX(synt,socle7,nomenfant)=\"\",\"\",INDEX(synt,socle7,nomenfant))","v":{"$error":"#NAME?"}},{"$f":"IF(Z68=P2,1,IF(Z68=Q2,0.65,IF(Z68=R2,0.35,\"\")))","v":{"$error":"#NAME?"}},{"$f":"IF(INDEX(synt,socle8,nomenfant)=\"\",\"\",INDEX(synt,socle8,nomenfant))","v":{"$error":"#NAME?"}},{"$f":"IF(AB68=P2,1,IF(AB68=Q2,0.65,IF(AB68=R2,0.35,\"\")))","v":{"$error":"#NAME?"}},{"$error":"#NAME?"},null,{"$f":"IF(OR(AD68>0.7,AG68>0),\"OUI\",\"\")","v":{"$error":"#NAME?"}},{"$f":"INDEX(validationsocle,AI68,nomenfant)","v":"00:00:00"},null,3]
[null,null,55,250,250,250,250,250,250,250,null,null,"Organiser les données d’un énoncé",{"$f":"IF(INDEX(synt,socle1,nomenfant)=\"\",\"\",INDEX(synt,socle1,nomenfant))","v":{"$error":"#NAME?"}},{"$f":"IF(N69=P2,1,IF(N69=Q2,0.65,IF(N69=R2,0.35,\"\")))","v":{"$error":"#NAME?"}},{"$f":"IF(INDEX(synt,socle2,nomenfant)=\"\",\"\",INDEX(synt,socle2,nomenfant))","v":{"$error":"#NAME?"}},{"$f":"IF(P69=P2,1,IF(P69=Q2,0.65,IF(P69=R2,0.35,\"\")))","v":{"$error":"#NAME?"}},{"$f":"IF(INDEX(synt,socle3,nomenfant)=\"\",\"\",INDEX(synt,socle3,nomenfant))","v":{"$error":"#NAME?"}},{"$f":"IF(R69=P2,1,IF(R69=Q2,0.65,IF(R69=R2,0.35,\"\")))","v":{"$error":"#NAME?"}},{"$f":"IF(INDEX(synt,socle4,nomenfant)=\"\",\"\",INDEX(synt,socle4,nomenfant))","v":{"$error":"#NAME?"}},{"$f":"IF(T69=P2,1,IF(T69=Q2,0.65,IF(T69=R2,0.35,\"\")))","v":{"$error":"#NAME?"}},{"$f":"IF(INDEX(synt,socle5,nomenfant)=\"\",\"\",INDEX(synt,socle5,nomenfant))","v":{"$error":"#NAME?"}},{"$f":"IF(V69=P2,1,IF(V69=Q2,0.65,IF(V69=R2,0.35,\"\")))","v":{"$error":"#NAME?"}},{"$f":"IF(INDEX(synt,socle6,nomenfant)=\"\",\"\",INDEX(synt,socle6,nomenfant))","v":{"$error":"#NAME?"}},{"$f":"IF(X69=P2,1,IF(X69=Q2,0.65,IF(X69=R2,0.35,\"\")))","v":{"$error":"#NAME?"}},{"$f":"IF(INDEX(synt,socle7,nomenfant)=\"\",\"\",INDEX(synt,socle7,nomenfant))","v":{"$error":"#NAME?"}},{"$f":"IF(Z69=P2,1,IF(Z69=Q2,0.65,IF(Z69=R2,0.35,\"\")))","v":{"$error":"#NAME?"}},{"$f":"IF(INDEX(synt,socle8,nomenfant)=\"\",\"\",INDEX(synt,socle8,nomenfant))","v":{"$error":"#NAME?"}},{"$f":"IF(AB69=P2,1,IF(AB69=Q2,0.65,IF(AB69=R2,0.35,\"\")))","v":{"$error":"#NAME?"}},{"$error":"#NAME?"},null,{"$f":"IF(OR(AD69>0.7,AG69>0),\"OUI\",\"\")","v":{"$error":"#NAME?"}},{"$f":"INDEX(validationsocle,AI69,nomenfant)","v":"00:00:00"},null,3]
[{"$nulls":34},3]
[{"$nulls":12},"Les compétences sociales et civiques",{"$nulls":21},3]
[{"$nulls":12},"CONNAÎTRE LES PRINCIPES ET FONDEMENTS DE LA VIE CIVIQUE ET SOCIALE",{"$nulls":21},3]
[null,null,57,250,250,250,250,250,250,250,null,null,"Reconnaître les emblèmes et les symboles de la république française",{"$f":"IF(INDEX(synt,socle1,nomenfant)=\"\",\"\",INDEX(synt,socle1,nomenfant))","v":{"$error":"#NAME?"}},{"$f":"IF(N73=P2,1,IF(N73=Q2,0.65,IF(N73=R2,0.35,\"\")))","v":{"$error":"#NAME?"}},{"$f":"IF(INDEX(synt,socle2,nomenfant)=\"\",\"\",INDEX(synt,socle2,nomenfant))","v":{"$error":"#NAME?"}},{"$f":"IF(P73=P2,1,IF(P73=Q2,0.65,IF(P73=R2,0.35,\"\")))","v":{"$error":"#NAME?"}},{"$f":"IF(INDEX(synt,socle3,nomenfant)=\"\",\"\",INDEX(synt,socle3,nomenfant))","v":{"$error":"#NAME?"}},{"$f":"IF(R73=P2,1,IF(R73=Q2,0.65,IF(R73=R2,0.35,\"\")))","v":{"$error":"#NAME?"}},{"$f":"IF(INDEX(synt,socle4,nomenfant)=\"\",\"\",INDEX(synt,socle4,nomenfant))","v":{"$error":"#NAME?"}},{"$f":"IF(T73=P2,1,IF(T73=Q2,0.65,IF(T73=R2,0.35,\"\")))","v":{"$error":"#NAME?"}},{"$f":"IF(INDEX(synt,socle5,nomenfant)=\"\",\"\",INDEX(synt,socle5,nomenfant))","v":{"$error":"#NAME?"}},{"$f":"IF(V73=P2,1,IF(V73=Q2,0.65,IF(V73=R2,0.35,\"\")))","v":{"$error":"#NAME?"}},{"$f":"IF(INDEX(synt,socle6,nomenfant)=\"\",\"\",INDEX(synt,socle6,nomenfant))","v":{"$error":"#NAME?"}},{"$f":"IF(X73=P2,1,IF(X73=Q2,0.65,IF(X73=R2,0.35,\"\")))","v":{"$error":"#NAME?"}},{"$f":"IF(INDEX(synt,socle7,nomenfant)=\"\",\"\",INDEX(synt,socle7,nomenfant))","v":{"$error":"#NAME?"}},{"$f":"IF(Z73=P2,1,IF(Z73=Q2,0.65,IF(Z73=R2,0.35,\"\")))","v":{"$error":"#NAME?"}},{"$f":"IF(INDEX(synt,socle8,nomenfant)=\"\",\"\",INDEX(synt,socle8,nomenfant))","v":{"$error":"#NAME?"}},{"$f":"IF(AB73=P2,1,IF(AB73=Q2,0.65,IF(AB73=R2,0.35,\"\")))","v":{"$error":"#NAME?"}},{"$f":"IF(SUM(N73:AC73)=0,0,SUM(N73:AC73)/COUNTIF(N73:AC73,\">0\"))","v":{"$error":"#NAME?"}},null,{"$f":"IF(OR(AD73>0.7,AG73>0),\"OUI\",\"\")","v":{"$error":"#NAME?"}},{"$f":"INDEX(validationsocle,AI73,nomenfant)","v":"00:00:00"},null,3]
[{"$nulls":12},"AVOIR UN COMPORTEMENT RESPONSABLE",{"$nulls":21},3]
[null,null,58,59,250,250,250,250,250,250,null,null,"Respecter les autres et les règles de la vie collective",{"$f":"IF(INDEX(synt,socle1,nomenfant)=\"\",\"\",INDEX(synt,socle1,nomenfant))","v":{"$error":"#NAME?"}},{"$f":"IF(N75=P2,1,IF(N75=Q2,0.65,IF(N75=R2,0.35,\"\")))","v":{"$error":"#NAME?"}},{"$f":"IF(INDEX(synt,socle2,nomenfant)=\"\",\"\",INDEX(synt,socle2,nomenfant))","v":{"$error":"#NAME?"}},{"$f":"IF(P75=P2,1,IF(P75=Q2,0.65,IF(P75=R2,0.35,\"\")))","v":{"$error":"#NAME?"}},{"$f":"IF(INDEX(synt,socle3,nomenfant)=\"\",\"\",INDEX(synt,socle3,nomenfant))","v":{"$error":"#NAME?"}},{"$f":"IF(R75=P2,1,IF(R75=Q2,0.65,IF(R75=R2,0.35,\"\")))","v":{"$error":"#NAME?"}},{"$f":"IF(INDEX(synt,socle4,nomenfant)=\"\",\"\",INDEX(synt,socle4,nomenfant))","v":{"$error":"#NAME?"}},{"$f":"IF(T75=P2,1,IF(T75=Q2,0.65,IF(T75=R2,0.35,\"\")))","v":{"$error":"#NAME?"}},{"$f":"IF(INDEX(synt,socle5,nomenfant)=\"\",\"\",INDEX(synt,socle5,nomenfant))","v":{"$error":"#NAME?"}},{"$f":"IF(V75=P2,1,IF(V75=Q2,0.65,IF(V75=R2,0.35,\"\")))","v":{"$error":"#NAME?"}},{"$f":"IF(INDEX(synt,socle6,nomenfant)=\"\",\"\",INDEX(synt,socle6,nomenfant))","v":{"$error":"#NAME?"}},{"$f":"IF(X75=P2,1,IF(X75=Q2,0.65,IF(X75=R2,0.35,\"\")))","v":{"$error":"#NAME?"}},{"$f":"IF(INDEX(synt,socle7,nomenfant)=\"\",\"\",INDEX(synt,socle7,nomenfant))","v":{"$error":"#NAME?"}},{"$f":"IF(Z75=P2,1,IF(Z75=Q2,0.65,IF(Z75=R2,0.35,\"\")))","v":{"$error":"#NAME?"}},{"$f":"IF(INDEX(synt,socle8,nomenfant)=\"\",\"\",INDEX(synt,socle8,nomenfant))","v":{"$error":"#NAME?"}},{"$f":"IF(AB75=P2,1,IF(AB75=Q2,0.65,IF(AB75=R2,0.35,\"\")))","v":{"$error":"#NAME?"}},{"$error":"#NAME?"},null,{"$f":"IF(OR(AD75>0.7,AG75>0),\"OUI\",\"\")","v":{"$error":"#NAME?"}},{"$f":"INDEX(validationsocle,AI75,nomenfant)","v":"00:00:00"},null,3]
[null,null,56,250,250,250,250,250,250,250,null,null,"Pratiquer un jeu ou un sport collectif en en respectant les règles",{"$nulls":21},3]
[null,null,59,250,250,250,250,250,250,250,null,null,"Appliquer les codes de la politesse dans ses relations avec ses camarades, avec les adultes à l'école et hors de l'école, avec le maître au sein de la classe",{"$f":"IF(INDEX(synt,socle1,nomenfant)=\"\",\"\",INDEX(synt,socle1,nomenfant))","v":{"$error":"#NAME?"}},{"$f":"IF(N77=P2,1,IF(N77=Q2,0.65,IF(N77=R2,0.35,\"\")))","v":{"$error":"#NAME?"}},{"$f":"IF(INDEX(synt,socle2,nomenfant)=\"\",\"\",INDEX(synt,socle2,nomenfant))","v":{"$error":"#NAME?"}},{"$f":"IF(P77=P2,1,IF(P77=Q2,0.65,IF(P77=R2,0.35,\"\")))","v":{"$error":"#NAME?"}},{"$f":"IF(INDEX(synt,socle3,nomenfant)=\"\",\"\",INDEX(synt,socle3,nomenfant))","v":{"$error":"#NAME?"}},{"$f":"IF(R77=P2,1,IF(R77=Q2,0.65,IF(R77=R2,0.35,\"\")))","v":{"$error":"#NAME?"}},{"$f":"IF(INDEX(synt,socle4,nomenfant)=\"\",\"\",INDEX(synt,socle4,nomenfant))","v":{"$error":"#NAME?"}},{"$f":"IF(T77=P2,1,IF(T77=Q2,0.65,IF(T77=R2,0.35,\"\")))","v":{"$error":"#NAME?"}},{"$f":"IF(INDEX(synt,socle5,nomenfant)=\"\",\"\",INDEX(synt,socle5,nomenfant))","v":{"$error":"#NAME?"}},{"$f":"IF(V77=P2,1,IF(V77=Q2,0.65,IF(V77=R2,0.35,\"\")))","v":{"$error":"#NAME?"}},{"$f":"IF(INDEX(synt,socle6,nomenfant)=\"\",\"\",INDEX(synt,socle6,nomenfant))","v":{"$error":"#NAME?"}},{"$f":"IF(X77=P2,1,IF(X77=Q2,0.65,IF(X77=R2,0.35,\"\")))","v":{"$error":"#NAME?"}},{"$f":"IF(INDEX(synt,socle7,nomenfant)=\"\",\"\",INDEX(synt,socle7,nomenfant))","v":{"$error":"#NAME?"}},{"$f":"IF(Z77=P2,1,IF(Z77=Q2,0.65,IF(Z77=R2,0.35,\"\")))","v":{"$error":"#NAME?"}},{"$f":"IF(INDEX(synt,socle8,nomenfant)=\"\",\"\",INDEX(synt,socle8,nomenfant))","v":{"$error":"#NAME?"}},{"$f":"IF(AB77=P2,1,IF(AB77=Q2,0.65,IF(AB77=R2,0.35,\"\")))","v":{"$error":"#NAME?"}},{"$error":"#NAME?"},null,{"$f":"IF(OR(AD77>0.7,AG77>0),\"OUI\",\"\")","v":{"$error":"#NAME?"}},{"$f":"INDEX(validationsocle,AI77,nomenfant)","v":"00:00:00"},null,3]
[{"$nulls":34},3]