{"text_format":"3","workbook":"xlsx","n_sheets":11,"sheets":["Accueil","Notice","Renseignements","Programmation","Période","Formules","Appréciations","Synt","Socle","Bulletin","Parcours"],"not_rendered":{"images":1,"macros":1,"defined_names":101},"read":"whole","date_system":"1900"}

{"sheet":"Accueil","index":0,"n_rows":22,"n_cols":2,"rows_kept":22,"merged":[[2,1,2,11],[3,1,3,11],[4,1,4,11],[5,1,5,11],[7,1,7,11],[9,1,9,11],[11,1,11,11],[13,1,13,11],[21,1,21,11]]}
[]
[]
[null,"PROGRAMMATION, EVALUATION DES COMPETENCES DU"]
[null,"CYCLE 2"]
[null,"Nécessite d'accepter les macros *"]
[null,"NOTICE D'UTLISATION"]
[]
[null,"  -1                             Saisir les renseignements"]
[]
[null,"   -2                            Etablir la programmation des compétences par période"]
[]
[null,"  - 3                            Saisie des appréciations par période"]
[]
[null,"   -4                            Edition du socle commun"]
[]
[null,"* Vous pouvez avoir besoin de modifier votre niveau de sécurité s'il est trop élevé, cochez faible (ce logiciel est sans danger)"]
[]
[]
[]
[]
[]
[null,"Le livret cycle 2 version 4 by Eric Di Donfrancesco sont mis à disposition selon les termes de la licence Creative Commons Paternité - Pas d'Utilisation Commerciale - Partage des Conditions Initiales à l'Identique 3.0 Unported."]

{"sheet":"Notice","index":1,"n_rows":37,"n_cols":2,"rows_kept":37}
[null,"NOTICE"]
[]
[null,"Principes de bases  :  \nCette version du livret reprend les compétences 2016 en les liant au socle sur le modèle du livret EN."]
[]
[null,"Les versions :  \nCette version fonctionne sous PC avec  excel 2010 et plus. Si vous utilisez une version plus ancienne téléchargez la version XLS (excel 97 2000) du livret. Les conversions sont sources d'erreurs.  Les versions trop anciennes d'excel (95) risquent de mal fonctionner.  Il est recommandé d'éviter de passer d'une version à l'autre, ou de mac à PC avec le même livret."]
[null,"Si vous utilisez mac excel "]
[null,"Renseignements :     onglet renseignement"]
[null,"Renseigner dans les cadres blancs les données de l’école et de la classe, puis ceux des élèves (nom et prénom).\nVous pouvez modifier le type de notes ou créer les vôtres en cochant l'option. "]
[null,"Puis aller à la page programmation pour établir votre programmation des compétences abordées par période."]
[]
[null,"Les compétences: onglet programmation"]
[null,"Dans l'onglet \"programmation\" vous avez les compétences du BO. Vous pouvez les modifier:\n- En les réécrivant dans la cellule mais attention n'en changez pas le sens, car chaque compétence est en lien avec le socle.\n\"valider les modifications\" sinon elles ne seront pas prises en compte dans la génération des périodes."]
[]
[null,"Programmation :  onglet programmation"]
[null,"Cocher par une croix (x) les compétences que vous allez aborder dans chaque période. Colonnes P1 P2 …"]
[]
[null,"Évaluation des compétences de chaque élève par période :"]
[null,"Une fois les compétences à évaluer programmées dans les périodes, vous allez créer la grille d'évaluation de la période qui vous intéresse en cliquant sur les boutons P1, P2.. en haut des colonnes concernées. \nVous pouvez évaluer chacun de vos élèves dans un tableau collectif (4 degrés d’évaluation et NE – Non Évalué- ) Le A renvoie à une maîtrise dépassée, le B suffisante, le C fragile et le D non acquise.\nSi vous modifiez de nouveau la programmation, elle sera prise en compte dans vos feuilles périodes. Par contre une fois une période créée vous ne pouvez plus ajouter ou enlever des compétences sur cette dernière."]
[]
[null,"La feuille d'évaluation:  (onglets P1, P2, P3, P4, P5) "]
[null,"Elles se nomment P1, P2, P3, P4 ou P5 Quand vous l'ouvrez, cliquez sur le bouton \"mise à jour de la feuille\" pour filtrer les colonnes vides et actualiser les compétences programmées. Vous pouvez ensuite mettre les notes . \nPour supprimer une feuille période il faut passer par les macros: en cliquant sur le bouton Effacer. La boite de dialogue apparaitra et vous choisirez la période à supprimer. "]
[]
[null,"Saisie des appréciations par période :"]
[null,"Pour chaque enfant, vous noterez dans un tableau collectif l’appréciation littérale concernant la période. Vous pouvez aussi noter les jours d’absences. La cellule s'adaptera à la longueur de votre texte."]
[]
[null,"Bulletin : onglets B1, B2, B3, B4, B5,  Bilan  "]
[null,"Une fois les évaluations terminées vous devez générer le bulletin correspondant ( B1 pour P1)  utiliser le bouton Bulletin présent dans les feuilles périodes.  Pour chaque compétence vous pouvez la préciser sur ce bulletin, écrire quelle partie de cette compétence a été évaluée. Après avoir choisi l’enfant dans la liste déroulante et la période, vous pourrez cliquer sur le bouton imprimer, ou imprimez en passant par le menu. Vous pouvez aussi générer des bulletins PDF. Si vous cliquez sur \"imprimer tout\" toutes les feuilles sortiront mais pas en recto verso.\nLe bilan annuel : si vous générez cette feuille, toutes les compétences évaluées sur le nombre de période que vous aurez choisi se reporteront sur cette feuille. si une compétence a été évaluée plusieurs fois; c'est la dernière note qui l'emporte (vous pouvez toujours modifier manuellement cela). "]
[]
[null,"Édition du socle commun : onglet socle"]
[null,"En fin du cycle, il est possible d’éditer le livret du socle commun pour chaque élève."]
[null,"Toutes les compétences sont liées au  socle c'est pourquoi vous ne pouvez pas en rajouter."]
[null,"Pour valider les compétences du socle, un bouton est prévu mettra à jour à chaque fois que vous l’utiliserez."]
[]
[null,"Pour l’enseignant des tableaux statistiques peuvent être utiles :"]
[null,"Sur chaque période vous pouvez voir les pourcentages d'acquisition pour chaque compétences."]
[null,"bilan élèves: C'est un bulletin qui reprend les compétences sur toute l'année, il se réfère à la feuille \"Année\" le même sous forme synoptique regroupant l’ensemble des élèves de la classe."]
[null,"Sur la feuille \"Année\" vous avez, comme sur les autres périodes, un bilan des compétences qui montre, pour la classe, les compétences réussies, à renforcer, en cours d’acquisition ou non acquises par période ou sur l'année."]

{"sheet":"Renseignements","index":2,"n_rows":49,"n_cols":16,"rows_kept":49,"merged":[[1,2,1,6],[2,2,2,3],[2,4,2,6],[3,2,3,3],[3,4,3,6],[4,2,4,3],[4,4,4,6],[5,2,5,3],[5,4,5,6],[6,2,6,3],[6,4,6,6],[7,2,7,3],[7,4,7,6],[8,2,8,3],[8,4,8,6],[9,2,9,3],[9,4,9,6],[10,2,10,3],[10,4,10,6],[13,2,13,4],[18,7,18,11]]}
[]
[null,null,"RENSEIGNEMENTS"]
[null,null,"Académie",null,"Toscana"]
[null,null,"Circonscription ",null,"Firenza "]
[null,null,"Ville",null,"Sienna"]
[null,null,"Ecole",null,"Léonard de Vinci"]
[null,null,"Adresse"]
[null,null,"Cycle",null,2]
[null,null,"Classe",null,"CE1"]
[null,null,"Enseignant",null,"M. DURANT"]
[null,null,"Année",null,"2016   2017"]
[]
[]
[null,null,"LISTE"]
[null,null,"Prénom","Nom","Né le"]
[null,1,"Marc","Aurèle","1999-11-12",{"$nulls":10},{"$f":"CONCATENATE(C16,\"  \",D16)","v":"Marc  Aurèle"}]
[null,2,"Jérôme","Lenoir","1998-07-04",{"$nulls":10},{"$f":"CONCATENATE(C17,\"  \",D17)","v":"Jérôme  Lenoir"}]
[null,3,"Fabien","Léglise","1999-10-05",{"$nulls":10},"Fabien  Léglise"]
[null,4,"Aicha","Samarahoui","1999-12-03",{"$nulls":10},"Aicha  Samarahoui"]
[null,5,"Karim","Maha","2000-03-30",{"$nulls":10},"Karim  Maha"]
[null,6,{"$nulls":13},"  "]
[null,7,{"$nulls":13},"  "]
[null,8,{"$nulls":13},"  "]
[null,9,{"$nulls":13},"  "]
[null,10,{"$nulls":13},"  "]
[null,11,{"$nulls":13},"  "]
[null,12,{"$nulls":13},"  "]
[null,13,{"$nulls":13},"  "]
[null,14,{"$nulls":13},"  "]
[null,15,{"$nulls":13},"  "]
[null,16,{"$nulls":13},"  "]
[null,17,{"$nulls":13},"  "]
[null,18,{"$nulls":13},"  "]
[null,19,{"$nulls":13},"  "]
[null,20,{"$nulls":13},"  "]
[null,21,{"$nulls":13},"  "]
[null,22,{"$nulls":13},"  "]
[null,23,{"$nulls":13},"  "]
[null,24,{"$nulls":13},"  "]
[null,25,{"$nulls":13},"  "]
[null,26,{"$nulls":13},"  "]
[null,27,{"$nulls":13},"  "]
[null,28,{"$nulls":13},"  "]
[null,29,{"$nulls":13},"  "]
[null,30,{"$nulls":13},"  "]
[null,31,{"$nulls":13},"  "]
[null,32,{"$nulls":13},"  "]
[null,33,{"$nulls":13},"  "]
[null,null,{"$f":"COUNTIF(C16:C48,\"*\")","v":5}]

{"sheet":"Programmation","index":3,"n_rows":824,"n_cols":22,"rows_kept":824,"merged":[[0,0,1,1],[0,2,3,2],[0,4,2,12],[0,14,2,14],[4,1,27,1],[28,1,54,1],[55,1,75,1],[76,1,83,1],[84,1,101,1],[102,1,113,1],[114,1,130,1],[131,1,137,1]]}
[null,null,"Vous pouvez reformuler les compétences. Cliquez sur le bouton pour les valider. \nDans la logique des programmes 2016 chaque compétence est liée avec le socle, donc n'en modifiez pas le sens ",null,"1)  Choisir les compétences à  travailler par période en mettant une croix (x) dans les cases P1, P2…\n\n2) Cliquer sur un bouton pour générer la grille d'évaluation de la période voulue.",{"$nulls":9},"Fusionne toutes les notes de l'année"]
[]
[]
[{"$nulls":3},138,"P1",null,"P2",null,"P3",null,"P4",null,"P5"]
[5,"FRANCAIS","LANGAGE ORAL",null,{"$f":"IF(COUNTIF(E6:E9,\"x\")>0,\"x\",0)","v":"x"},null,{"$f":"IF(COUNTIF(G6:G9,\"x\")>0,\"x\",0)","v":"x"},null,{"$f":"IF(COUNTIF(I6:I9,\"x\")>0,\"x\",0)","v":0},null,{"$f":"IF(COUNTIF(K6:K9,\"x\")>0,\"x\",0)","v":0},null,{"$f":"IF(COUNTIF(M6:M9,\"x\")>0,\"x\",0)","v":0},null,{"$f":"IF(COUNTIF(E5:M5,\"X\"),\"X\",\"\")","v":"X"},null,{"$f":"E5","v":"x"},{"$f":"G5","v":"x"},{"$f":"I5","v":0},{"$f":"K5","v":0},{"$f":"M5","v":0},{"$f":"O5","v":"X"}]
[5,null,"Écouter pour comprendre des messages oraux ou des textes lus par un adulte.",null,"X",null,"X",{"$nulls":7},{"$f":"IF(COUNTIF(E6:M6,\"X\"),\"X\",\"\")","v":"X"},null,{"$f":"E6","v":"X"},{"$f":"G6","v":"X"},{"$f":"I6","v":0},{"$f":"K6","v":0},{"$f":"M6","v":0},{"$f":"O6","v":"X"}]
[6,null,"Dire pour être entendu et compris.",null,"x",null,"x",{"$nulls":7},"X",null,"x","x",0,0,0,"X"]
[7,null,"Participer à des échanges dans des situations diversifiées.",{"$nulls":3},"x",{"$nulls":7},"X",null,0,"x",0,0,0,"X"]
[8,null,"Adopter une distance critique par rapport au langage produit.",null,"x",null,"x",{"$nulls":7},"X",null,"x","x",0,0,0,"X"]
[9,null,"LECTURE ET COMPREHENSION DE l'ECRIT",null,{"$f":"IF(COUNTIF(E11:E15,\"x\")>0,\"x\",0)","v":"x"},null,{"$f":"IF(COUNTIF(G11:G15,\"x\")>0,\"x\",0)","v":"x"},null,{"$f":"IF(COUNTIF(I11:I15,\"x\")>0,\"x\",0)","v":0},null,{"$f":"IF(COUNTIF(K11:K15,\"x\")>0,\"x\",0)","v":0},null,{"$f":"IF(COUNTIF(M11:M15,\"x\")>0,\"x\",0)","v":0},null,"X",null,"x","x",0,0,0,"X"]
[10,null,"Identifier des mots de manière de plus en plus aisée. ",null,"x",null,"x",{"$nulls":7},"X",null,"x","x",0,0,0,"X"]
[11,null,"Comprendre un texte.",null,"x",null,"x",{"$nulls":7},"X",null,"x","x",0,0,0,"X"]
[12,null,"Pratiquer différentes formes de lecture.",null,"x",{"$nulls":9},"X",null,"x",0,0,0,0,"X"]
[13,null,"Lire à voix haute.",null,"x",{"$nulls":9},"X",null,"x",0,0,0,0,"X"]
[14,null,"Contrôler sa compréhension.",null,"x",{"$nulls":9},"X",null,"x",0,0,0,0,"X"]
[15,null,"ECRITURE",null,{"$f":"IF(COUNTIF(E17:E19,\"x\")>0,\"x\",0)","v":"x"},null,{"$f":"IF(COUNTIF(G17:G19,\"x\")>0,\"x\",0)","v":0},null,{"$f":"IF(COUNTIF(I17:I19,\"x\")>0,\"x\",0)","v":0},null,{"$f":"IF(COUNTIF(K17:K19,\"x\")>0,\"x\",0)","v":0},null,{"$f":"IF(COUNTIF(M17:M19,\"x\")>0,\"x\",0)","v":0},null,"X",null,"x",0,0,0,0,"X"]
[16,null,"Copier de manière experte.",null,"x",{"$nulls":9},"X",null,"x",0,0,0,0,"X"]
[17,null,"Rédiger un texte d'une demi page.",null,"x",{"$nulls":9},"X",null,"x",0,0,0,0,"X"]
[18,null,"Réviser et améliorer l’écrit qu’on a produit. ",null,"x",{"$nulls":9},"X",null,"x",0,0,0,0,"X"]
[19,null,"ETUDE DE LA LANGUE",null,{"$f":"IF(COUNTIF(E21:E28,\"x\")>0,\"x\",0)","v":0},null,{"$f":"IF(COUNTIF(G21:G28,\"x\")>0,\"x\",0)","v":0},null,{"$f":"IF(COUNTIF(I21:I28,\"x\")>0,\"x\",0)","v":0},null,{"$f":"IF(COUNTIF(K21:K28,\"x\")>0,\"x\",0)","v":0},null,{"$f":"IF(COUNTIF(M21:M28,\"x\")>0,\"x\",0)","v":0},null,"",null,0,0,0,0,0,""]
[20,null,"Maitriser les relations entre l’oral et l’écrit.",{"$nulls":11},"",null,0,0,0,0,0,""]
[21,null,"Mémoriser et se remémorer l’orthographe de mots fréquents et de mots irréguliers dont le sens est connu.",{"$nulls":11},"",null,0,0,0,0,0,""]
[22,null,"Identifier les principaux constituants d’une phrase simple en relation avec sa cohérence sémantique.",{"$nulls":11},"",null,0,0,0,0,0,""]
[23,null,"Orthographier les formes verbales les plus fréquentes.",{"$nulls":11},"",null,0,0,0,0,0,""]
[24,null,"Raisonner pour résoudre des problèmes orthographiques.",{"$nulls":11},"",null,0,0,0,0,0,""]
[25,null,"Comprendre comment se forment les verbes et orthographier les formes verbales les plus fréquentes ",{"$nulls":11},"",null,0,0,0,0,0,""]
[26,null,"Identifier des relations entre les mots, entre les mots et leur contexte d’utilisation ; s’en servir pour mieux comprendre.",{"$nulls":11},"",null,0,0,0,0,0,""]
[27,null,"Étendre ses connaissances lexicales, mémoriser et réutiliser des mots nouvellement appris.",{"$nulls":11},"",null,0,0,0,0,0,""]
[28,"MATHEMATIQUES","NOMBRES ET CALCUL",null,{"$f":"IF(COUNTIF(E30:E41,\"x\")>0,\"x\",0)","v":0},null,{"$f":"IF(COUNTIF(G30:G41,\"x\")>0,\"x\",0)","v":0},null,{"$f":"IF(COUNTIF(I30:I41,\"x\")>0,\"x\",0)","v":0},null,{"$f":"IF(COUNTIF(K30:K41,\"x\")>0,\"x\",0)","v":0},null,{"$f":"IF(COUNTIF(M30:M41,\"x\")>0,\"x\",0)","v":0},null,"",null,0,0,0,0,0,""]
[29,null,"Comprendre et utiliser des nombres entiers pour dénombrer, ordonner, repérer, comparer.",{"$nulls":11},"",null,0,0,0,0,0,""]
[30,null,"Nommer, lire, écrire, représenter des nombres entiers.",{"$nulls":11},"",null,0,0,0,0,0,""]
[31,null,"Calculer avec des nombres entiers, mentalement ou à la main, de manière exacte ou approchée.",{"$nulls":11},"",null,0,0,0,0,0,""]
[32,null,"Contrôler la vraisemblance de ses résultats.",{"$nulls":11},"",null,0,0,0,0,0,""]
[33,null,"GRANDEURS ET MESURES",null,{"$f":"IF(COUNTIF(E35:E37,\"x\")>0,\"x\",0)","v":0},null,{"$f":"IF(COUNTIF(G35:G37,\"x\")>0,\"x\",0)","v":0},null,{"$f":"IF(COUNTIF(I35:I37,\"x\")>0,\"x\",0)","v":0},null,{"$f":"IF(COUNTIF(K35:K37,\"x\")>0,\"x\",0)","v":0},null,{"$f":"IF(COUNTIF(M35:M37,\"x\")>0,\"x\",0)","v":0},null,"",null,0,0,0,0,0,""]
[34,null,"Comparer, estimer, mesurer des longueurs, des masses, des contenances, des durées.",{"$nulls":11},"",null,0,0,0,0,0,""]
[35,null,"Utiliser le lexique, les unités, les instruments de mesures spécifiques de ces grandeurs.",{"$nulls":11},"",null,0,0,0,0,0,""]
[36,null,"Résoudre des problèmes impliquant des longueurs, des masses, des contenances, des durées, des prix.",{"$nulls":11},"",null,0,0,0,0,0,""]
[37,null,"ESPACE ET GEOMETRIE",null,{"$f":"IF(COUNTIF(E39:E41,\"x\")>0,\"x\",0)","v":0},null,{"$f":"IF(COUNTIF(G39:G41,\"x\")>0,\"x\",0)","v":0},null,{"$f":"IF(COUNTIF(I39:I41,\"x\")>0,\"x\",0)","v":0},null,{"$f":"IF(COUNTIF(K39:K41,\"x\")>0,\"x\",0)","v":0},null,{"$f":"IF(COUNTIF(M39:M41,\"x\")>0,\"x\",0)","v":0},null,"",null,0,0,0,0,0,""]
[38,null,"Appréhender différents systèmes de représentations (dessins, schémas, arbres de calcul, etc.).",{"$nulls":11},"",null,0,0,0,0,0,""]
[39,null,"Utiliser des nombres pour représenter des quantités ou des grandeurs. ",{"$nulls":11},"",null,0,0,0,0,0,""]
[40,null,"Utiliser diverses représentations de solides et de situations spatiales.",{"$nulls":11},"",null,0,0,0,0,0,""]
[41,null,"CHERCHER",null,{"$f":"IF(COUNTIF(E43:E44,\"x\")>0,\"x\",0)","v":0},null,{"$f":"IF(COUNTIF(G43:G44,\"x\")>0,\"x\",0)","v":0},null,{"$f":"IF(COUNTIF(I43:I44,\"x\")>0,\"x\",0)","v":0},null,{"$f":"IF(COUNTIF(K43:K44,\"x\")>0,\"x\",0)","v":0},null,{"$f":"IF(COUNTIF(M43:M44,\"x\")>0,\"x\",0)","v":0},null,"",null,0,0,0,0,0,""]
[42,null,"S’engager dans une démarche de résolution de problèmes.",{"$nulls":11},"",null,0,0,0,0,0,""]
[43,null,"Tester, essayer plusieurs pistes proposées par soi-même, les autres élèves ou le professeur.",{"$nulls":11},"",null,0,0,0,0,0,""]
[44,null,"MODELISER",null,{"$f":"IF(COUNTIF(E46:E48,\"x\")>0,\"x\",0)","v":0},null,{"$f":"IF(COUNTIF(G46:G48,\"x\")>0,\"x\",0)","v":0},null,{"$f":"IF(COUNTIF(I46:I48,\"x\")>0,\"x\",0)","v":0},null,{"$f":"IF(COUNTIF(K46:K48,\"x\")>0,\"x\",0)","v":0},null,{"$f":"IF(COUNTIF(M46:M48,\"x\")>0,\"x\",0)","v":0},null,"",null,0,0,0,0,0,""]
[45,null,"Utiliser des outils mathématiques pour résoudre des problèmes concrets, notamment des problèmes portant sur des grandeurs et leurs mesures.",{"$nulls":11},"",null,0,0,0,0,0,""]
[46,null,"Réaliser que certains problèmes relèvent de situations additives, d’autres de situations multiplicatives, de partages ou de groupements.",{"$nulls":11},"",null,0,0,0,0,0,""]
[47,null,"Reconnaitre des formes dans des objets réels et les reproduire géométriquement.",{"$nulls":11},"",null,0,0,0,0,0,""]
[48,null,"RAISONNER",null,{"$f":"IF(COUNTIF(E50:E52,\"x\")>0,\"x\",0)","v":0},null,{"$f":"IF(COUNTIF(G50:G52,\"x\")>0,\"x\",0)","v":0},null,{"$f":"IF(COUNTIF(I50:I52,\"x\")>0,\"x\",0)","v":0},null,{"$f":"IF(COUNTIF(K50:K52,\"x\")>0,\"x\",0)","v":0},null,{"$f":"IF(COUNTIF(M50:M52,\"x\")>0,\"x\",0)","v":0},null,"",null,0,0,0,0,0,""]
[49,null,"Anticiper le résultat d’une manipulation, d’un calcul, ou d’une mesure.",{"$nulls":11},"",null,0,0,0,0,0,""]
[50,null,"Raisonner sur des figures pour les reproduire avec des instruments.",{"$nulls":11},"",null,0,0,0,0,0,""]
[51,null,"Tenir compte d’éléments divers (arguments d’autrui, résultats d’une expérience, sources internes ou externes à la classe, etc.) pour modifier son jugement.",{"$nulls":11},"",null,0,0,0,0,0,""]
[52,null,"Prendre progressivement conscience de la nécessité et de l’intérêt de justifier ce que l’on affirme.",{"$nulls":11},"",null,0,0,0,0,0,""]
[53,null,"COMMUNIQUER",null,{"$f":"IF(COUNTIF(E55:E56,\"x\")>0,\"x\",0)","v":0},null,{"$f":"IF(COUNTIF(G55:G56,\"x\")>0,\"x\",0)","v":0},null,{"$f":"IF(COUNTIF(I55:I56,\"x\")>0,\"x\",0)","v":0},null,{"$f":"IF(COUNTIF(K55:K56,\"x\")>0,\"x\",0)","v":0},null,{"$f":"IF(COUNTIF(M55:M56,\"x\")>0,\"x\",0)","v":0},null,"",null,0,0,0,0,0,""]
[54,null,"Expliciter des démarches, argumenter des raisonnements.",{"$nulls":11},"",null,0,0,0,0,0,""]
[55,null,"PRATIQUE LA DEMARCHE SCIENTIFIQUE",null,{"$f":"IF(COUNTIF(E57:E57,\"x\")>0,\"x\",0)","v":0},null,{"$f":"IF(COUNTIF(G57:G57,\"x\")>0,\"x\",0)","v":0},null,{"$f":"IF(COUNTIF(I57:I57,\"x\")>0,\"x\",0)","v":0},null,{"$f":"IF(COUNTIF(K57:K57,\"x\")>0,\"x\",0)","v":0},null,{"$f":"IF(COUNTIF(M57:M57,\"x\")>0,\"x\",0)","v":0},null,"",null,0,0,0,0,0,""]
[56,null,"Pratiquer, avec l’aide des professeurs,une démarche d’investigation : questionnement, observation, expérience, description, raisonnement, conclusion.",{"$nulls":11},"",null,0,0,0,0,0,""]
[57,null,"IMAGINER , REALISER",null,{"$f":"IF(COUNTIF(E59:E60,\"x\")>0,\"x\",0)","v":0},null,{"$f":"IF(COUNTIF(G59:G60,\"x\")>0,\"x\",0)","v":0},null,{"$f":"IF(COUNTIF(I59:I60,\"x\")>0,\"x\",0)","v":0},null,{"$f":"IF(COUNTIF(K59:K60,\"x\")>0,\"x\",0)","v":0},null,{"$f":"IF(COUNTIF(M59:M60,\"x\")>0,\"x\",0)","v":0},null,"",null,0,0,0,0,0,""]
[58,null,"Observer des objets simples et des situations d’activités de la vie quotidienne.",{"$nulls":11},"",null,0,0,0,0,0,""]
[59,null,"Imaginer et réaliser des objets simples et de petits montages.",{"$nulls":11},"",null,0,0,0,0,0,""]
[60,null,"S'APPROPRIER DES OUTILS ET DES METHODES",null,{"$f":"IF(COUNTIF(E62:E63,\"x\")>0,\"x\",0)","v":0},null,{"$f":"IF(COUNTIF(G62:G63,\"x\")>0,\"x\",0)","v":0},null,{"$f":"IF(COUNTIF(I62:I63,\"x\")>0,\"x\",0)","v":0},null,{"$f":"IF(COUNTIF(K62:K63,\"x\")>0,\"x\",0)","v":0},null,{"$f":"IF(COUNTIF(M62:M63,\"x\")>0,\"x\",0)","v":0},null,"",null,0,0,0,0,0,""]
[61,null,"Choisir ou utiliser le matériel adapté proposé pour mener une observation, effectuer une mesure, réaliser une expérience. ",{"$nulls":11},"",null,0,0,0,0,0,""]
[62,null,"Manipuler avec soin.",{"$nulls":11},"",null,0,0,0,0,0,""]
[63,null,"PRATIQUER DES LANGAGES",null,{"$f":"IF(COUNTIF(E65:E68,\"x\")>0,\"x\",0)","v":0},null,{"$f":"IF(COUNTIF(G65:G68,\"x\")>0,\"x\",0)","v":0},null,{"$f":"IF(COUNTIF(I65:I68,\"x\")>0,\"x\",0)","v":0},null,{"$f":"IF(COUNTIF(K65:K68,\"x\")>0,\"x\",0)","v":0},null,{"$f":"IF(COUNTIF(M65:M68,\"x\")>0,\"x\",0)","v":0},null,"",null,0,0,0,0,0,""]
[64,null,"Communiquer en français, à l’oral et à l’écrit,.",{"$nulls":11},"",null,0,0,0,0,0,""]
[65,null,"Lire et comprendre des textes documentaires illustrés.",{"$nulls":11},"",null,0,0,0,0,0,""]
[66,null,"Extraire d’un texte ou d’une ressource documentaire une information qui répond à un besoin, une question.",{"$nulls":11},"",null,0,0,0,0,0,""]
[67,null,"Restituer les résultats des observations sous forme orale ou d’écrits variés (notes, listes, dessins, voire tableaux).",{"$nulls":11},"",null,0,0,0,0,0,""]
[68,null,"ADOPTER UN COMPORTEMENT ETHIQUE ET RESPONSABLE",null,{"$f":"IF(COUNTIF(E70:E71,\"x\")>0,\"x\",0)","v":0},null,{"$f":"IF(COUNTIF(G70:G71,\"x\")>0,\"x\",0)","v":0},null,{"$f":"IF(COUNTIF(I70:I71,\"x\")>0,\"x\",0)","v":0},null,{"$f":"IF(COUNTIF(K70:K71,\"x\")>0,\"x\",0)","v":0},null,{"$f":"IF(COUNTIF(M70:M71,\"x\")>0,\"x\",0)","v":0},null,{"$f":"IF(COUNTIF(E69:M69,\"X\"),\"X\",\"\")","v":""},null,0,0,0,0,0,""]
[69,null,"Développer un comportement responsable vis-à-vis de l’environnement et de la santé.",{"$nulls":11},{"$f":"IF(COUNTIF(E70:M70,\"X\"),\"X\",\"\")","v":""},null,{"$f":"E70","v":0},{"$f":"G70","v":0},{"$f":"I70","v":0},{"$f":"K70","v":0},{"$f":"M70","v":0},{"$f":"O70","v":""}]
[70,null,"Mettre en pratique les premières notions d’éco gestion de l’environnement par des actions simples, gestion de déchets, du papier, économies d’eau et d’énergie (éclairage, chauffage...).",{"$nulls":11},"",null,0,0,0,0,0,""]
[71,null,"SE SITUER DANS L'ESPACE ET DANS LE TEMPS",null,{"$f":"IF(COUNTIF(E73:E76,\"x\")>0,\"x\",0)","v":0},null,{"$f":"IF(COUNTIF(G73:G76,\"x\")>0,\"x\",0)","v":0},null,{"$f":"IF(COUNTIF(I73:I76,\"x\")>0,\"x\",0)","v":0},null,{"$f":"IF(COUNTIF(K73:K76,\"x\")>0,\"x\",0)","v":0},null,{"$f":"IF(COUNTIF(M73:M76,\"x\")>0,\"x\",0)","v":0},null,"",null,0,0,0,0,0,""]
[72,null,"Se repérer, s’orienter et se situer dans un espace géographique.",{"$nulls":11},"",null,0,0,0,0,0,""]
[73,null,"Utiliser et produire des représentations de l’espace.",{"$nulls":11},"",null,0,0,0,0,0,""]
[74,null,"Ordonner des évènements.",{"$nulls":11},"",null,0,0,0,0,0,""]
[75,null," Mémoriser quelques repères chronologiques.",{"$nulls":11},"",null,0,0,0,0,0,""]
[76,"LVE","COMPRENDRE L'ORAL",null,{"$f":"E78","v":0},null,{"$f":"G78","v":0},null,{"$f":"I78","v":0},null,{"$f":"K78","v":0},null,{"$f":"M78","v":0},null,"",null,0,0,0,0,0,""]
[77,null,"Écouter et comprendre des messages oraux simples relevant de la vie quotidienne, des textes simples lus par le professeur.",{"$nulls":11},"",null,0,0,0,0,0,""]
[78,null,"S'EXPRIMER ORALEMENT EN CONTINU",null,{"$f":"E80","v":0},null,{"$f":"G80","v":0},null,{"$f":"I80","v":0},null,{"$f":"K80","v":0},null,{"$f":"M80","v":0},null,"",null,0,0,0,0,0,""]
[79,null,"En s’appuyant sur un modèle, réciter, se décrire, lire ou raconter.",{"$nulls":11},"",null,0,0,0,0,0,""]
[80,null,"PRENDRE PAR A UNE CONVERSATION",null,{"$f":"E82","v":0},null,{"$f":"G82","v":0},null,{"$f":"I82","v":0},null,{"$f":"K82","v":0},null,{"$f":"M82","v":0},null,"",null,0,0,0,0,0,""]
[81,null,"Participer à des échanges simples pour être entendu et compris..",{"$nulls":11},"",null,0,0,0,0,0,""]
[82,null,"ASPECTS CULTURELS",null,{"$f":"E84","v":0},null,{"$f":"G84","v":0},null,{"$f":"I84","v":0},null,{"$f":"K84","v":0},null,{"$f":"M84","v":0},null,"",null,0,0,0,0,0,""]
[83,null,"Identifier quelques grands repères culturels de l’environnement quotidien des élèves du même âge dans les pays ou régions étudiés.",{"$nulls":11},"",null,0,0,0,0,0,""]
[84,"ARTS PLASTIQUES","EXPERIMENTER, PRODUIRE, CRÉER",null,{"$f":"IF(COUNTIF(E86:E102,\"x\")>0,\"x\",0)","v":0},null,{"$f":"IF(COUNTIF(G86:G102,\"x\")>0,\"x\",0)","v":0},null,{"$f":"IF(COUNTIF(I86:I102,\"x\")>0,\"x\",0)","v":0},null,{"$f":"IF(COUNTIF(K86:K102,\"x\")>0,\"x\",0)","v":0},null,{"$f":"IF(COUNTIF(M86:M102,\"x\")>0,\"x\",0)","v":0},null,"",null,0,0,0,0,0,""]
[85,null,"S’approprier par les sens les éléments du langage plastique : matière, support, couleur… ",{"$nulls":11},"",null,0,0,0,0,0,""]
[86,null,"Observer les effets produits par ses gestes, par les outils utilisés.",{"$nulls":11},"",null,0,0,0,0,0,""]
[87,null,"Tirer parti de trouvailles fortuites, saisir les effets du hasard.",{"$nulls":11},"",null,0,0,0,0,0,""]
[88,null,"Représenter le monde environnant ou donner forme à son imaginaire en explorant la diversité des domaines (dessin, collage, modelage, sculpture, photographie …).",{"$nulls":11},"",null,0,0,0,0,0,""]
[89,null,"METTRE EN OEUVRE UN PROJET ARTISTIQUE",null,{"$f":"IF(COUNTIF(E91:E107,\"x\")>0,\"x\",0)","v":0},null,{"$f":"IF(COUNTIF(G91:G107,\"x\")>0,\"x\",0)","v":0},null,{"$f":"IF(COUNTIF(I91:I107,\"x\")>0,\"x\",0)","v":0},null,{"$f":"IF(COUNTIF(K91:K107,\"x\")>0,\"x\",0)","v":0},null,{"$f":"IF(COUNTIF(M91:M107,\"x\")>0,\"x\",0)","v":0},null,"",null,0,0,0,0,0,""]
[90,null,"Respecter l’espace, les outils et les matériaux partagés.",{"$nulls":11},"",null,0,0,0,0,0,""]
[91,null,"Mener à terme une production individuelle dans le cadre d’un projet accompagné par le professeur.",{"$nulls":11},"",null,0,0,0,0,0,""]
[92,null,"Montrer sans réticence ses productions et regarder celles des autres.",{"$nulls":11},"",null,0,0,0,0,0,""]
[93,null,"S'EXPRIMER, ANALYSER SA PRATIQUE",null,{"$f":"IF(COUNTIF(E95:E114,\"x\")>0,\"x\",0)","v":0},null,{"$f":"IF(COUNTIF(G95:G114,\"x\")>0,\"x\",0)","v":0},null,{"$f":"IF(COUNTIF(I95:I114,\"x\")>0,\"x\",0)","v":0},null,{"$f":"IF(COUNTIF(K95:K114,\"x\")>0,\"x\",0)","v":0},null,{"$f":"IF(COUNTIF(M95:M114,\"x\")>0,\"x\",0)","v":0},null,"",null,0,0,0,0,0,""]
[94,null,"Prendre la parole devant un groupe pour partager ses trouvailles, s’intéresser à celles découvertes dans des œuvres d’art.",{"$nulls":11},"",null,0,0,0,0,0,""]
[95,null,"Formuler ses émotions, entendre et respecter celles des autres.",{"$nulls":11},"",null,0,0,0,0,0,""]
[96,null,"Repérer les éléments du langage plastique dans une production : couleurs, formes, matières, support… ",{"$nulls":11},"",null,0,0,0,0,0,""]
[97,null,"SE REPERER DANS LES DOMAINES LIES AUX ARTS PLASTIQUES",null,{"$f":"IF(COUNTIF(E99:E135,\"x\")>0,\"x\",0)","v":0},null,{"$f":"IF(COUNTIF(G99:G135,\"x\")>0,\"x\",0)","v":0},null,{"$f":"IF(COUNTIF(I99:I135,\"x\")>0,\"x\",0)","v":0},null,{"$f":"IF(COUNTIF(K99:K135,\"x\")>0,\"x\",0)","v":0},null,{"$f":"IF(COUNTIF(M99:M135,\"x\")>0,\"x\",0)","v":0},null,"",null,0,0,0,0,0,""]
[98,null,"Effectuer des choix parmi les images rencontrées, établir un premier lien entre son univers visuel et la culture artistique.",{"$nulls":11},"",null,0,0,0,0,0,""]
[99,null,"Exprimer ses émotions lors de la rencontre avec des œuvres d’art, manifester son intérêt pour la rencontre directe avec des œuvres. ",{"$nulls":11},"",null,0,0,0,0,0,""]
[100,null,"S’approprier quelques œuvres de domaines et d’époques variés appartenant au patrimoine national et mondial.",{"$nulls":11},"",null,0,0,0,0,0,""]
[101,null,"S’ouvrir à la diversité des pratiques et des cultures artistiques.",{"$nulls":11},"",null,0,0,0,0,0,""]
[102,"EDUCATION MUSICALE","CHANTER",null,{"$f":"IF(COUNTIF(E104:E114,\"x\")>0,\"x\",0)","v":0},null,{"$f":"IF(COUNTIF(G104:G114,\"x\")>0,\"x\",0)","v":0},null,{"$f":"IF(COUNTIF(I104:I114,\"x\")>0,\"x\",0)","v":0},null,{"$f":"IF(COUNTIF(K104:K114,\"x\")>0,\"x\",0)","v":0},null,{"$f":"IF(COUNTIF(M104:M114,\"x\")>0,\"x\",0)","v":0},null,"",null,0,0,0,0,0,""]
[103,null,"Chanter une mélodie simple avec une intonation juste, chanter une comptine ou un chant par imitation.",{"$nulls":11},"",null,0,0,0,0,0,""]
[104,null,"Interpréter un chant avec expressivité.",{"$nulls":11},"",null,0,0,0,0,0,""]
[105,null,"ECOUTER, COMPARER",null,{"$f":"IF(COUNTIF(E107:E134,\"x\")>0,\"x\",0)","v":0},null,{"$f":"IF(COUNTIF(G107:G134,\"x\")>0,\"x\",0)","v":0},null,{"$f":"IF(COUNTIF(I107:I134,\"x\")>0,\"x\",0)","v":0},null,{"$f":"IF(COUNTIF(K107:K134,\"x\")>0,\"x\",0)","v":0},null,{"$f":"IF(COUNTIF(M107:M134,\"x\")>0,\"x\",0)","v":0},null,"",null,0,0,0,0,0,""]
[106,null,"Décrire et comparer des éléments sonores. ",{"$nulls":11},"",null,0,0,0,0,0,""]
[107,null,"Comparer des musiques et identifier des ressemblances et des différences.",{"$nulls":11},"",null,0,0,0,0,0,""]
[108,null,"EXPLORER, IMAGINER",null,{"$f":"IF(COUNTIF(E110:E137,\"x\")>0,\"x\",0)","v":0},null,{"$f":"IF(COUNTIF(G110:G137,\"x\")>0,\"x\",0)","v":0},null,{"$f":"IF(COUNTIF(I110:I137,\"x\")>0,\"x\",0)","v":0},null,{"$f":"IF(COUNTIF(K110:K137,\"x\")>0,\"x\",0)","v":0},null,{"$f":"IF(COUNTIF(M110:M137,\"x\")>0,\"x\",0)","v":0},null,"",null,0,0,0,0,0,""]
[109,null,"Imaginer des représentations graphiques ou corporelles de la musique.",{"$nulls":11},"",null,0,0,0,0,0,""]
[110,null,"Inventer une organisation simple à partir de différents éléments sonores. ",{"$nulls":11},"",null,0,0,0,0,0,""]
[111,null,"ECHANGER, PARTAGER",null,{"$f":"IF(COUNTIF(E113:E140,\"x\")>0,\"x\",0)","v":0},null,{"$f":"IF(COUNTIF(G113:G140,\"x\")>0,\"x\",0)","v":0},null,{"$f":"IF(COUNTIF(I113:I140,\"x\")>0,\"x\",0)","v":0},null,{"$f":"IF(COUNTIF(K113:K140,\"x\")>0,\"x\",0)","v":0},null,{"$f":"IF(COUNTIF(M113:M140,\"x\")>0,\"x\",0)","v":0},null,"",null,0,0,0,0,0,""]
[112,null,"Exprimer ses émotions, ses sentiments et ses préférences.",{"$nulls":11},"",null,0,0,0,0,0,""]
[113,null,"Écouter et respecter l’avis des autres et l’expression de leur sensibilité.",{"$nulls":11},"",null,0,0,0,0,0,""]
[114,"EPS","DEVELOPPER SA MOTRICITE, LE LANGAGE DU CORPS ",null,{"$f":"IF(COUNTIF(E116:E118,\"x\")>0,\"x\",0)","v":0},null,{"$f":"IF(COUNTIF(G116:G118,\"x\")>0,\"x\",0)","v":0},null,{"$f":"IF(COUNTIF(I116:I118,\"x\")>0,\"x\",0)","v":0},null,{"$f":"IF(COUNTIF(K116:K118,\"x\")>0,\"x\",0)","v":0},null,{"$f":"IF(COUNTIF(M116:M118,\"x\")>0,\"x\",0)","v":0},null,"",null,0,0,0,0,0,""]
[115,null,"Prendre conscience des différentes ressources à mobiliser pour agir avec son corps. ",{"$nulls":11},"",null,0,0,0,0,0,""]
[116,null,"Adapter sa motricité à des environnements variés.",{"$nulls":11},"",null,0,0,0,0,0,""]
[117,null,"S’exprimer par son corps et accepter de se montrer à autrui.",{"$nulls":11},"",null,0,0,0,0,0,""]
[118,null,"S’APPROPRIER LES MÉTHODES ET OUTILS POUR APPRENDRE",null,{"$f":"IF(COUNTIF(E120:E121,\"x\")>0,\"x\",0)","v":0},null,{"$f":"IF(COUNTIF(G120:G121,\"x\")>0,\"x\",0)","v":0},null,{"$f":"IF(COUNTIF(I120:I121,\"x\")>0,\"x\",0)","v":0},null,{"$f":"IF(COUNTIF(K120:K121,\"x\")>0,\"x\",0)","v":0},null,{"$f":"IF(COUNTIF(M120:M121,\"x\")>0,\"x\",0)","v":0},null,"",null,0,0,0,0,0,""]
[119,null,"Apprendre par essai-erreur en utilisant les effets de son action.",{"$nulls":11},"",null,0,0,0,0,0,""]
[120,null,"Apprendre à planifier son action avant de la réaliser.",{"$nulls":11},"",null,0,0,0,0,0,""]
[121,null,"PARTAGER DES RÈGLES, ASSUMER DES RÔLES ",null,{"$f":"IF(COUNTIF(E123:E125,\"x\")>0,\"x\",0)","v":0},null,{"$f":"IF(COUNTIF(G123:G125,\"x\")>0,\"x\",0)","v":0},null,{"$f":"IF(COUNTIF(I123:I125,\"x\")>0,\"x\",0)","v":0},null,{"$f":"IF(COUNTIF(K123:K125,\"x\")>0,\"x\",0)","v":0},null,{"$f":"IF(COUNTIF(M123:M125,\"x\")>0,\"x\",0)","v":0},null,"",null,0,0,0,0,0,""]
[122,null,"Assumer les rôles spécifiques aux différentes APSA (joueur, coach, arbitre, juge, médiateur, organisateur…). ",{"$nulls":11},"",null,0,0,0,0,0,""]
[123,null,"Élaborer, respecter et faire respecter règles et règlements.",{"$nulls":11},"",null,0,0,0,0,0,""]
[124,null,"Accepter et prendre en considération toutes les différences interindividuelles au sein d’un groupe.",{"$nulls":11},"",null,0,0,0,0,0,""]
[125,null,"ENTRETENIR SA SANTÉ ",null,{"$f":"IF(COUNTIF(E127:E128,\"x\")>0,\"x\",0)","v":0},null,{"$f":"IF(COUNTIF(G127:G128,\"x\")>0,\"x\",0)","v":0},null,{"$f":"IF(COUNTIF(I127:I128,\"x\")>0,\"x\",0)","v":0},null,{"$f":"IF(COUNTIF(K127:K128,\"x\")>0,\"x\",0)","v":0},null,{"$f":"IF(COUNTIF(M127:M128,\"x\")>0,\"x\",0)","v":0},null,"",null,0,0,0,0,0,""]
[126,null,"Découvrir les principes d’une bonne hygiène de vie, à des fins de santé et de bien être.",{"$nulls":11},"",null,0,0,0,0,0,""]
[127,null,"Ne pas se mettre en danger par un engagement physique dont l’intensité excède ses qualités physiques.",{"$nulls":11},"",null,0,0,0,0,0,""]
[128,null,"S’APPROPRIER UNE CULTURE PHYSIQUE SPORTIVE ET ARTISTIQUE ",null,{"$f":"IF(COUNTIF(E130:E131,\"x\")>0,\"x\",0)","v":0},null,{"$f":"IF(COUNTIF(G130:G131,\"x\")>0,\"x\",0)","v":0},null,{"$f":"IF(COUNTIF(I130:I131,\"x\")>0,\"x\",0)","v":0},null,{"$f":"IF(COUNTIF(K130:K131,\"x\")>0,\"x\",0)","v":0},null,{"$f":"IF(COUNTIF(M130:M131,\"x\")>0,\"x\",0)","v":0},null,"",null,0,0,0,0,0,""]
[129,null,"Découvrir la variété des activités et des spectacles sportifs.",{"$nulls":11},"",null,0,0,0,0,0,""]
[130,null,"Exprimer des intentions et des émotions par son corps dans un projet artistique individuel ou collectif.",{"$nulls":11},"",null,0,0,0,0,0,""]
[131,"EMC","ENSEIGNEMENT CIVIQUE ET MORAL",null,{"$f":"IF(COUNTIF(E133:E138,\"x\")>0,\"x\",0)","v":0},null,{"$f":"IF(COUNTIF(G133:G138,\"x\")>0,\"x\",0)","v":0},null,{"$f":"IF(COUNTIF(I133:I138,\"x\")>0,\"x\",0)","v":0},null,{"$f":"IF(COUNTIF(K133:K138,\"x\")>0,\"x\",0)","v":0},null,{"$f":"IF(COUNTIF(M133:M138,\"x\")>0,\"x\",0)","v":0},null,"",null,0,0,0,0,0,""]
[132,null," Identifier et partager des émotions, des sentiments dans des situations et à propos d'objets diversifiés.",{"$nulls":11},"",null,0,0,0,0,0,""]
[133,null,"Se situer et s'exprimer en respectant les codes de la communication orale, les règles de l'échange et le statut de l'interlocuteur.",{"$nulls":11},{"$f":"IF(COUNTIF(E134:M134,\"X\"),\"X\",\"\")","v":""},null,{"$f":"E134","v":0},{"$f":"G134","v":0},{"$f":"I134","v":0},{"$f":"K134","v":0},{"$f":"M134","v":0},{"$f":"O134","v":""}]
[134,null,"Prendre soin de soi et des autres.",{"$nulls":11},{"$f":"IF(COUNTIF(E135:M135,\"X\"),\"X\",\"\")","v":""},null,0,0,0,0,0,{"$f":"O135","v":""}]
[135,null,"Accepter les différences. ",{"$nulls":11},{"$f":"IF(COUNTIF(E136:M136,\"X\"),\"X\",\"\")","v":""},null,0,0,0,0,0,{"$f":"O136","v":""}]
[136,null,"Identifier les symboles de la République présents dans l'école. ",{"$nulls":11},{"$f":"IF(COUNTIF(E137:M137,\"X\"),\"X\",\"\")","v":""},null,0,0,0,0,0,{"$f":"O137","v":""}]
[137,null,"Apprendre à coopérer. ",{"$nulls":11},{"$f":"IF(COUNTIF(E138:M138,\"X\"),\"X\",\"\")","v":""},null,0,0,0,0,0,{"$f":"O138","v":""}]
[138]
[139]
[140]
[141]
[142]
[143]
[144]
[145]
[146]
[147]
[148]
[149]
[150]
[151]
[152]
[153]
[154]
[155]
[156]
[157]
[158]
[159]
[160]
[161]
[162]
[163]
[164]
[165]
[166]
[167]
[168]
[169]
[170]
[171]
[172]
[173]
[174]
[175]
[176]
[177]
[178]
[179]
[180]
[181]
[182]
[183]
[184]
[185]
[186]
[187]
[188]
[189]
[190]
[191]
[192]
[193]
[194]
[195]
[196]
[197]
[198]
[199]
[200]
[201]
[202]
[203]
[204]
[205]
[206]
[207]
[208]
[209]
[210]
[211]
[212]
[213]
[214]
[215]
[216]
[217]
[218]
[219]
[220]
[221]
[222]
[223]
[224]
[225]
[226]
[227]
[228]
[229]
[230]
[231]
[232]
[233]
[234]
[235]
[236]
[237]
[238]
[239]
[240]
[241]
[242]
[243]
[244]
[245]
[246]
[247]
[248]
[249]
[250]
[251]
[252]
[253]
[254]
[255]
[256]
[257]
[258]
[259]
[260]
[261]
[262]
[263]
[264]
[265]
[266]
[267]
[268]
[269]
[270]
[271]
[272]
[273]
[274]
[275]
[276]
[277]
[278]
[279]
[280]
[281]
[282]
[283]
[284]
[285]
[286]
[287]
[288]
[289]
[290]
[291]
[292]
[293]
[294]
[295]
[296]
[297]
[298]
[299]
[300]
[301]
[302]
[303]
[304]
[305]
[306]
[307]
[308]
[309]
[310]
[311]
[312]
[313]
[314]
[315]
[316]
[317]
[318]
[319]
[320]
[321]
[322]
[323]
[324]
[325]
[326]
[327]
[328]
[329]
[330]
[331]
[332]
[333]
[334]
[335]
[336]
[337]
[338]
[339]
[340]
[341]
[342]
[343]
[344]
[345]
[346]
[347]
[348]
[349]
[350]
[351]
[352]
[353]
[354]
[355]
[356]
[357]
[358]
[359]
[360]
[361]
[362]
[363]
[364]
[365]
[366]
[367]
[368]
[369]
[370]
[371]
[372]
[373]
[374]
[375]
[376]
[377]
[378]
[379]
[380]
[381]
[382]
[383]
[384]
[385]
[386]
[387]
[388]
[389]
[390]
[391]
[392]
[393]
[394]
[395]
[396]
[397]
[398]
[399]
[400]
[401]
[402]
[403]
[404]
[405]
[406]
[407]
[408]
[409]
[410]
[411]
[412]
[413]
[414]
[415]
[416]
[417]
[418]
[419]
[420]
[421]
[422]
[423]
[424]
[425]
[426]
[427]
[428]
[429]
[430]
[431]
[432]
[433]
[434]
[435]
[436]
[437]
[438]
[439]
[440]
[441]
[442]
[443]
[444]
[445]
[446]
[447]
[448]
[449]
[450]
[451]
[452]
[453]
[454]
[455]
[456]
[457]
[458]
[459]
[460]
[461]
[462]
[463]
[464]
[465]
[466]
[467]
[468]
[469]
[470]
[471]
[472]
[473]
[474]
[475]
[476]
[477]
[478]
[479]
[480]
[481]
[482]
[483]
[484]
[485]
[486]
[487]
[488]
[489]
[490]
[491]
[492]
[493]
[494]
[495]
[496]
[497]
[498]
[499]
[500]
[501]
[502]
[503]
[504]
[505]
[506]
[507]
[508]
[509]
[510]
[511]
[512]
[513]
[514]
[515]
[516]
[517]
[518]
[519]
[520]
[521]
[522]
[523]
[524]
[525]
[526]
[527]
[528]
[529]
[530]
[531]
[532]
[533]
[534]
[535]
[536]
[537]
[538]
[539]
[540]
[541]
[542]
[543]
[544]
[545]
[546]
[547]
[548]
[549]
[550]
[551]
[552]
[553]
[554]
[555]
[556]
[557]
[558]
[559]
[560]
[561]
[562]
[563]
[564]
[565]
[566]
[567]
[568]
[569]
[570]
[571]
[572]
[573]
[574]
[575]
[576]
[577]
[578]
[579]
[580]
[581]
[582]
[583]
[584]
[585]
[586]
[587]
[588]
[589]
[590]
[591]
[592]
[593]
[594]
[595]
[596]
[597]
[598]
[599]
[600]
[601]
[602]
[603]
[604]
[605]
[606]
[607]
[608]
[609]
[610]
[611]
[612]
[613]
[614]
[615]
[616]
[617]
[618]
[619]
[620]
[621]
[622]
[623]
[624]
[625]
[626]
[627]
[628]
[629]
[630]
[631]
[632]
[633]
[634]
[635]
[636]
[637]
[638]
[639]
[640]
[641]
[642]
[643]
[644]
[645]
[646]
[647]
[648]
[649]
[650]
[651]
[652]
[653]
[654]
[655]
[656]
[657]
[658]
[659]
[660]
[661]
[662]
[663]
[664]
[665]
[666]
[667]
[668]
[669]
[670]
[671]
[672]
[673]
[674]
[675]
[676]
[677]
[678]
[679]
[680]
[681]
[682]
[683]
[684]
[685]
[686]
[687]
[688]
[689]
[690]
[691]
[692]
[693]
[694]
[695]
[696]
[697]
[698]
[699]
[700]
[701]
[702]
[703]
[704]
[705]
[706]
[707]
[708]
[709]
[710]
[711]
[712]
[713]
[714]
[715]
[716]
[717]
[718]
[719]
[720]
[721]
[722]
[723]
[724]
[725]
[726]
[727]
[728]
[729]
[730]
[731]
[732]
[733]
[734]
[735]
[736]
[737]
[738]
[739]
[740]
[741]
[742]
[743]
[744]
[745]
[746]
[747]
[748]
[749]
[750]
[751]
[752]
[753]
[754]
[755]
[756]
[757]
[758]
[759]
[760]
[761]
[762]
[763]
[764]
[765]
[766]
[767]
[768]
[769]
[770]
[771]
[772]
[773]
[774]
[775]
[776]
[777]
[778]
[779]
[780]
[781]
[782]
[783]
[784]
[785]
[786]
[787]
[788]
[789]
[790]
[791]
[792]
[793]
[794]
[795]
[796]
[797]
[798]
[799]
[800]
[{"$error":"#N/A"}]
[{"$error":"#N/A"}]
[{"$error":"#N/A"}]
[{"$error":"#N/A"}]
[{"$error":"#N/A"}]
[{"$error":"#N/A"}]
[{"$error":"#N/A"}]
[{"$error":"#N/A"}]
[{"$error":"#N/A"}]
[{"$error":"#N/A"}]
[{"$error":"#N/A"}]
[{"$error":"#N/A"}]
[{"$error":"#N/A"}]
[791]
[792]
[793]
[794]
[795]
[796]
[797]
[798]
[799]
[800]

{"sheet":"Période","index":4,"n_rows":138,"n_cols":48,"rows_kept":138,"hidden":true,"merged":[[4,1,27,1],[28,1,54,1],[55,1,75,1],[76,1,83,1],[84,1,101,1],[102,1,113,1],[114,1,130,1],[131,1,137,1]]}
[{"$nulls":3},1,2,3,4,5,6,7,8,9,10,11,12,13,14,15,16,17,18,19,20,21,22,23,24,25,26,27,28,29,30,31,32,33,{"$nulls":10},"A",{"$f":"Renseignements!C49","v":5}]
[{"$nulls":46},"B"]
[{"$nulls":3},{"$f":"IF(ISBLANK(INDEX(nom,noligne,1)),\"\",(INDEX(prenom,noligne,1))&\" \" &(INDEX(nom,noligne,1)))","v":"Marc Aurèle"},"Jérôme Lenoir","Fabien Léglise","Aicha Samarahoui","Karim Maha","","","","","","","","","","","","","","","","","","","","","","","","","","","","",{"$nulls":10},"C"]
[{"$nulls":39},"A","B","C","D","NE",null,null,"D"]
[null,"FRANCAIS","LANGAGE ORAL",{"$f":"COUNTA(D6:D9)*10","v":0},{"$f":"COUNTA(E6:E9)*10","v":0},0,0,0,0,0,0,0,0,0,0,0,0,0,0,0,0,0,0,0,0,0,0,0,0,0,0,0,0,0,0,0]
[null,null,"Écouter pour comprendre des messages oraux ou des textes lus par un adulte.",{"$nulls":36},{"$f":"COUNTIF($D7:$AL7,$AU$1)/$AV$1","v":{"v":0,"d":"0%"}},{"$f":"COUNTIF($D7:$AL7,$AU$2)/$AV$1","v":{"v":0,"d":"0%"}},{"$f":"COUNTIF($D7:$AL7,$AU$3)/$AV$1","v":{"v":0,"d":"0%"}},{"$f":"COUNTIF($D7:$AL7,$AU$4)/$AV$1","v":{"v":0,"d":"0%"}},{"$f":"COUNTIF(D7:$AL7,\"NE\")/$AV$1","v":{"v":0,"d":"0%"}},{"$f":"AN7+(AO7*0.66)+(AP7*0.33)","v":{"v":0,"d":"0%"}}]
[null,null,"Dire pour être entendu et compris.",{"$nulls":36},{"v":0,"d":"0%"},{"v":0,"d":"0%"},{"v":0,"d":"0%"},{"v":0,"d":"0%"},{"$f":"COUNTIF(D8:$AL8,\"NE\")/$AV$1","v":{"v":0,"d":"0%"}},{"v":0,"d":"0%"}]
[null,null,"Participer à des échanges dans des situations diversifiées.",{"$nulls":36},{"v":0,"d":"0%"},{"v":0,"d":"0%"},{"v":0,"d":"0%"},{"v":0,"d":"0%"},{"$f":"COUNTIF(D9:$AL9,\"NE\")/$AV$1","v":{"v":0,"d":"0%"}},{"v":0,"d":"0%"}]
[null,null,"Adopter une distance critique par rapport au langage produit.",{"$nulls":36},{"v":0,"d":"0%"},{"v":0,"d":"0%"},{"v":0,"d":"0%"},{"v":0,"d":"0%"},{"$f":"COUNTIF(D10:$AL10,\"NE\")/$AV$1","v":{"v":0,"d":"0%"}},{"v":0,"d":"0%"}]
[null,null,"LECTURE ET COMPREHENSION DE l'ECRIT",{"$f":"COUNTA(D11:D15)*10","v":0},{"$f":"COUNTA(E11:E15)*10","v":0},0,0,0,0,0,0,0,0,0,0,0,0,0,0,0,0,0,0,0,0,0,0,0,0,0,0,0,0,0,0,0]
[null,null,"Identifier des mots de manière de plus en plus aisée. ",{"$nulls":36},{"v":0,"d":"0%"},{"v":0,"d":"0%"},{"v":0,"d":"0%"},{"v":0,"d":"0%"},{"$f":"COUNTIF(D12:$AL12,\"NE\")/$AV$1","v":{"v":0,"d":"0%"}},{"v":0,"d":"0%"}]
[null,null,"Comprendre un texte.",{"$nulls":36},{"v":0,"d":"0%"},{"v":0,"d":"0%"},{"v":0,"d":"0%"},{"v":0,"d":"0%"},{"$f":"COUNTIF(D13:$AL13,\"NE\")/$AV$1","v":{"v":0,"d":"0%"}},{"v":0,"d":"0%"}]
[null,null,"Pratiquer différentes formes de lecture.",{"$nulls":36},{"v":0,"d":"0%"},{"v":0,"d":"0%"},{"v":0,"d":"0%"},{"v":0,"d":"0%"},{"$f":"COUNTIF(D14:$AL14,\"NE\")/$AV$1","v":{"v":0,"d":"0%"}},{"v":0,"d":"0%"}]
[null,null,"Lire à voix haute.",{"$nulls":36},{"v":0,"d":"0%"},{"v":0,"d":"0%"},{"v":0,"d":"0%"},{"v":0,"d":"0%"},{"$f":"COUNTIF(D15:$AL15,\"NE\")/$AV$1","v":{"v":0,"d":"0%"}},{"v":0,"d":"0%"}]
[null,null,"Contrôler sa compréhension.",{"$nulls":36},{"v":0,"d":"0%"},{"v":0,"d":"0%"},{"v":0,"d":"0%"},{"v":0,"d":"0%"},{"$f":"COUNTIF(D16:$AL16,\"NE\")/$AV$1","v":{"v":0,"d":"0%"}},{"v":0,"d":"0%"}]
[null,null,"ECRITURE",{"$f":"COUNTA(D17:D19)*10","v":0},{"$f":"COUNTA(E17:E19)*10","v":0},0,0,0,0,0,0,0,0,0,0,0,0,0,0,0,0,0,0,0,0,0,0,0,0,0,0,0,0,0,0,0]
[null,null,"Copier de manière experte.",{"$nulls":36},{"v":0,"d":"0%"},{"v":0,"d":"0%"},{"v":0,"d":"0%"},{"v":0,"d":"0%"},{"$f":"COUNTIF(D18:$AL18,\"NE\")/$AV$1","v":{"v":0,"d":"0%"}},{"v":0,"d":"0%"}]
[null,null,"Rédiger un texte d'une demi page.",{"$nulls":36},{"v":0,"d":"0%"},{"v":0,"d":"0%"},{"v":0,"d":"0%"},{"v":0,"d":"0%"},{"$f":"COUNTIF(D19:$AL19,\"NE\")/$AV$1","v":{"v":0,"d":"0%"}},{"v":0,"d":"0%"}]
[null,null,"Réviser et améliorer l’écrit qu’on a produit. ",{"$nulls":36},{"v":0,"d":"0%"},{"v":0,"d":"0%"},{"v":0,"d":"0%"},{"v":0,"d":"0%"},{"$f":"COUNTIF(D20:$AL20,\"NE\")/$AV$1","v":{"v":0,"d":"0%"}},{"v":0,"d":"0%"}]
[null,null,"ETUDE DE LA LANGUE",{"$f":"COUNTA(D21:D28)*10","v":0},{"$f":"COUNTA(E21:E28)*10","v":0},0,0,0,0,0,0,0,0,0,0,0,0,0,0,0,0,0,0,0,0,0,0,0,0,0,0,0,0,0,0,0]
[null,null,"Maitriser les relations entre l’oral et l’écrit.",{"$nulls":36},{"v":0,"d":"0%"},{"v":0,"d":"0%"},{"v":0,"d":"0%"},{"v":0,"d":"0%"},{"$f":"COUNTIF(D22:$AL22,\"NE\")/$AV$1","v":{"v":0,"d":"0%"}},{"v":0,"d":"0%"}]
[null,null,"Mémoriser et se remémorer l’orthographe de mots fréquents et de mots irréguliers dont le sens est connu.",{"$nulls":36},{"v":0,"d":"0%"},{"v":0,"d":"0%"},{"v":0,"d":"0%"},{"v":0,"d":"0%"},{"$f":"COUNTIF(D23:$AL23,\"NE\")/$AV$1","v":{"v":0,"d":"0%"}},{"v":0,"d":"0%"}]
[null,null,"Identifier les principaux constituants d’une phrase simple en relation avec sa cohérence sémantique.",{"$nulls":36},{"v":0,"d":"0%"},{"v":0,"d":"0%"},{"v":0,"d":"0%"},{"v":0,"d":"0%"},{"$f":"COUNTIF(D24:$AL24,\"NE\")/$AV$1","v":{"v":0,"d":"0%"}},{"v":0,"d":"0%"}]
[null,null,"Orthographier les formes verbales les plus fréquentes.",{"$nulls":36},{"v":0,"d":"0%"},{"v":0,"d":"0%"},{"v":0,"d":"0%"},{"v":0,"d":"0%"},{"$f":"COUNTIF(D25:$AL25,\"NE\")/$AV$1","v":{"v":0,"d":"0%"}},{"v":0,"d":"0%"}]
[null,null,"Raisonner pour résoudre des problèmes orthographiques.",{"$nulls":36},{"v":0,"d":"0%"},{"v":0,"d":"0%"},{"v":0,"d":"0%"},{"v":0,"d":"0%"},{"$f":"COUNTIF(D26:$AL26,\"NE\")/$AV$1","v":{"v":0,"d":"0%"}},{"v":0,"d":"0%"}]
[null,null,"Comprendre comment se forment les verbes et orthographier les formes verbales les plus fréquentes ",{"$nulls":36},{"v":0,"d":"0%"},{"v":0,"d":"0%"},{"v":0,"d":"0%"},{"v":0,"d":"0%"},{"$f":"COUNTIF(D27:$AL27,\"NE\")/$AV$1","v":{"v":0,"d":"0%"}},{"v":0,"d":"0%"}]
[null,null,"Identifier des relations entre les mots, entre les mots et leur contexte d’utilisation ; s’en servir pour mieux comprendre.",{"$nulls":36},{"v":0,"d":"0%"},{"v":0,"d":"0%"},{"v":0,"d":"0%"},{"v":0,"d":"0%"},{"$f":"COUNTIF(D28:$AL28,\"NE\")/$AV$1","v":{"v":0,"d":"0%"}},{"v":0,"d":"0%"}]
[null,null,"Étendre ses connaissances lexicales, mémoriser et réutiliser des mots nouvellement appris.",{"$nulls":36},{"v":0,"d":"0%"},{"v":0,"d":"0%"},{"v":0,"d":"0%"},{"v":0,"d":"0%"},{"$f":"COUNTIF(D29:$AL29,\"NE\")/$AV$1","v":{"v":0,"d":"0%"}},{"v":0,"d":"0%"}]
[null,"MATHEMATIQUES","NOMBRES ET CALCUL",{"$f":"COUNTA(D30:D33)*10","v":0},{"$f":"COUNTA(E30:E33)*10","v":0},0,0,0,0,0,0,0,0,0,0,0,0,0,0,0,0,0,0,0,0,0,0,0,0,0,0,0,0,0,0,0]
[null,null,"Comprendre et utiliser des nombres entiers pour dénombrer, ordonner, repérer, comparer.",{"$nulls":36},{"$f":"COUNTIF($D32:$AL32,$AU$1)/$AV$1","v":{"v":0,"d":"0%"}},{"$f":"COUNTIF($D32:$AL32,$AU$2)/$AV$1","v":{"v":0,"d":"0%"}},{"$f":"COUNTIF($D32:$AL32,$AU$3)/$AV$1","v":{"v":0,"d":"0%"}},{"$f":"COUNTIF($D32:$AL32,$AU$4)/$AV$1","v":{"v":0,"d":"0%"}},{"$f":"COUNTIF(D32:$AL32,\"NE\")/$AV$1","v":{"v":0,"d":"0%"}},{"$f":"AN32+(AO32*0.66)+(AP32*0.33)","v":{"v":0,"d":"0%"}}]
[null,null,"Nommer, lire, écrire, représenter des nombres entiers."]
[null,null,"Calculer avec des nombres entiers, mentalement ou à la main, de manière exacte ou approchée.",{"$nulls":36},{"v":0,"d":"0%"},{"v":0,"d":"0%"},{"v":0,"d":"0%"},{"v":0,"d":"0%"},{"$f":"COUNTIF(D33:$AL33,\"NE\")/$AV$1","v":{"v":0,"d":"0%"}},{"v":0,"d":"0%"}]
[null,null,"Contrôler la vraisemblance de ses résultats.",{"$nulls":36},{"v":0,"d":"0%"},{"v":0,"d":"0%"},{"v":0,"d":"0%"},{"v":0,"d":"0%"},{"$f":"COUNTIF(D34:$AL34,\"NE\")/$AV$1","v":{"v":0,"d":"0%"}},{"v":0,"d":"0%"}]
[null,null,"GRANDEURS ET MESURES",{"$f":"COUNTA(D35:D37)*10","v":0},{"$f":"COUNTA(E35:E37)*10","v":0},0,0,0,0,0,0,0,0,0,0,0,0,0,0,0,0,0,0,0,0,0,0,0,0,0,0,0,0,0,0,0]
[null,null,"Comparer, estimer, mesurer des longueurs, des masses, des contenances, des durées.",{"$nulls":36},{"v":0,"d":"0%"},{"v":0,"d":"0%"},{"v":0,"d":"0%"},{"v":0,"d":"0%"},{"$f":"COUNTIF(D36:$AL36,\"NE\")/$AV$1","v":{"v":0,"d":"0%"}},{"v":0,"d":"0%"}]
[null,null,"Utiliser le lexique, les unités, les instruments de mesures spécifiques de ces grandeurs.",{"$nulls":36},{"v":0,"d":"0%"},{"v":0,"d":"0%"},{"v":0,"d":"0%"},{"v":0,"d":"0%"},{"$f":"COUNTIF(D37:$AL37,\"NE\")/$AV$1","v":{"v":0,"d":"0%"}},{"v":0,"d":"0%"}]
[null,null,"Résoudre des problèmes impliquant des longueurs, des masses, des contenances, des durées, des prix.",{"$nulls":36},{"v":0,"d":"0%"},{"v":0,"d":"0%"},{"v":0,"d":"0%"},{"v":0,"d":"0%"},{"$f":"COUNTIF(D38:$AL38,\"NE\")/$AV$1","v":{"v":0,"d":"0%"}},{"v":0,"d":"0%"}]
[null,null,"ESPACE ET GEOMETRIE",{"$f":"COUNTA(D39:D41)*10","v":0},{"$f":"COUNTA(E39:E41)*10","v":0},0,0,0,0,0,0,0,0,0,0,0,0,0,0,0,0,0,0,0,0,0,0,0,0,0,0,0,0,0,0,0]
[null,null,"Appréhender différents systèmes de représentations (dessins, schémas, arbres de calcul, etc.).",{"$nulls":36},{"$f":"COUNTIF($D40:$AL40,$AU$1)/$AV$1","v":{"v":0,"d":"0%"}},{"$f":"COUNTIF($D40:$AL40,$AU$2)/$AV$1","v":{"v":0,"d":"0%"}},{"$f":"COUNTIF($D40:$AL40,$AU$3)/$AV$1","v":{"v":0,"d":"0%"}},{"$f":"COUNTIF($D40:$AL40,$AU$4)/$AV$1","v":{"v":0,"d":"0%"}},{"$f":"COUNTIF(D40:$AL40,\"NE\")/$AV$1","v":{"v":0,"d":"0%"}},{"$f":"AN40+(AO40*0.66)+(AP40*0.33)","v":{"v":0,"d":"0%"}}]
[null,null,"Utiliser des nombres pour représenter des quantités ou des grandeurs. ",{"$nulls":36},{"v":0,"d":"0%"},{"v":0,"d":"0%"},{"v":0,"d":"0%"},{"v":0,"d":"0%"},{"$f":"COUNTIF(D41:$AL41,\"NE\")/$AV$1","v":{"v":0,"d":"0%"}},{"v":0,"d":"0%"}]
[null,null,"Utiliser diverses représentations de solides et de situations spatiales.",{"$nulls":36},{"v":0,"d":"0%"},{"v":0,"d":"0%"},{"v":0,"d":"0%"},{"v":0,"d":"0%"},{"$f":"COUNTIF(D42:$AL42,\"NE\")/$AV$1","v":{"v":0,"d":"0%"}},{"v":0,"d":"0%"}]
[null,null,"CHERCHER",{"$f":"COUNTA(D43:D44)*10","v":0},{"$f":"COUNTA(E43:E44)*10","v":0},0,0,0,0,0,0,0,0,0,0,0,0,0,0,0,0,0,0,0,0,0,0,0,0,0,0,0,0,0,0,0]
[null,null,"S’engager dans une démarche de résolution de problèmes.",{"$nulls":36},{"v":0,"d":"0%"},{"v":0,"d":"0%"},{"v":0,"d":"0%"},{"v":0,"d":"0%"},{"$f":"COUNTIF(D44:$AL44,\"NE\")/$AV$1","v":{"v":0,"d":"0%"}},{"v":0,"d":"0%"}]
[null,null,"Tester, essayer plusieurs pistes proposées par soi-même, les autres élèves ou le professeur.",{"$nulls":36},{"v":0,"d":"0%"},{"v":0,"d":"0%"},{"v":0,"d":"0%"},{"v":0,"d":"0%"},{"$f":"COUNTIF(D45:$AL45,\"NE\")/$AV$1","v":{"v":0,"d":"0%"}},{"v":0,"d":"0%"}]
[null,null,"MODELISER",{"$f":"COUNTA(D46:D48)*10","v":0},{"$f":"COUNTA(E46:E48)*10","v":0},0,0,0,0,0,0,0,0,0,0,0,0,0,0,0,0,0,0,0,0,0,0,0,0,0,0,0,0,0,0,0]
[null,null,"Utiliser des outils mathématiques pour résoudre des problèmes concrets, notamment des problèmes portant sur des grandeurs et leurs mesures.",{"$nulls":36},{"v":0,"d":"0%"},{"v":0,"d":"0%"},{"v":0,"d":"0%"},{"v":0,"d":"0%"},{"$f":"COUNTIF(D47:$AL47,\"NE\")/$AV$1","v":{"v":0,"d":"0%"}},{"v":0,"d":"0%"}]
[null,null,"Réaliser que certains problèmes relèvent de situations additives, d’autres de situations multiplicatives, de partages ou de groupements.",{"$nulls":36},{"v":0,"d":"0%"},{"v":0,"d":"0%"},{"v":0,"d":"0%"},{"v":0,"d":"0%"},{"$f":"COUNTIF(D48:$AL48,\"NE\")/$AV$1","v":{"v":0,"d":"0%"}},{"v":0,"d":"0%"}]
[null,null,"Reconnaitre des formes dans des objets réels et les reproduire géométriquement.",{"$nulls":36},{"v":0,"d":"0%"},{"v":0,"d":"0%"},{"v":0,"d":"0%"},{"v":0,"d":"0%"},{"$f":"COUNTIF(D49:$AL49,\"NE\")/$AV$1","v":{"v":0,"d":"0%"}},{"v":0,"d":"0%"}]
[null,null,"RAISONNER",{"$f":"COUNTA(D50:D53)*10","v":0},{"$f":"COUNTA(E50:E53)*10","v":0},0,0,0,0,0,0,0,0,0,0,0,0,0,0,0,0,0,0,0,0,0,0,0,0,0,0,0,0,0,0,0]
[null,null,"Anticiper le résultat d’une manipulation, d’un calcul, ou d’une mesure.",{"$nulls":36},{"$f":"COUNTIF($D53:$AL53,$AU$1)/$AV$1","v":{"v":0,"d":"0%"}},{"$f":"COUNTIF($D53:$AL53,$AU$2)/$AV$1","v":{"v":0,"d":"0%"}},{"$f":"COUNTIF($D53:$AL53,$AU$3)/$AV$1","v":{"v":0,"d":"0%"}},{"$f":"COUNTIF($D53:$AL53,$AU$4)/$AV$1","v":{"v":0,"d":"0%"}},{"$f":"COUNTIF(D53:$AL53,\"NE\")/$AV$1","v":{"v":0,"d":"0%"}},{"$f":"AN53+(AO53*0.66)+(AP53*0.33)","v":{"v":0,"d":"0%"}}]
[null,null,"Raisonner sur des figures pour les reproduire avec des instruments.",{"$nulls":36},{"$f":"COUNTIF($D52:$AL52,$AU$1)/$AV$1","v":{"v":0,"d":"0%"}},{"$f":"COUNTIF($D52:$AL52,$AU$2)/$AV$1","v":{"v":0,"d":"0%"}},{"$f":"COUNTIF($D52:$AL52,$AU$3)/$AV$1","v":{"v":0,"d":"0%"}},{"$f":"COUNTIF($D52:$AL52,$AU$4)/$AV$1","v":{"v":0,"d":"0%"}},{"$f":"COUNTIF(D52:$AL52,\"NE\")/$AV$1","v":{"v":0,"d":"0%"}},{"$f":"AN52+(AO52*0.66)+(AP52*0.33)","v":{"v":0,"d":"0%"}}]
[null,null,"Tenir compte d’éléments divers (arguments d’autrui, résultats d’une expérience, sources internes ou externes à la classe, etc.) pour modifier son jugement.",{"$nulls":36},{"$f":"COUNTIF($D53:$AL53,$AU$1)/$AV$1","v":{"v":0,"d":"0%"}},{"$f":"COUNTIF($D53:$AL53,$AU$2)/$AV$1","v":{"v":0,"d":"0%"}},{"$f":"COUNTIF($D53:$AL53,$AU$3)/$AV$1","v":{"v":0,"d":"0%"}},{"$f":"COUNTIF($D53:$AL53,$AU$4)/$AV$1","v":{"v":0,"d":"0%"}},{"$f":"COUNTIF(D53:$AL53,\"NE\")/$AV$1","v":{"v":0,"d":"0%"}},{"$f":"AN53+(AO53*0.66)+(AP53*0.33)","v":{"v":0,"d":"0%"}}]
[null,null,"Prendre progressivement conscience de la nécessité et de l’intérêt de justifier ce que l’on affirme.",{"$nulls":36},{"v":0,"d":"0%"},{"v":0,"d":"0%"},{"v":0,"d":"0%"},{"v":0,"d":"0%"},{"$f":"COUNTIF(D54:$AL54,\"NE\")/$AV$1","v":{"v":0,"d":"0%"}},{"v":0,"d":"0%"}]
[null,null,"COMMUNIQUER",{"$f":"COUNTA(D55:D55)*10","v":0},{"$f":"COUNTA(E55:E55)*10","v":0},0,0,0,0,0,0,0,0,0,0,0,0,0,0,0,0,0,0,0,0,0,0,0,0,0,0,0,0,0,0,0]
[null,null,"Expliciter des démarches, argumenter des raisonnements.",{"$nulls":36},{"v":0,"d":"0%"},{"v":0,"d":"0%"},{"v":0,"d":"0%"},{"v":0,"d":"0%"},{"$f":"COUNTIF(D56:$AL56,\"NE\")/$AV$1","v":{"v":0,"d":"0%"}},{"v":0,"d":"0%"}]
[null,null,"PRATIQUE LA DEMARCHE SCIENTIFIQUE",{"$f":"COUNTA(D57)*10","v":0},{"$f":"COUNTA(E57)*10","v":0},0,0,0,0,0,0,0,0,0,0,0,0,0,0,0,0,0,0,0,0,0,0,0,0,0,0,0,0,0,0,0]
[null,null,"Pratiquer, avec l’aide des professeurs,une démarche d’investigation : questionnement, observation, expérience, description, raisonnement, conclusion.",{"$nulls":36},{"$f":"COUNTIF($D59:$AL59,$AU$1)/$AV$1","v":{"v":0,"d":"0%"}},{"$f":"COUNTIF($D59:$AL59,$AU$2)/$AV$1","v":{"v":0,"d":"0%"}},{"$f":"COUNTIF($D59:$AL59,$AU$3)/$AV$1","v":{"v":0,"d":"0%"}},{"$f":"COUNTIF($D59:$AL59,$AU$4)/$AV$1","v":{"v":0,"d":"0%"}},{"$f":"COUNTIF(D59:$AL59,\"NE\")/$AV$1","v":{"v":0,"d":"0%"}},{"$f":"AN59+(AO59*0.66)+(AP59*0.33)","v":{"v":0,"d":"0%"}}]
[null,null,"IMAGINER , REALISER",{"$f":"COUNTA(D59:D60)*10","v":0},{"$f":"COUNTA(E59:E60)*10","v":0},0,0,0,0,0,0,0,0,0,0,0,0,0,0,0,0,0,0,0,0,0,0,0,0,0,0,0,0,0,0,0]
[null,null,"Observer des objets simples et des situations d’activités de la vie quotidienne.",{"$nulls":36},{"v":0,"d":"0%"},{"v":0,"d":"0%"},{"v":0,"d":"0%"},{"v":0,"d":"0%"},{"$f":"COUNTIF(D60:$AL60,\"NE\")/$AV$1","v":{"v":0,"d":"0%"}},{"v":0,"d":"0%"}]
[null,null,"Imaginer et réaliser des objets simples et de petits montages.",{"$nulls":36},{"v":0,"d":"0%"},{"v":0,"d":"0%"},{"v":0,"d":"0%"},{"v":0,"d":"0%"},{"$f":"COUNTIF(D61:$AL61,\"NE\")/$AV$1","v":{"v":0,"d":"0%"}},{"v":0,"d":"0%"}]
[null,null,"S'APPROPRIER DES OUTILS ET DES METHODES",{"$f":"COUNTA(D62:D63)*10","v":0},{"$f":"COUNTA(E62:E63)*10","v":0},0,0,0,0,0,0,0,0,0,0,0,0,0,0,0,0,0,0,0,0,0,0,0,0,0,0,0,0,0,0,0]
[null,null,"Choisir ou utiliser le matériel adapté proposé pour mener une observation, effectuer une mesure, réaliser une expérience. ",{"$nulls":36},{"v":0,"d":"0%"},{"v":0,"d":"0%"},{"v":0,"d":"0%"},{"v":0,"d":"0%"},{"$f":"COUNTIF(D63:$AL63,\"NE\")/$AV$1","v":{"v":0,"d":"0%"}},{"v":0,"d":"0%"}]
[null,null,"Manipuler avec soin.",{"$nulls":36},{"v":0,"d":"0%"},{"v":0,"d":"0%"},{"v":0,"d":"0%"},{"v":0,"d":"0%"},{"$f":"COUNTIF(D64:$AL64,\"NE\")/$AV$1","v":{"v":0,"d":"0%"}},{"v":0,"d":"0%"}]
[null,null,"PRATIQUER DES LANGAGES",{"$f":"COUNTA(D65:D68)*10","v":0},{"$f":"COUNTA(E65:E68)*10","v":0},0,0,0,0,0,0,0,0,0,0,0,0,0,0,0,0,0,0,0,0,0,0,0,0,0,0,0,0,0,0,0]
[null,null,"Communiquer en français, à l’oral et à l’écrit,.",{"$nulls":36},{"v":0,"d":"0%"},{"v":0,"d":"0%"},{"v":0,"d":"0%"},{"v":0,"d":"0%"},{"$f":"COUNTIF(D66:$AL66,\"NE\")/$AV$1","v":{"v":0,"d":"0%"}},{"v":0,"d":"0%"}]
[null,null,"Lire et comprendre des textes documentaires illustrés.",{"$nulls":36},{"v":0,"d":"0%"},{"v":0,"d":"0%"},{"v":0,"d":"0%"},{"v":0,"d":"0%"},{"$f":"COUNTIF(D67:$AL67,\"NE\")/$AV$1","v":{"v":0,"d":"0%"}},{"v":0,"d":"0%"}]
[null,null,"Extraire d’un texte ou d’une ressource documentaire une information qui répond à un besoin, une question.",{"$nulls":36},{"v":0,"d":"0%"},{"v":0,"d":"0%"},{"v":0,"d":"0%"},{"v":0,"d":"0%"},{"$f":"COUNTIF(D68:$AL68,\"NE\")/$AV$1","v":{"v":0,"d":"0%"}},{"v":0,"d":"0%"}]
[null,null,"Restituer les résultats des observations sous forme orale ou d’écrits variés (notes, listes, dessins, voire tableaux).",{"$nulls":36},{"v":0,"d":"0%"},{"v":0,"d":"0%"},{"v":0,"d":"0%"},{"v":0,"d":"0%"},{"$f":"COUNTIF(D69:$AL69,\"NE\")/$AV$1","v":{"v":0,"d":"0%"}},{"v":0,"d":"0%"}]
[null,null,"ADOPTER UN COMPORTEMENT ETHIQUE ET RESPONSABLE",{"$f":"COUNTA(D70:D71)*10","v":0},{"$f":"COUNTA(E70:E71)*10","v":0},0,0,0,0,0,0,0,0,0,0,0,0,0,0,0,0,0,0,0,0,0,0,0,0,0,0,0,0,0,0,0]
[null,null,"Développer un comportement responsable vis-à-vis de l’environnement et de la santé.",{"$nulls":36},{"$f":"COUNTIF($D71:$AL71,$AU$1)/$AV$1","v":{"v":0,"d":"0%"}},{"$f":"COUNTIF($D71:$AL71,$AU$2)/$AV$1","v":{"v":0,"d":"0%"}},{"$f":"COUNTIF($D71:$AL71,$AU$3)/$AV$1","v":{"v":0,"d":"0%"}},{"$f":"COUNTIF($D71:$AL71,$AU$4)/$AV$1","v":{"v":0,"d":"0%"}},{"$f":"COUNTIF(D71:$AL71,\"NE\")/$AV$1","v":{"v":0,"d":"0%"}},{"$f":"AN71+(AO71*0.66)+(AP71*0.33)","v":{"v":0,"d":"0%"}}]
[null,null,"Mettre en pratique les premières notions d’éco gestion de l’environnement par des actions simples, gestion de déchets, du papier, économies d’eau et d’énergie (éclairage, chauffage...).",{"$nulls":36},{"$f":"COUNTIF($D74:$AL74,$AU$1)/$AV$1","v":{"v":0,"d":"0%"}},{"$f":"COUNTIF($D74:$AL74,$AU$2)/$AV$1","v":{"v":0,"d":"0%"}},{"$f":"COUNTIF($D74:$AL74,$AU$3)/$AV$1","v":{"v":0,"d":"0%"}},{"$f":"COUNTIF($D74:$AL74,$AU$4)/$AV$1","v":{"v":0,"d":"0%"}},{"$f":"COUNTIF(D74:$AL74,\"NE\")/$AV$1","v":{"v":0,"d":"0%"}},{"$f":"AN74+(AO74*0.66)+(AP74*0.33)","v":{"v":0,"d":"0%"}}]
[null,null,"SE SITUER DANS L'ESPACE ET DANS LE TEMPS",{"$f":"COUNTA(D73:D76)*10","v":0},{"$f":"COUNTA(E73:E76)*10","v":0},0,0,0,0,0,0,0,0,0,0,0,0,0,0,0,0,0,0,0,0,0,0,0,0,0,0,0,0,0,0,0]
[null,null,"Se repérer, s’orienter et se situer dans un espace géographique.",{"$nulls":36},{"v":0,"d":"0%"},{"v":0,"d":"0%"},{"v":0,"d":"0%"},{"v":0,"d":"0%"},{"$f":"COUNTIF(D74:$AL74,\"NE\")/$AV$1","v":{"v":0,"d":"0%"}},{"$f":"AN74+(AO74*0.66)+(AP74*0.33)","v":{"v":0,"d":"0%"}}]
[null,null,"Utiliser et produire des représentations de l’espace.",{"$nulls":36},{"$f":"COUNTIF($D75:$AL75,$AU$1)/$AV$1","v":{"v":0,"d":"0%"}},{"$f":"COUNTIF($D75:$AL75,$AU$2)/$AV$1","v":{"v":0,"d":"0%"}},{"$f":"COUNTIF($D75:$AL75,$AU$3)/$AV$1","v":{"v":0,"d":"0%"}},{"$f":"COUNTIF($D75:$AL75,$AU$4)/$AV$1","v":{"v":0,"d":"0%"}},{"$f":"COUNTIF(D75:$AL75,\"NE\")/$AV$1","v":{"v":0,"d":"0%"}},{"$f":"AN75+(AO75*0.66)+(AP75*0.33)","v":{"v":0,"d":"0%"}}]
[null,null,"Ordonner des évènements.",{"$nulls":36},{"v":0,"d":"0%"},{"v":0,"d":"0%"},{"v":0,"d":"0%"},{"v":0,"d":"0%"},{"$f":"COUNTIF(D76:$AL76,\"NE\")/$AV$1","v":{"v":0,"d":"0%"}},{"$f":"AN76+(AO76*0.66)+(AP76*0.33)","v":{"v":0,"d":"0%"}}]
[null,null," Mémoriser quelques repères chronologiques.",{"$nulls":36},{"v":0,"d":"0%"},{"v":0,"d":"0%"},{"v":0,"d":"0%"},{"v":0,"d":"0%"},{"$f":"COUNTIF(D77:$AL77,\"NE\")/$AV$1","v":{"v":0,"d":"0%"}},{"$f":"AN77+(AO77*0.66)+(AP77*0.33)","v":{"v":0,"d":"0%"}}]
[null,"LVE","COMPRENDRE L'ORAL",{"$f":"COUNTA(D78)*10","v":0},{"$f":"COUNTA(E78)*10","v":0},0,0,0,0,0,0,0,0,0,0,0,0,0,0,0,0,0,0,0,0,0,0,0,0,0,0,0,0,0,0,0]
[null,null,"Écouter et comprendre des messages oraux simples relevant de la vie quotidienne, des textes simples lus par le professeur.",{"$nulls":36},{"v":0,"d":"0%"},{"v":0,"d":"0%"},{"v":0,"d":"0%"},{"v":0,"d":"0%"},{"$f":"COUNTIF(D79:$AL79,\"NE\")/$AV$1","v":{"v":0,"d":"0%"}},{"$f":"AN79+(AO79*0.66)+(AP79*0.33)","v":{"v":0,"d":"0%"}}]
[null,null,"S'EXPRIMER ORALEMENT EN CONTINU",{"$f":"COUNTA(D80)*10","v":0},{"$f":"COUNTA(E80)*10","v":0},0,0,0,0,0,0,0,0,0,0,0,0,0,0,0,0,0,0,0,0,0,0,0,0,0,0,0,0,0,0,0]
[null,null,"En s’appuyant sur un modèle, réciter, se décrire, lire ou raconter.",{"$nulls":36},{"v":0,"d":"0%"},{"v":0,"d":"0%"},{"v":0,"d":"0%"},{"v":0,"d":"0%"},{"$f":"COUNTIF(D81:$AL81,\"NE\")/$AV$1","v":{"v":0,"d":"0%"}},{"$f":"AN81+(AO81*0.66)+(AP81*0.33)","v":{"v":0,"d":"0%"}}]
[null,null,"PRENDRE PAR A UNE CONVERSATION",{"$f":"COUNTA(D82)*10","v":0},{"$f":"COUNTA(E82)*10","v":0},0,0,0,0,0,0,0,0,0,0,0,0,0,0,0,0,0,0,0,0,0,0,0,0,0,0,0,0,0,0,0]
[null,null,"Participer à des échanges simples pour être entendu et compris..",{"$nulls":36},{"v":0,"d":"0%"},{"v":0,"d":"0%"},{"v":0,"d":"0%"},{"v":0,"d":"0%"},{"$f":"COUNTIF(D83:$AL83,\"NE\")/$AV$1","v":{"v":0,"d":"0%"}},{"$f":"AN83+(AO83*0.66)+(AP83*0.33)","v":{"v":0,"d":"0%"}}]
[null,null,"ASPECTS CULTURELS",{"$f":"COUNTA(D84)*10","v":0},{"$f":"COUNTA(E84)*10","v":0},0,0,0,0,0,0,0,0,0,0,0,0,0,0,0,0,0,0,0,0,0,0,0,0,0,0,0,0,0,0,0]
[null,null,"Identifier quelques grands repères culturels de l’environnement quotidien des élèves du même âge dans les pays ou régions étudiés.",{"$nulls":36},{"v":0,"d":"0%"},{"v":0,"d":"0%"},{"v":0,"d":"0%"},{"v":0,"d":"0%"},{"$f":"COUNTIF(D85:$AL85,\"NE\")/$AV$1","v":{"v":0,"d":"0%"}},{"$f":"AN85+(AO85*0.66)+(AP85*0.33)","v":{"v":0,"d":"0%"}}]
[null,"ARTS PLASTIQUES","EXPERIMENTER, PRODUIRE, CRÉER",{"$f":"COUNTA(D86:D89)*10","v":0},{"$f":"COUNTA(E86:E89)*10","v":0},0,0,0,0,0,0,0,0,0,0,0,0,0,0,0,0,0,0,0,0,0,0,0,0,0,0,0,0,0,0,0]
[null,null,"S’approprier par les sens les éléments du langage plastique : matière, support, couleur… ",{"$nulls":36},{"v":0,"d":"0%"},{"v":0,"d":"0%"},{"v":0,"d":"0%"},{"v":0,"d":"0%"},{"$f":"COUNTIF(D87:$AL87,\"NE\")/$AV$1","v":{"v":0,"d":"0%"}},{"$f":"AN87+(AO87*0.66)+(AP87*0.33)","v":{"v":0,"d":"0%"}}]
[null,null,"Observer les effets produits par ses gestes, par les outils utilisés.",{"$nulls":36},{"v":0,"d":"0%"},{"v":0,"d":"0%"},{"v":0,"d":"0%"},{"v":0,"d":"0%"},{"$f":"COUNTIF(D88:$AL88,\"NE\")/$AV$1","v":{"v":0,"d":"0%"}},{"$f":"AN88+(AO88*0.66)+(AP88*0.33)","v":{"v":0,"d":"0%"}}]
[null,null,"Tirer parti de trouvailles fortuites, saisir les effets du hasard.",{"$nulls":36},{"v":0,"d":"0%"},{"v":0,"d":"0%"},{"v":0,"d":"0%"},{"v":0,"d":"0%"},{"$f":"COUNTIF(D89:$AL89,\"NE\")/$AV$1","v":{"v":0,"d":"0%"}},{"$f":"AN89+(AO89*0.66)+(AP89*0.33)","v":{"v":0,"d":"0%"}}]
[null,null,"Représenter le monde environnant ou donner forme à son imaginaire en explorant la diversité des domaines (dessin, collage, modelage, sculpture, photographie …).",{"$nulls":36},{"v":0,"d":"0%"},{"v":0,"d":"0%"},{"v":0,"d":"0%"},{"v":0,"d":"0%"},{"$f":"COUNTIF(D90:$AL90,\"NE\")/$AV$1","v":{"v":0,"d":"0%"}},{"$f":"AN90+(AO90*0.66)+(AP90*0.33)","v":{"v":0,"d":"0%"}}]
[null,null,"METTRE EN OEUVRE UN PROJET ARTISTIQUE",{"$f":"COUNTA(D91:D93)*10","v":0},{"$f":"COUNTA(E91:E93)*10","v":0},0,0,0,0,0,0,0,0,0,0,0,0,0,0,0,0,0,0,0,0,0,0,0,0,0,0,0,0,0,0,0]
[null,null,"Respecter l’espace, les outils et les matériaux partagés.",{"$nulls":36},{"v":0,"d":"0%"},{"v":0,"d":"0%"},{"v":0,"d":"0%"},{"v":0,"d":"0%"},{"$f":"COUNTIF(D92:$AL92,\"NE\")/$AV$1","v":{"v":0,"d":"0%"}},{"$f":"AN92+(AO92*0.66)+(AP92*0.33)","v":{"v":0,"d":"0%"}}]
[null,null,"Mener à terme une production individuelle dans le cadre d’un projet accompagné par le professeur.",{"$nulls":36},{"v":0,"d":"0%"},{"v":0,"d":"0%"},{"v":0,"d":"0%"},{"v":0,"d":"0%"},{"$f":"COUNTIF(D93:$AL93,\"NE\")/$AV$1","v":{"v":0,"d":"0%"}},{"$f":"AN93+(AO93*0.66)+(AP93*0.33)","v":{"v":0,"d":"0%"}}]
[null,null,"Montrer sans réticence ses productions et regarder celles des autres.",{"$nulls":36},{"v":0,"d":"0%"},{"v":0,"d":"0%"},{"v":0,"d":"0%"},{"v":0,"d":"0%"},{"$f":"COUNTIF(D94:$AL94,\"NE\")/$AV$1","v":{"v":0,"d":"0%"}},{"$f":"AN94+(AO94*0.66)+(AP94*0.33)","v":{"v":0,"d":"0%"}}]
[null,null,"S'EXPRIMER, ANALYSER SA PRATIQUE",{"$f":"COUNTA(D95:D97)*10","v":0},{"$f":"COUNTA(E95:E97)*10","v":0},0,0,0,0,0,0,0,0,0,0,0,0,0,0,0,0,0,0,0,0,0,0,0,0,0,0,0,0,0,0,0]
[null,null,"Prendre la parole devant un groupe pour partager ses trouvailles, s’intéresser à celles découvertes dans des œuvres d’art.",{"$nulls":36},{"v":0,"d":"0%"},{"v":0,"d":"0%"},{"v":0,"d":"0%"},{"v":0,"d":"0%"},{"$f":"COUNTIF(D96:$AL96,\"NE\")/$AV$1","v":{"v":0,"d":"0%"}},{"$f":"AN96+(AO96*0.66)+(AP96*0.33)","v":{"v":0,"d":"0%"}}]
[null,null,"Formuler ses émotions, entendre et respecter celles des autres.",{"$nulls":36},{"v":0,"d":"0%"},{"v":0,"d":"0%"},{"v":0,"d":"0%"},{"v":0,"d":"0%"},{"$f":"COUNTIF(D97:$AL97,\"NE\")/$AV$1","v":{"v":0,"d":"0%"}},{"$f":"AN97+(AO97*0.66)+(AP97*0.33)","v":{"v":0,"d":"0%"}}]
[null,null,"Repérer les éléments du langage plastique dans une production : couleurs, formes, matières, support… ",{"$nulls":36},{"v":0,"d":"0%"},{"v":0,"d":"0%"},{"v":0,"d":"0%"},{"v":0,"d":"0%"},{"$f":"COUNTIF(D98:$AL98,\"NE\")/$AV$1","v":{"v":0,"d":"0%"}},{"$f":"AN98+(AO98*0.66)+(AP98*0.33)","v":{"v":0,"d":"0%"}}]
[null,null,"SE REPERER DANS LES DOMAINES LIES AUX ARTS PLASTIQUES",{"$f":"COUNTA(D99:D102)*10","v":0},{"$f":"COUNTA(E99:E102)*10","v":0},0,0,0,0,0,0,0,0,0,0,0,0,0,0,0,0,0,0,0,0,0,0,0,0,0,0,0,0,0,0,0]
[null,null,"Effectuer des choix parmi les images rencontrées, établir un premier lien entre son univers visuel et la culture artistique.",{"$nulls":36},{"v":0,"d":"0%"},{"v":0,"d":"0%"},{"v":0,"d":"0%"},{"v":0,"d":"0%"},{"$f":"COUNTIF(D100:$AL100,\"NE\")/$AV$1","v":{"v":0,"d":"0%"}},{"$f":"AN100+(AO100*0.66)+(AP100*0.33)","v":{"v":0,"d":"0%"}}]
[null,null,"Exprimer ses émotions lors de la rencontre avec des œuvres d’art, manifester son intérêt pour la rencontre directe avec des œuvres. ",{"$nulls":36},{"v":0,"d":"0%"},{"v":0,"d":"0%"},{"v":0,"d":"0%"},{"v":0,"d":"0%"},{"$f":"COUNTIF(D101:$AL101,\"NE\")/$AV$1","v":{"v":0,"d":"0%"}},{"$f":"AN101+(AO101*0.66)+(AP101*0.33)","v":{"v":0,"d":"0%"}}]
[null,null,"S’approprier quelques œuvres de domaines et d’époques variés appartenant au patrimoine national et mondial.",{"$nulls":36},{"v":0,"d":"0%"},{"v":0,"d":"0%"},{"v":0,"d":"0%"},{"v":0,"d":"0%"},{"$f":"COUNTIF(D102:$AL102,\"NE\")/$AV$1","v":{"v":0,"d":"0%"}},{"$f":"AN102+(AO102*0.66)+(AP102*0.33)","v":{"v":0,"d":"0%"}}]
[null,null,"S’ouvrir à la diversité des pratiques et des cultures artistiques.",{"$nulls":36},{"v":0,"d":"0%"},{"v":0,"d":"0%"},{"v":0,"d":"0%"},{"v":0,"d":"0%"},{"$f":"COUNTIF(D103:$AL103,\"NE\")/$AV$1","v":{"v":0,"d":"0%"}},{"$f":"AN103+(AO103*0.66)+(AP103*0.33)","v":{"v":0,"d":"0%"}}]
[null,"EDUCATION MUSICALE","CHANTER",{"$f":"COUNTA(D104:D105)*10","v":0},{"$f":"COUNTA(E104:E105)*10","v":0},0,0,0,0,0,0,0,0,0,0,0,0,0,0,0,0,0,0,0,0,0,0,0,0,0,0,0,0,0,0,0]
[null,null,"Chanter une mélodie simple avec une intonation juste, chanter une comptine ou un chant par imitation.",{"$nulls":36},{"v":0,"d":"0%"},{"v":0,"d":"0%"},{"v":0,"d":"0%"},{"v":0,"d":"0%"},{"$f":"COUNTIF(D105:$AL105,\"NE\")/$AV$1","v":{"v":0,"d":"0%"}},{"$f":"AN105+(AO105*0.66)+(AP105*0.33)","v":{"v":0,"d":"0%"}}]
[null,null,"Interpréter un chant avec expressivité.",{"$nulls":36},{"v":0,"d":"0%"},{"v":0,"d":"0%"},{"v":0,"d":"0%"},{"v":0,"d":"0%"},{"$f":"COUNTIF(D106:$AL106,\"NE\")/$AV$1","v":{"v":0,"d":"0%"}},{"$f":"AN106+(AO106*0.66)+(AP106*0.33)","v":{"v":0,"d":"0%"}}]
[null,null,"ECOUTER, COMPARER",{"$f":"COUNTA(D107:D108)*10","v":0},{"$f":"COUNTA(E107:E108)*10","v":0},0,0,0,0,0,0,0,0,0,0,0,0,0,0,0,0,0,0,0,0,0,0,0,0,0,0,0,0,0,0,0]
[null,null,"Décrire et comparer des éléments sonores. ",{"$nulls":36},{"v":0,"d":"0%"},{"v":0,"d":"0%"},{"v":0,"d":"0%"},{"v":0,"d":"0%"},{"$f":"COUNTIF(D108:$AL108,\"NE\")/$AV$1","v":{"v":0,"d":"0%"}},{"$f":"AN108+(AO108*0.66)+(AP108*0.33)","v":{"v":0,"d":"0%"}}]
[null,null,"Comparer des musiques et identifier des ressemblances et des différences.",{"$nulls":36},{"v":0,"d":"0%"},{"v":0,"d":"0%"},{"v":0,"d":"0%"},{"v":0,"d":"0%"},{"$f":"COUNTIF(D109:$AL109,\"NE\")/$AV$1","v":{"v":0,"d":"0%"}},{"$f":"AN109+(AO109*0.66)+(AP109*0.33)","v":{"v":0,"d":"0%"}}]
[null,null,"EXPLORER, IMAGINER",{"$f":"COUNTA(D110:D111)*10","v":0},{"$f":"COUNTA(E110:E111)*10","v":0},0,0,0,0,0,0,0,0,0,0,0,0,0,0,0,0,0,0,0,0,0,0,0,0,0,0,0,0,0,0,0]
[null,null,"Imaginer des représentations graphiques ou corporelles de la musique.",{"$nulls":36},{"v":0,"d":"0%"},{"v":0,"d":"0%"},{"v":0,"d":"0%"},{"v":0,"d":"0%"},{"$f":"COUNTIF(D111:$AL111,\"NE\")/$AV$1","v":{"v":0,"d":"0%"}},{"$f":"AN111+(AO111*0.66)+(AP111*0.33)","v":{"v":0,"d":"0%"}}]
[null,null,"Inventer une organisation simple à partir de différents éléments sonores. ",{"$nulls":36},{"v":0,"d":"0%"},{"v":0,"d":"0%"},{"v":0,"d":"0%"},{"v":0,"d":"0%"},{"$f":"COUNTIF(D112:$AL112,\"NE\")/$AV$1","v":{"v":0,"d":"0%"}},{"$f":"AN112+(AO112*0.66)+(AP112*0.33)","v":{"v":0,"d":"0%"}}]
[null,null,"ECHANGER, PARTAGER",{"$f":"COUNTA(D113:D114)*10","v":0},{"$f":"COUNTA(E113:E114)*10","v":0},0,0,0,0,0,0,0,0,0,0,0,0,0,0,0,0,0,0,0,0,0,0,0,0,0,0,0,0,0,0,0]
[null,null,"Exprimer ses émotions, ses sentiments et ses préférences.",{"$nulls":36},{"v":0,"d":"0%"},{"v":0,"d":"0%"},{"v":0,"d":"0%"},{"v":0,"d":"0%"},{"$f":"COUNTIF(D114:$AL114,\"NE\")/$AV$1","v":{"v":0,"d":"0%"}},{"$f":"AN114+(AO114*0.66)+(AP114*0.33)","v":{"v":0,"d":"0%"}}]
[null,null,"Écouter et respecter l’avis des autres et l’expression de leur sensibilité.",{"$nulls":36},{"$f":"COUNTIF($D132:$AL132,$AU$1)/$AV$1","v":{"v":0,"d":"0%"}},{"$f":"COUNTIF($D132:$AL132,$AU$2)/$AV$1","v":{"v":0,"d":"0%"}},{"$f":"COUNTIF($D132:$AL132,$AU$3)/$AV$1","v":{"v":0,"d":"0%"}},{"$f":"COUNTIF($D132:$AL132,$AU$4)/$AV$1","v":{"v":0,"d":"0%"}},{"$f":"COUNTIF(D132:$AL132,\"NE\")/$AV$1","v":{"v":0,"d":"0%"}},{"$f":"AN132+(AO132*0.66)+(AP132*0.33)","v":{"v":0,"d":"0%"}}]
[null,"EPS","DEVELOPPER SA MOTRICITE, LE LANGAGE DU CORPS ",{"$f":"COUNTA(D116:D118)*10","v":0},0,0,0,0,0,0,0,0,0,0,0,0,0,0,0,0,0,0,0,0,0,0,0,0,0,{"$f":"COUNTA(AD116:AD118)*10","v":0},{"$f":"COUNTA(AE116:AE118)*10","v":0},0,0,0,0,0]
[null,null,"Prendre conscience des différentes ressources à mobiliser pour agir avec son corps. ",{"$nulls":36},{"$f":"COUNTIF($D134:$AL134,$AU$1)/$AV$1","v":{"v":0,"d":"0%"}},{"$f":"COUNTIF($D134:$AL134,$AU$2)/$AV$1","v":{"v":0,"d":"0%"}},{"$f":"COUNTIF($D134:$AL134,$AU$3)/$AV$1","v":{"v":0,"d":"0%"}},{"$f":"COUNTIF($D134:$AL134,$AU$4)/$AV$1","v":{"v":0,"d":"0%"}},{"$f":"COUNTIF(D134:$AL134,\"NE\")/$AV$1","v":{"v":0,"d":"0%"}},{"$f":"AN134+(AO134*0.66)+(AP134*0.33)","v":{"v":0,"d":"0%"}}]
[null,null,"Adapter sa motricité à des environnements variés.",{"$nulls":36},{"v":0,"d":"0%"},{"v":0,"d":"0%"},{"v":0,"d":"0%"},{"v":0,"d":"0%"},{"$f":"COUNTIF(D135:$AL135,\"NE\")/$AV$1","v":{"v":0,"d":"0%"}},{"v":0,"d":"0%"}]
[null,null,"S’exprimer par son corps et accepter de se montrer à autrui.",{"$nulls":36},{"v":0,"d":"0%"},{"v":0,"d":"0%"},{"v":0,"d":"0%"},{"v":0,"d":"0%"},{"$f":"COUNTIF(D136:$AL136,\"NE\")/$AV$1","v":{"v":0,"d":"0%"}},{"v":0,"d":"0%"}]
[null,null,"S’APPROPRIER LES MÉTHODES ET OUTILS POUR APPRENDRE",{"$f":"COUNTA(D120:D121)*10","v":0},0,0,0,0,0,0,0,0,0,0,0,0,0,0,0,0,0,0,0,0,0,0,0,0,0,{"$f":"COUNTA(AD120:AD121)*10","v":0},{"$f":"COUNTA(AE120:AE121)*10","v":0},0,0,0,0,0]
[null,null,"Apprendre par essai-erreur en utilisant les effets de son action.",{"$nulls":36},{"v":0,"d":"0%"},{"v":0,"d":"0%"},{"v":0,"d":"0%"},{"v":0,"d":"0%"},{"$f":"COUNTIF(D138:$AL138,\"NE\")/$AV$1","v":{"v":0,"d":"0%"}},{"v":0,"d":"0%"}]
[null,null,"Apprendre à planifier son action avant de la réaliser.",{"$nulls":36},{"v":0,"d":"0%"},{"v":0,"d":"0%"},{"v":0,"d":"0%"},{"v":0,"d":"0%"},{"$f":"COUNTIF(D139:$AL139,\"NE\")/$AV$1","v":{"v":0,"d":"0%"}},{"v":0,"d":"0%"}]
[null,null,"PARTAGER DES RÈGLES, ASSUMER DES RÔLES ",{"$f":"COUNTA(D123:D125)*10","v":0},0,0,0,0,0,0,0,0,0,0,0,0,0,0,0,0,0,0,0,0,0,0,0,0,0,{"$f":"COUNTA(AD123:AD125)*10","v":0},{"$f":"COUNTA(AE123:AE125)*10","v":0},0,0,0,0,0]
[null,null,"Assumer les rôles spécifiques aux différentes APSA (joueur, coach, arbitre, juge, médiateur, organisateur…). ",{"$nulls":36},{"v":0,"d":"0%"},{"v":0,"d":"0%"},{"v":0,"d":"0%"},{"v":0,"d":"0%"},{"$f":"COUNTIF(D141:$AL141,\"NE\")/$AV$1","v":{"v":0,"d":"0%"}},{"v":0,"d":"0%"}]
[null,null,"Élaborer, respecter et faire respecter règles et règlements.",{"$nulls":36},{"v":0,"d":"0%"},{"v":0,"d":"0%"},{"v":0,"d":"0%"},{"v":0,"d":"0%"},{"$f":"COUNTIF(D142:$AL142,\"NE\")/$AV$1","v":{"v":0,"d":"0%"}},{"v":0,"d":"0%"}]
[null,null,"Accepter et prendre en considération toutes les différences interindividuelles au sein d’un groupe.",{"$nulls":36},{"v":0,"d":"0%"},{"v":0,"d":"0%"},{"v":0,"d":"0%"},{"v":0,"d":"0%"},{"$f":"COUNTIF(D143:$AL143,\"NE\")/$AV$1","v":{"v":0,"d":"0%"}},{"v":0,"d":"0%"}]
[null,null,"ENTRETENIR SA SANTÉ ",{"$f":"COUNTA(D127:D128)*10","v":0},0,0,0,0,0,0,0,0,0,0,0,0,0,0,0,0,0,0,0,0,0,0,0,0,0,{"$f":"COUNTA(AD127:AD128)*10","v":0},{"$f":"COUNTA(AE127:AE128)*10","v":0},0,0,0,0,0]
[null,null,"Découvrir les principes d’une bonne hygiène de vie, à des fins de santé et de bien être.",{"$nulls":36},{"v":0,"d":"0%"},{"v":0,"d":"0%"},{"v":0,"d":"0%"},{"v":0,"d":"0%"},{"$f":"COUNTIF(D145:$AL145,\"NE\")/$AV$1","v":{"v":0,"d":"0%"}},{"v":0,"d":"0%"}]
[null,null,"Ne pas se mettre en danger par un engagement physique dont l’intensité excède ses qualités physiques.",{"$nulls":36},{"v":0,"d":"0%"},{"v":0,"d":"0%"},{"v":0,"d":"0%"},{"v":0,"d":"0%"},{"$f":"COUNTIF(D146:$AL146,\"NE\")/$AV$1","v":{"v":0,"d":"0%"}},{"v":0,"d":"0%"}]
[null,null,"S’APPROPRIER UNE CULTURE PHYSIQUE SPORTIVE ET ARTISTIQUE ",{"$f":"COUNTA(D130:D131)*10","v":0},0,0,0,0,0,0,0,0,0,0,0,0,0,0,0,0,0,0,0,0,0,0,0,0,0,{"$f":"COUNTA(AD130:AD131)*10","v":0},{"$f":"COUNTA(AE130:AE131)*10","v":0},0,0,0,0,0]
[null,null,"Découvrir la variété des activités et des spectacles sportifs.",{"$nulls":36},{"v":0,"d":"0%"},{"v":0,"d":"0%"},{"v":0,"d":"0%"},{"v":0,"d":"0%"},{"$f":"COUNTIF(D148:$AL148,\"NE\")/$AV$1","v":{"v":0,"d":"0%"}},{"v":0,"d":"0%"}]
[null,null,"Exprimer des intentions et des émotions par son corps dans un projet artistique individuel ou collectif.",{"$nulls":36},{"v":0,"d":"0%"},{"v":0,"d":"0%"},{"v":0,"d":"0%"},{"v":0,"d":"0%"},{"$f":"COUNTIF(D149:$AL149,\"NE\")/$AV$1","v":{"v":0,"d":"0%"}},{"v":0,"d":"0%"}]
[null,"EMC","ENSEIGNEMENT CIVIQUE ET MORAL",{"$f":"COUNTA(D133:D138)*10","v":0},{"$f":"COUNTA(E133:E138)*10","v":0},0,0,0,0,0,0,0,0,0,0,0,0,0,0,0,0,0,0,0,0,0,0,0,0,0,0,0,0,0,0,0]
[null,null," Identifier et partager des émotions, des sentiments dans des situations et à propos d'objets diversifiés.",{"$nulls":36},{"v":0,"d":"0%"},{"v":0,"d":"0%"},{"v":0,"d":"0%"},{"v":0,"d":"0%"},{"$f":"COUNTIF(D134:$AL134,\"NE\")/$AV$1","v":{"v":0,"d":"0%"}},{"$f":"AN134+(AO134*0.66)+(AP134*0.33)","v":{"v":0,"d":"0%"}}]
[null,null,"Se situer et s'exprimer en respectant les codes de la communication orale, les règles de l'échange et le statut de l'interlocuteur.",{"$nulls":36},{"v":0,"d":"0%"},{"v":0,"d":"0%"},{"v":0,"d":"0%"},{"v":0,"d":"0%"},{"$f":"COUNTIF(D135:$AL135,\"NE\")/$AV$1","v":{"v":0,"d":"0%"}},{"v":0,"d":"0%"}]
[null,null,"Prendre soin de soi et des autres.",{"$nulls":36},{"v":0,"d":"0%"},{"v":0,"d":"0%"},{"v":0,"d":"0%"},{"v":0,"d":"0%"},{"$f":"COUNTIF(D136:$AL136,\"NE\")/$AV$1","v":{"v":0,"d":"0%"}},{"v":0,"d":"0%"}]
[null,null,"Accepter les différences. ",{"$nulls":36},{"v":0,"d":"0%"},{"v":0,"d":"0%"},{"v":0,"d":"0%"},{"v":0,"d":"0%"},{"$f":"COUNTIF(D137:$AL137,\"NE\")/$AV$1","v":{"v":0,"d":"0%"}},{"v":0,"d":"0%"}]
[null,null,"Identifier les symboles de la République présents dans l'école. ",{"$nulls":36},{"v":0,"d":"0%"},{"v":0,"d":"0%"},{"v":0,"d":"0%"},{"v":0,"d":"0%"},{"$f":"COUNTIF(D138:$AL138,\"NE\")/$AV$1","v":{"v":0,"d":"0%"}},{"v":0,"d":"0%"}]
[null,null,"Apprendre à coopérer. ",{"$nulls":36},{"v":0,"d":"0%"},{"v":0,"d":"0%"},{"v":0,"d":"0%"},{"v":0,"d":"0%"},{"$f":"COUNTIF(D139:$AL139,\"NE\")/$AV$1","v":{"v":0,"d":"0%"}},{"v":0,"d":"0%"}]

{"sheet":"Formules","index":5,"n_rows":800,"n_cols":37,"rows_kept":800,"hidden":true}
["notes"]
["appreciations",null,{"$f":"IF(INDEX(appreciations1,Nenfant,1)=\"\",0,INDEX(appreciations1,Nenfant,1))","v":{"$error":"#NAME?"}},{"$f":"IF(INDEX(appreciations2,Nenfant,1)=\"\",0,INDEX(appreciations2,Nenfant,1))","v":{"$error":"#NAME?"}},{"$f":"IF(INDEX(appreciations3,Nenfant,1)=\"\",0,INDEX(appreciations3,Nenfant,1))","v":{"$error":"#NAME?"}},{"$f":"IF(INDEX(appreciations4,Nenfant,1)=\"\",0,INDEX(appreciations4,Nenfant,1))","v":{"$error":"#NAME?"}},{"$f":"IF(INDEX(appreciations5,Nenfant,1)=\"\",0,INDEX(appreciations5,Nenfant,1))","v":{"$error":"#NAME?"}}]
["absences",null,{"$f":"IF(INDEX(absences1,Nenfant,1)=\"\",0,INDEX(absences1,Nenfant,1))","v":{"$error":"#NAME?"}},{"$f":"IF(INDEX(absences2,Nenfant,1)=\"\",0,INDEX(absences2,Nenfant,1))","v":{"$error":"#NAME?"}},{"$f":"IF(INDEX(absences3,Nenfant,1)=\"\",0,INDEX(absences3,Nenfant,1))","v":{"$error":"#NAME?"}},{"$f":"IF(INDEX(absences4,Nenfant,1)=\"\",0,INDEX(absences4,Nenfant,1))","v":{"$error":"#NAME?"}},{"$f":"IF(INDEX(absences5,Nenfant,1)=\"\",0,INDEX(absences5,Nenfant,1))","v":{"$error":"#NAME?"}}]
[]
[5,null,"A",1,"A",{"$f":"Renseignements!I20","v":0}]
[6,null,"B",2,"AR",{"$f":"Renseignements!J20","v":0}]
[7,null,"C",3,"ECA",{"$f":"Renseignements!K20","v":0}]
[8,null,"D",4,"NA",{"$f":"Renseignements!L20","v":0}]
[9,null,"NE","NE","NE",{"$f":"Renseignements!M20","v":0}]
[10]
[11]
[12]
[13]
[14,{"$nulls":3},{"$f":"IF(G14<>0,G14,(IF(F14<>0,F14,0)))","v":0},{"$nulls":3},{"$f":"COUNTIF($G15:G18,\"X\")","v":0},{"$f":"COUNTIF($H15:$H18,\"X\")","v":0},{"$f":"COUNTIF($I15:$I18,\"X\")","v":0},{"$f":"COUNTIF($J15:$J18,\"X\")","v":0},null,{"$f":"COUNTIF($G15:L18,\"X\")","v":0},{"$f":"COUNTIF($H15:$H18,\"X\")","v":0},{"$f":"COUNTIF($I15:$I18,\"X\")","v":0},{"$f":"COUNTIF($J15:$J18,\"X\")","v":0},null,{"$f":"COUNTIF($G15:Q18,\"X\")","v":0},{"$f":"COUNTIF($H15:$H18,\"X\")","v":0},{"$f":"COUNTIF($I15:$I18,\"X\")","v":0},{"$f":"COUNTIF($J15:$J18,\"X\")","v":0},null,{"$f":"COUNTIF($G15:V18,\"X\")","v":0},{"$f":"COUNTIF($H15:$H18,\"X\")","v":0},{"$f":"COUNTIF($I15:$I18,\"X\")","v":0},{"$f":"COUNTIF(AA15:AA18,\"X\")","v":0},{"$f":"Programmation!M5","v":0},{"$f":"COUNTIF($G15:AA18,\"X\")","v":0},{"$f":"COUNTIF($H15:$H18,\"X\")","v":0},{"$f":"COUNTIF($I15:$I18,\"X\")","v":0},{"$f":"COUNTIF($J15:$J18,\"X\")","v":0},null,{"$f":"COUNTIF($G15:AF18,\"X\")","v":0},{"$f":"COUNTIF($H15:$H18,\"X\")","v":0},{"$f":"COUNTIF($I15:$I18,\"X\")","v":0},{"$f":"COUNTIF($J15:$J18,\"X\")","v":0}]
[15,{"$nulls":7},{"$f":"IF(INDEX(periode1,NEVAL,Nenfant)=\"D\",\"X\",\"\")","v":{"$error":"#NAME?"}},{"$f":"IF(INDEX(periode1,NEVAL,Nenfant)=\"C\",\"X\",\"\")","v":{"$error":"#NAME?"}},{"$f":"IF(INDEX(periode1,NEVAL,Nenfant)=\"B\",\"X\",\"\")","v":{"$error":"#NAME?"}},{"$f":"IF(INDEX(periode1,NEVAL,Nenfant)=\"A\",\"X\",\"\")","v":{"$error":"#NAME?"}},null,{"$f":"IF(INDEX(periode2,NEVAL,Nenfant)=\"D\",\"X\",\"\")","v":{"$error":"#NAME?"}},{"$f":"IF(INDEX(periode2,NEVAL,Nenfant)=\"C\",\"X\",\"\")","v":{"$error":"#NAME?"}},{"$f":"IF(INDEX(periode2,NEVAL,Nenfant)=\"B\",\"X\",\"\")","v":{"$error":"#NAME?"}},{"$f":"IF(INDEX(periode2,NEVAL,Nenfant)=\"A\",\"X\",\"\")","v":{"$error":"#NAME?"}},null,{"$f":"IF(INDEX(periode3,NEVAL,Nenfant)=\"D\",\"X\",\"\")","v":{"$error":"#NAME?"}},{"$f":"IF(INDEX(periode3,NEVAL,Nenfant)=\"C\",\"X\",\"\")","v":{"$error":"#NAME?"}},{"$f":"IF(INDEX(periode3,NEVAL,Nenfant)=\"B\",\"X\",\"\")","v":{"$error":"#NAME?"}},{"$f":"IF(INDEX(periode3,NEVAL,Nenfant)=\"A\",\"X\",\"\")","v":{"$error":"#NAME?"}},null,{"$f":"IF(INDEX(periode4,NEVAL,Nenfant)=\"D\",\"X\",\"\")","v":{"$error":"#NAME?"}},{"$f":"IF(INDEX(periode4,NEVAL,Nenfant)=\"C\",\"X\",\"\")","v":{"$error":"#NAME?"}},{"$f":"IF(INDEX(periode4,NEVAL,Nenfant)=\"B\",\"X\",\"\")","v":{"$error":"#NAME?"}},{"$f":"IF(INDEX(periode4,NEVAL,Nenfant)=\"A\",\"X\",\"\")","v":{"$error":"#NAME?"}},null,{"$f":"IF(INDEX(periode5,NEVAL,Nenfant)=\"D\",\"X\",\"\")","v":{"$error":"#NAME?"}},{"$f":"IF(INDEX(periode5,NEVAL,Nenfant)=\"C\",\"X\",\"\")","v":{"$error":"#NAME?"}},{"$f":"IF(INDEX(periode5,NEVAL,Nenfant)=\"B\",\"X\",\"\")","v":{"$error":"#NAME?"}},{"$f":"IF(INDEX(periode5,NEVAL,Nenfant)=\"A\",\"X\",\"\")","v":{"$error":"#NAME?"}},null,{"$f":"IF(INDEX(periode6,NEVAL,Nenfant)=\"D\",\"X\",\"\")","v":{"$error":"#NAME?"}},{"$f":"IF(INDEX(periode6,NEVAL,Nenfant)=\"C\",\"X\",\"\")","v":{"$error":"#NAME?"}},{"$f":"IF(INDEX(periode6,NEVAL,Nenfant)=\"B\",\"X\",\"\")","v":{"$error":"#NAME?"}},{"$f":"IF(INDEX(periode6,NEVAL,Nenfant)=\"A\",\"X\",\"\")","v":{"$error":"#NAME?"}}]
[16,{"$nulls":7},{"$f":"IF(INDEX(periode1,NEVAL,Nenfant)=\"D\",\"X\",\"\")","v":{"$error":"#NAME?"}},{"$f":"IF(INDEX(periode1,NEVAL,Nenfant)=\"C\",\"X\",\"\")","v":{"$error":"#NAME?"}},{"$f":"IF(INDEX(periode1,NEVAL,Nenfant)=\"B\",\"X\",\"\")","v":{"$error":"#NAME?"}},{"$f":"IF(INDEX(periode1,NEVAL,Nenfant)=\"A\",\"X\",\"\")","v":{"$error":"#NAME?"}},null,{"$f":"IF(INDEX(periode2,NEVAL,Nenfant)=\"D\",\"X\",\"\")","v":{"$error":"#NAME?"}},{"$f":"IF(INDEX(periode2,NEVAL,Nenfant)=\"C\",\"X\",\"\")","v":{"$error":"#NAME?"}},{"$f":"IF(INDEX(periode2,NEVAL,Nenfant)=\"B\",\"X\",\"\")","v":{"$error":"#NAME?"}},{"$f":"IF(INDEX(periode2,NEVAL,Nenfant)=\"A\",\"X\",\"\")","v":{"$error":"#NAME?"}},null,{"$f":"IF(INDEX(periode3,NEVAL,Nenfant)=\"D\",\"X\",\"\")","v":{"$error":"#NAME?"}},{"$f":"IF(INDEX(periode3,NEVAL,Nenfant)=\"C\",\"X\",\"\")","v":{"$error":"#NAME?"}},{"$f":"IF(INDEX(periode3,NEVAL,Nenfant)=\"B\",\"X\",\"\")","v":{"$error":"#NAME?"}},{"$f":"IF(INDEX(periode3,NEVAL,Nenfant)=\"A\",\"X\",\"\")","v":{"$error":"#NAME?"}},null,{"$f":"IF(INDEX(periode4,NEVAL,Nenfant)=\"D\",\"X\",\"\")","v":{"$error":"#NAME?"}},{"$f":"IF(INDEX(periode4,NEVAL,Nenfant)=\"C\",\"X\",\"\")","v":{"$error":"#NAME?"}},{"$f":"IF(INDEX(periode4,NEVAL,Nenfant)=\"B\",\"X\",\"\")","v":{"$error":"#NAME?"}},{"$f":"IF(INDEX(periode4,NEVAL,Nenfant)=\"A\",\"X\",\"\")","v":{"$error":"#NAME?"}},null,{"$f":"IF(INDEX(periode5,NEVAL,Nenfant)=\"D\",\"X\",\"\")","v":{"$error":"#NAME?"}},{"$f":"IF(INDEX(periode5,NEVAL,Nenfant)=\"C\",\"X\",\"\")","v":{"$error":"#NAME?"}},{"$f":"IF(INDEX(periode5,NEVAL,Nenfant)=\"B\",\"X\",\"\")","v":{"$error":"#NAME?"}},{"$f":"IF(INDEX(periode5,NEVAL,Nenfant)=\"A\",\"X\",\"\")","v":{"$error":"#NAME?"}},null,{"$f":"IF(INDEX(periode6,NEVAL,Nenfant)=\"D\",\"X\",\"\")","v":{"$error":"#NAME?"}},{"$f":"IF(INDEX(periode6,NEVAL,Nenfant)=\"C\",\"X\",\"\")","v":{"$error":"#NAME?"}},{"$f":"IF(INDEX(periode6,NEVAL,Nenfant)=\"B\",\"X\",\"\")","v":{"$error":"#NAME?"}},{"$f":"IF(INDEX(periode6,NEVAL,Nenfant)=\"A\",\"X\",\"\")","v":{"$error":"#NAME?"}}]
[17,{"$nulls":7},{"$f":"IF(INDEX(periode1,NEVAL,Nenfant)=\"D\",\"X\",\"\")","v":{"$error":"#NAME?"}},{"$f":"IF(INDEX(periode1,NEVAL,Nenfant)=\"C\",\"X\",\"\")","v":{"$error":"#NAME?"}},{"$f":"IF(INDEX(periode1,NEVAL,Nenfant)=\"B\",\"X\",\"\")","v":{"$error":"#NAME?"}},{"$f":"IF(INDEX(periode1,NEVAL,Nenfant)=\"A\",\"X\",\"\")","v":{"$error":"#NAME?"}},null,{"$f":"IF(INDEX(periode2,NEVAL,Nenfant)=\"D\",\"X\",\"\")","v":{"$error":"#NAME?"}},{"$f":"IF(INDEX(periode2,NEVAL,Nenfant)=\"C\",\"X\",\"\")","v":{"$error":"#NAME?"}},{"$f":"IF(INDEX(periode2,NEVAL,Nenfant)=\"B\",\"X\",\"\")","v":{"$error":"#NAME?"}},{"$f":"IF(INDEX(periode2,NEVAL,Nenfant)=\"A\",\"X\",\"\")","v":{"$error":"#NAME?"}},null,{"$f":"IF(INDEX(periode3,NEVAL,Nenfant)=\"D\",\"X\",\"\")","v":{"$error":"#NAME?"}},{"$f":"IF(INDEX(periode3,NEVAL,Nenfant)=\"C\",\"X\",\"\")","v":{"$error":"#NAME?"}},{"$f":"IF(INDEX(periode3,NEVAL,Nenfant)=\"B\",\"X\",\"\")","v":{"$error":"#NAME?"}},{"$f":"IF(INDEX(periode3,NEVAL,Nenfant)=\"A\",\"X\",\"\")","v":{"$error":"#NAME?"}},null,{"$f":"IF(INDEX(periode4,NEVAL,Nenfant)=\"D\",\"X\",\"\")","v":{"$error":"#NAME?"}},{"$f":"IF(INDEX(periode4,NEVAL,Nenfant)=\"C\",\"X\",\"\")","v":{"$error":"#NAME?"}},{"$f":"IF(INDEX(periode4,NEVAL,Nenfant)=\"B\",\"X\",\"\")","v":{"$error":"#NAME?"}},{"$f":"IF(INDEX(periode4,NEVAL,Nenfant)=\"A\",\"X\",\"\")","v":{"$error":"#NAME?"}},null,{"$f":"IF(INDEX(periode5,NEVAL,Nenfant)=\"D\",\"X\",\"\")","v":{"$error":"#NAME?"}},{"$f":"IF(INDEX(periode5,NEVAL,Nenfant)=\"C\",\"X\",\"\")","v":{"$error":"#NAME?"}},{"$f":"IF(INDEX(periode5,NEVAL,Nenfant)=\"B\",\"X\",\"\")","v":{"$error":"#NAME?"}},{"$f":"IF(INDEX(periode5,NEVAL,Nenfant)=\"A\",\"X\",\"\")","v":{"$error":"#NAME?"}},null,{"$f":"IF(INDEX(periode6,NEVAL,Nenfant)=\"D\",\"X\",\"\")","v":{"$error":"#NAME?"}},{"$f":"IF(INDEX(periode6,NEVAL,Nenfant)=\"C\",\"X\",\"\")","v":{"$error":"#NAME?"}},{"$f":"IF(INDEX(periode6,NEVAL,Nenfant)=\"B\",\"X\",\"\")","v":{"$error":"#NAME?"}},{"$f":"IF(INDEX(periode6,NEVAL,Nenfant)=\"A\",\"X\",\"\")","v":{"$error":"#NAME?"}}]
[18,{"$nulls":7},{"$f":"IF(INDEX(periode1,NEVAL,Nenfant)=\"D\",\"X\",\"\")","v":{"$error":"#NAME?"}},{"$f":"IF(INDEX(periode1,NEVAL,Nenfant)=\"C\",\"X\",\"\")","v":{"$error":"#NAME?"}},{"$f":"IF(INDEX(periode1,NEVAL,Nenfant)=\"B\",\"X\",\"\")","v":{"$error":"#NAME?"}},{"$f":"IF(INDEX(periode1,NEVAL,Nenfant)=\"A\",\"X\",\"\")","v":{"$error":"#NAME?"}},null,{"$f":"IF(INDEX(periode2,NEVAL,Nenfant)=\"D\",\"X\",\"\")","v":{"$error":"#NAME?"}},{"$f":"IF(INDEX(periode2,NEVAL,Nenfant)=\"C\",\"X\",\"\")","v":{"$error":"#NAME?"}},{"$f":"IF(INDEX(periode2,NEVAL,Nenfant)=\"B\",\"X\",\"\")","v":{"$error":"#NAME?"}},{"$f":"IF(INDEX(periode2,NEVAL,Nenfant)=\"A\",\"X\",\"\")","v":{"$error":"#NAME?"}},null,{"$f":"IF(INDEX(periode3,NEVAL,Nenfant)=\"D\",\"X\",\"\")","v":{"$error":"#NAME?"}},{"$f":"IF(INDEX(periode3,NEVAL,Nenfant)=\"C\",\"X\",\"\")","v":{"$error":"#NAME?"}},{"$f":"IF(INDEX(periode3,NEVAL,Nenfant)=\"B\",\"X\",\"\")","v":{"$error":"#NAME?"}},{"$f":"IF(INDEX(periode3,NEVAL,Nenfant)=\"A\",\"X\",\"\")","v":{"$error":"#NAME?"}},null,{"$f":"IF(INDEX(periode4,NEVAL,Nenfant)=\"D\",\"X\",\"\")","v":{"$error":"#NAME?"}},{"$f":"IF(INDEX(periode4,NEVAL,Nenfant)=\"C\",\"X\",\"\")","v":{"$error":"#NAME?"}},{"$f":"IF(INDEX(periode4,NEVAL,Nenfant)=\"B\",\"X\",\"\")","v":{"$error":"#NAME?"}},{"$f":"IF(INDEX(periode4,NEVAL,Nenfant)=\"A\",\"X\",\"\")","v":{"$error":"#NAME?"}},null,{"$f":"IF(INDEX(periode5,NEVAL,Nenfant)=\"D\",\"X\",\"\")","v":{"$error":"#NAME?"}},{"$f":"IF(INDEX(periode5,NEVAL,Nenfant)=\"C\",\"X\",\"\")","v":{"$error":"#NAME?"}},{"$f":"IF(INDEX(periode5,NEVAL,Nenfant)=\"B\",\"X\",\"\")","v":{"$error":"#NAME?"}},{"$f":"IF(INDEX(periode5,NEVAL,Nenfant)=\"A\",\"X\",\"\")","v":{"$error":"#NAME?"}},null,{"$f":"IF(INDEX(periode6,NEVAL,Nenfant)=\"D\",\"X\",\"\")","v":{"$error":"#NAME?"}},{"$f":"IF(INDEX(periode6,NEVAL,Nenfant)=\"C\",\"X\",\"\")","v":{"$error":"#NAME?"}},{"$f":"IF(INDEX(periode6,NEVAL,Nenfant)=\"B\",\"X\",\"\")","v":{"$error":"#NAME?"}},{"$f":"IF(INDEX(periode6,NEVAL,Nenfant)=\"A\",\"X\",\"\")","v":{"$error":"#NAME?"}}]
[19,{"$nulls":7},{"$f":"COUNTIF($G20:$G24,\"X\")","v":0},{"$f":"COUNTIF($H20:$H24,\"X\")","v":0},{"$f":"COUNTIF($I20:$I24,\"X\")","v":0},{"$f":"COUNTIF($J20:$J24,\"X\")","v":0},null,{"$f":"COUNTIF($G20:$G24,\"X\")","v":0},{"$f":"COUNTIF($H20:$H24,\"X\")","v":0},{"$f":"COUNTIF($I20:$I24,\"X\")","v":0},{"$f":"COUNTIF($J20:$J24,\"X\")","v":0},null,{"$f":"COUNTIF($G20:$G24,\"X\")","v":0},{"$f":"COUNTIF($H20:$H24,\"X\")","v":0},{"$f":"COUNTIF($I20:$I24,\"X\")","v":0},{"$f":"COUNTIF($J20:$J24,\"X\")","v":0},null,{"$f":"COUNTIF($G20:$G24,\"X\")","v":0},{"$f":"COUNTIF($H20:$H24,\"X\")","v":0},{"$f":"COUNTIF($I20:$I24,\"X\")","v":0},{"$f":"COUNTIF(AA20:AA24,\"X\")","v":0},null,{"$f":"COUNTIF($G20:$G24,\"X\")","v":0},{"$f":"COUNTIF($H20:$H24,\"X\")","v":0},{"$f":"COUNTIF($I20:$I24,\"X\")","v":0},{"$f":"COUNTIF($J20:$J24,\"X\")","v":0},null,{"$f":"COUNTIF($G20:$G24,\"X\")","v":0},{"$f":"COUNTIF($H20:$H24,\"X\")","v":0},{"$f":"COUNTIF($I20:$I24,\"X\")","v":0},{"$f":"COUNTIF($J20:$J24,\"X\")","v":0}]
[20,{"$nulls":7},{"$f":"IF(INDEX(periode1,NEVAL,Nenfant)=\"D\",\"X\",\"\")","v":{"$error":"#NAME?"}},{"$f":"IF(INDEX(periode1,NEVAL,Nenfant)=\"C\",\"X\",\"\")","v":{"$error":"#NAME?"}},{"$f":"IF(INDEX(periode1,NEVAL,Nenfant)=\"B\",\"X\",\"\")","v":{"$error":"#NAME?"}},{"$f":"IF(INDEX(periode1,NEVAL,Nenfant)=\"A\",\"X\",\"\")","v":{"$error":"#NAME?"}},null,{"$f":"IF(INDEX(periode2,NEVAL,Nenfant)=\"D\",\"X\",\"\")","v":{"$error":"#NAME?"}},{"$f":"IF(INDEX(periode2,NEVAL,Nenfant)=\"C\",\"X\",\"\")","v":{"$error":"#NAME?"}},{"$f":"IF(INDEX(periode2,NEVAL,Nenfant)=\"B\",\"X\",\"\")","v":{"$error":"#NAME?"}},{"$f":"IF(INDEX(periode2,NEVAL,Nenfant)=\"A\",\"X\",\"\")","v":{"$error":"#NAME?"}},null,{"$f":"IF(INDEX(periode3,NEVAL,Nenfant)=\"D\",\"X\",\"\")","v":{"$error":"#NAME?"}},{"$f":"IF(INDEX(periode3,NEVAL,Nenfant)=\"C\",\"X\",\"\")","v":{"$error":"#NAME?"}},{"$f":"IF(INDEX(periode3,NEVAL,Nenfant)=\"B\",\"X\",\"\")","v":{"$error":"#NAME?"}},{"$f":"IF(INDEX(periode3,NEVAL,Nenfant)=\"A\",\"X\",\"\")","v":{"$error":"#NAME?"}},null,{"$f":"IF(INDEX(periode4,NEVAL,Nenfant)=\"D\",\"X\",\"\")","v":{"$error":"#NAME?"}},{"$f":"IF(INDEX(periode4,NEVAL,Nenfant)=\"C\",\"X\",\"\")","v":{"$error":"#NAME?"}},{"$f":"IF(INDEX(periode4,NEVAL,Nenfant)=\"B\",\"X\",\"\")","v":{"$error":"#NAME?"}},{"$f":"IF(INDEX(periode4,NEVAL,Nenfant)=\"A\",\"X\",\"\")","v":{"$error":"#NAME?"}},null,{"$f":"IF(INDEX(periode5,NEVAL,Nenfant)=\"D\",\"X\",\"\")","v":{"$error":"#NAME?"}},{"$f":"IF(INDEX(periode5,NEVAL,Nenfant)=\"C\",\"X\",\"\")","v":{"$error":"#NAME?"}},{"$f":"IF(INDEX(periode5,NEVAL,Nenfant)=\"B\",\"X\",\"\")","v":{"$error":"#NAME?"}},{"$f":"IF(INDEX(periode5,NEVAL,Nenfant)=\"A\",\"X\",\"\")","v":{"$error":"#NAME?"}},null,{"$f":"IF(INDEX(periode6,NEVAL,Nenfant)=\"D\",\"X\",\"\")","v":{"$error":"#NAME?"}},{"$f":"IF(INDEX(periode6,NEVAL,Nenfant)=\"C\",\"X\",\"\")","v":{"$error":"#NAME?"}},{"$f":"IF(INDEX(periode6,NEVAL,Nenfant)=\"B\",\"X\",\"\")","v":{"$error":"#NAME?"}},{"$f":"IF(INDEX(periode6,NEVAL,Nenfant)=\"A\",\"X\",\"\")","v":{"$error":"#NAME?"}}]
[21,{"$nulls":7},{"$f":"IF(INDEX(periode1,NEVAL,Nenfant)=\"D\",\"X\",\"\")","v":{"$error":"#NAME?"}},{"$f":"IF(INDEX(periode1,NEVAL,Nenfant)=\"C\",\"X\",\"\")","v":{"$error":"#NAME?"}},{"$f":"IF(INDEX(periode1,NEVAL,Nenfant)=\"B\",\"X\",\"\")","v":{"$error":"#NAME?"}},{"$f":"IF(INDEX(periode1,NEVAL,Nenfant)=\"A\",\"X\",\"\")","v":{"$error":"#NAME?"}},null,{"$f":"IF(INDEX(periode2,NEVAL,Nenfant)=\"D\",\"X\",\"\")","v":{"$error":"#NAME?"}},{"$f":"IF(INDEX(periode2,NEVAL,Nenfant)=\"C\",\"X\",\"\")","v":{"$error":"#NAME?"}},{"$f":"IF(INDEX(periode2,NEVAL,Nenfant)=\"B\",\"X\",\"\")","v":{"$error":"#NAME?"}},{"$f":"IF(INDEX(periode2,NEVAL,Nenfant)=\"A\",\"X\",\"\")","v":{"$error":"#NAME?"}},null,{"$f":"IF(INDEX(periode3,NEVAL,Nenfant)=\"D\",\"X\",\"\")","v":{"$error":"#NAME?"}},{"$f":"IF(INDEX(periode3,NEVAL,Nenfant)=\"C\",\"X\",\"\")","v":{"$error":"#NAME?"}},{"$f":"IF(INDEX(periode3,NEVAL,Nenfant)=\"B\",\"X\",\"\")","v":{"$error":"#NAME?"}},{"$f":"IF(INDEX(periode3,NEVAL,Nenfant)=\"A\",\"X\",\"\")","v":{"$error":"#NAME?"}},null,{"$f":"IF(INDEX(periode4,NEVAL,Nenfant)=\"D\",\"X\",\"\")","v":{"$error":"#NAME?"}},{"$f":"IF(INDEX(periode4,NEVAL,Nenfant)=\"C\",\"X\",\"\")","v":{"$error":"#NAME?"}},{"$f":"IF(INDEX(periode4,NEVAL,Nenfant)=\"B\",\"X\",\"\")","v":{"$error":"#NAME?"}},{"$f":"IF(INDEX(periode4,NEVAL,Nenfant)=\"A\",\"X\",\"\")","v":{"$error":"#NAME?"}},null,{"$f":"IF(INDEX(periode5,NEVAL,Nenfant)=\"D\",\"X\",\"\")","v":{"$error":"#NAME?"}},{"$f":"IF(INDEX(periode5,NEVAL,Nenfant)=\"C\",\"X\",\"\")","v":{"$error":"#NAME?"}},{"$f":"IF(INDEX(periode5,NEVAL,Nenfant)=\"B\",\"X\",\"\")","v":{"$error":"#NAME?"}},{"$f":"IF(INDEX(periode5,NEVAL,Nenfant)=\"A\",\"X\",\"\")","v":{"$error":"#NAME?"}},null,{"$f":"IF(INDEX(periode6,NEVAL,Nenfant)=\"D\",\"X\",\"\")","v":{"$error":"#NAME?"}},{"$f":"IF(INDEX(periode6,NEVAL,Nenfant)=\"C\",\"X\",\"\")","v":{"$error":"#NAME?"}},{"$f":"IF(INDEX(periode6,NEVAL,Nenfant)=\"B\",\"X\",\"\")","v":{"$error":"#NAME?"}},{"$f":"IF(INDEX(periode6,NEVAL,Nenfant)=\"A\",\"X\",\"\")","v":{"$error":"#NAME?"}}]
[22,{"$nulls":7},{"$f":"IF(INDEX(periode1,NEVAL,Nenfant)=\"D\",\"X\",\"\")","v":{"$error":"#NAME?"}},{"$f":"IF(INDEX(periode1,NEVAL,Nenfant)=\"C\",\"X\",\"\")","v":{"$error":"#NAME?"}},{"$f":"IF(INDEX(periode1,NEVAL,Nenfant)=\"B\",\"X\",\"\")","v":{"$error":"#NAME?"}},{"$f":"IF(INDEX(periode1,NEVAL,Nenfant)=\"A\",\"X\",\"\")","v":{"$error":"#NAME?"}},null,{"$f":"IF(INDEX(periode2,NEVAL,Nenfant)=\"D\",\"X\",\"\")","v":{"$error":"#NAME?"}},{"$f":"IF(INDEX(periode2,NEVAL,Nenfant)=\"C\",\"X\",\"\")","v":{"$error":"#NAME?"}},{"$f":"IF(INDEX(periode2,NEVAL,Nenfant)=\"B\",\"X\",\"\")","v":{"$error":"#NAME?"}},{"$f":"IF(INDEX(periode2,NEVAL,Nenfant)=\"A\",\"X\",\"\")","v":{"$error":"#NAME?"}},null,{"$f":"IF(INDEX(periode3,NEVAL,Nenfant)=\"D\",\"X\",\"\")","v":{"$error":"#NAME?"}},{"$f":"IF(INDEX(periode3,NEVAL,Nenfant)=\"C\",\"X\",\"\")","v":{"$error":"#NAME?"}},{"$f":"IF(INDEX(periode3,NEVAL,Nenfant)=\"B\",\"X\",\"\")","v":{"$error":"#NAME?"}},{"$f":"IF(INDEX(periode3,NEVAL,Nenfant)=\"A\",\"X\",\"\")","v":{"$error":"#NAME?"}},null,{"$f":"IF(INDEX(periode4,NEVAL,Nenfant)=\"D\",\"X\",\"\")","v":{"$error":"#NAME?"}},{"$f":"IF(INDEX(periode4,NEVAL,Nenfant)=\"C\",\"X\",\"\")","v":{"$error":"#NAME?"}},{"$f":"IF(INDEX(periode4,NEVAL,Nenfant)=\"B\",\"X\",\"\")","v":{"$error":"#NAME?"}},{"$f":"IF(INDEX(periode4,NEVAL,Nenfant)=\"A\",\"X\",\"\")","v":{"$error":"#NAME?"}},null,{"$f":"IF(INDEX(periode5,NEVAL,Nenfant)=\"D\",\"X\",\"\")","v":{"$error":"#NAME?"}},{"$f":"IF(INDEX(periode5,NEVAL,Nenfant)=\"C\",\"X\",\"\")","v":{"$error":"#NAME?"}},{"$f":"IF(INDEX(periode5,NEVAL,Nenfant)=\"B\",\"X\",\"\")","v":{"$error":"#NAME?"}},{"$f":"IF(INDEX(periode5,NEVAL,Nenfant)=\"A\",\"X\",\"\")","v":{"$error":"#NAME?"}},null,{"$f":"IF(INDEX(periode6,NEVAL,Nenfant)=\"D\",\"X\",\"\")","v":{"$error":"#NAME?"}},{"$f":"IF(INDEX(periode6,NEVAL,Nenfant)=\"C\",\"X\",\"\")","v":{"$error":"#NAME?"}},{"$f":"IF(INDEX(periode6,NEVAL,Nenfant)=\"B\",\"X\",\"\")","v":{"$error":"#NAME?"}},{"$f":"IF(INDEX(periode6,NEVAL,Nenfant)=\"A\",\"X\",\"\")","v":{"$error":"#NAME?"}}]
[23,{"$nulls":7},{"$f":"IF(INDEX(periode1,NEVAL,Nenfant)=\"D\",\"X\",\"\")","v":{"$error":"#NAME?"}},{"$f":"IF(INDEX(periode1,NEVAL,Nenfant)=\"C\",\"X\",\"\")","v":{"$error":"#NAME?"}},{"$f":"IF(INDEX(periode1,NEVAL,Nenfant)=\"B\",\"X\",\"\")","v":{"$error":"#NAME?"}},{"$f":"IF(INDEX(periode1,NEVAL,Nenfant)=\"A\",\"X\",\"\")","v":{"$error":"#NAME?"}},null,{"$f":"IF(INDEX(periode2,NEVAL,Nenfant)=\"D\",\"X\",\"\")","v":{"$error":"#NAME?"}},{"$f":"IF(INDEX(periode2,NEVAL,Nenfant)=\"C\",\"X\",\"\")","v":{"$error":"#NAME?"}},{"$f":"IF(INDEX(periode2,NEVAL,Nenfant)=\"B\",\"X\",\"\")","v":{"$error":"#NAME?"}},{"$f":"IF(INDEX(periode2,NEVAL,Nenfant)=\"A\",\"X\",\"\")","v":{"$error":"#NAME?"}},null,{"$f":"IF(INDEX(periode3,NEVAL,Nenfant)=\"D\",\"X\",\"\")","v":{"$error":"#NAME?"}},{"$f":"IF(INDEX(periode3,NEVAL,Nenfant)=\"C\",\"X\",\"\")","v":{"$error":"#NAME?"}},{"$f":"IF(INDEX(periode3,NEVAL,Nenfant)=\"B\",\"X\",\"\")","v":{"$error":"#NAME?"}},{"$f":"IF(INDEX(periode3,NEVAL,Nenfant)=\"A\",\"X\",\"\")","v":{"$error":"#NAME?"}},null,{"$f":"IF(INDEX(periode4,NEVAL,Nenfant)=\"D\",\"X\",\"\")","v":{"$error":"#NAME?"}},{"$f":"IF(INDEX(periode4,NEVAL,Nenfant)=\"C\",\"X\",\"\")","v":{"$error":"#NAME?"}},{"$f":"IF(INDEX(periode4,NEVAL,Nenfant)=\"B\",\"X\",\"\")","v":{"$error":"#NAME?"}},{"$f":"IF(INDEX(periode4,NEVAL,Nenfant)=\"A\",\"X\",\"\")","v":{"$error":"#NAME?"}},null,{"$f":"IF(INDEX(periode5,NEVAL,Nenfant)=\"D\",\"X\",\"\")","v":{"$error":"#NAME?"}},{"$f":"IF(INDEX(periode5,NEVAL,Nenfant)=\"C\",\"X\",\"\")","v":{"$error":"#NAME?"}},{"$f":"IF(INDEX(periode5,NEVAL,Nenfant)=\"B\",\"X\",\"\")","v":{"$error":"#NAME?"}},{"$f":"IF(INDEX(periode5,NEVAL,Nenfant)=\"A\",\"X\",\"\")","v":{"$error":"#NAME?"}},null,{"$f":"IF(INDEX(periode6,NEVAL,Nenfant)=\"D\",\"X\",\"\")","v":{"$error":"#NAME?"}},{"$f":"IF(INDEX(periode6,NEVAL,Nenfant)=\"C\",\"X\",\"\")","v":{"$error":"#NAME?"}},{"$f":"IF(INDEX(periode6,NEVAL,Nenfant)=\"B\",\"X\",\"\")","v":{"$error":"#NAME?"}},{"$f":"IF(INDEX(periode6,NEVAL,Nenfant)=\"A\",\"X\",\"\")","v":{"$error":"#NAME?"}}]
[24,{"$nulls":7},{"$f":"IF(INDEX(periode1,NEVAL,Nenfant)=\"D\",\"X\",\"\")","v":{"$error":"#NAME?"}},{"$f":"IF(INDEX(periode1,NEVAL,Nenfant)=\"C\",\"X\",\"\")","v":{"$error":"#NAME?"}},{"$f":"IF(INDEX(periode1,NEVAL,Nenfant)=\"B\",\"X\",\"\")","v":{"$error":"#NAME?"}},{"$f":"IF(INDEX(periode1,NEVAL,Nenfant)=\"A\",\"X\",\"\")","v":{"$error":"#NAME?"}},null,{"$f":"IF(INDEX(periode2,NEVAL,Nenfant)=\"D\",\"X\",\"\")","v":{"$error":"#NAME?"}},{"$f":"IF(INDEX(periode2,NEVAL,Nenfant)=\"C\",\"X\",\"\")","v":{"$error":"#NAME?"}},{"$f":"IF(INDEX(periode2,NEVAL,Nenfant)=\"B\",\"X\",\"\")","v":{"$error":"#NAME?"}},{"$f":"IF(INDEX(periode2,NEVAL,Nenfant)=\"A\",\"X\",\"\")","v":{"$error":"#NAME?"}},null,{"$f":"IF(INDEX(periode3,NEVAL,Nenfant)=\"D\",\"X\",\"\")","v":{"$error":"#NAME?"}},{"$f":"IF(INDEX(periode3,NEVAL,Nenfant)=\"C\",\"X\",\"\")","v":{"$error":"#NAME?"}},{"$f":"IF(INDEX(periode3,NEVAL,Nenfant)=\"B\",\"X\",\"\")","v":{"$error":"#NAME?"}},{"$f":"IF(INDEX(periode3,NEVAL,Nenfant)=\"A\",\"X\",\"\")","v":{"$error":"#NAME?"}},null,{"$f":"IF(INDEX(periode4,NEVAL,Nenfant)=\"D\",\"X\",\"\")","v":{"$error":"#NAME?"}},{"$f":"IF(INDEX(periode4,NEVAL,Nenfant)=\"C\",\"X\",\"\")","v":{"$error":"#NAME?"}},{"$f":"IF(INDEX(periode4,NEVAL,Nenfant)=\"B\",\"X\",\"\")","v":{"$error":"#NAME?"}},{"$f":"IF(INDEX(periode4,NEVAL,Nenfant)=\"A\",\"X\",\"\")","v":{"$error":"#NAME?"}},null,{"$f":"IF(INDEX(periode5,NEVAL,Nenfant)=\"D\",\"X\",\"\")","v":{"$error":"#NAME?"}},{"$f":"IF(INDEX(periode5,NEVAL,Nenfant)=\"C\",\"X\",\"\")","v":{"$error":"#NAME?"}},{"$f":"IF(INDEX(periode5,NEVAL,Nenfant)=\"B\",\"X\",\"\")","v":{"$error":"#NAME?"}},{"$f":"IF(INDEX(periode5,NEVAL,Nenfant)=\"A\",\"X\",\"\")","v":{"$error":"#NAME?"}},null,{"$f":"IF(INDEX(periode6,NEVAL,Nenfant)=\"D\",\"X\",\"\")","v":{"$error":"#NAME?"}},{"$f":"IF(INDEX(periode6,NEVAL,Nenfant)=\"C\",\"X\",\"\")","v":{"$error":"#NAME?"}},{"$f":"IF(INDEX(periode6,NEVAL,Nenfant)=\"B\",\"X\",\"\")","v":{"$error":"#NAME?"}},{"$f":"IF(INDEX(periode6,NEVAL,Nenfant)=\"A\",\"X\",\"\")","v":{"$error":"#NAME?"}}]
[25,{"$nulls":7},{"$f":"COUNTIF($G26:$G28,\"X\")","v":0},{"$f":"COUNTIF($H26:$H28,\"X\")","v":0},{"$f":"COUNTIF($I26:$I28,\"X\")","v":0},{"$f":"COUNTIF($J26:$J28,\"X\")","v":0},null,{"$f":"COUNTIF($G26:$G28,\"X\")","v":0},{"$f":"COUNTIF($H26:$H28,\"X\")","v":0},{"$f":"COUNTIF($I26:$I28,\"X\")","v":0},{"$f":"COUNTIF($J26:$J28,\"X\")","v":0},null,{"$f":"COUNTIF($G26:$G28,\"X\")","v":0},{"$f":"COUNTIF($H26:$H28,\"X\")","v":0},{"$f":"COUNTIF($I26:$I28,\"X\")","v":0},{"$f":"COUNTIF($J26:$J28,\"X\")","v":0},null,{"$f":"COUNTIF($G26:$G28,\"X\")","v":0},{"$f":"COUNTIF($H26:$H28,\"X\")","v":0},{"$f":"COUNTIF($I26:$I28,\"X\")","v":0},{"$f":"COUNTIF(AA26:AA28,\"X\")","v":0},null,{"$f":"COUNTIF($G26:$G28,\"X\")","v":0},{"$f":"COUNTIF($H26:$H28,\"X\")","v":0},{"$f":"COUNTIF($I26:$I28,\"X\")","v":0},{"$f":"COUNTIF($J26:$J28,\"X\")","v":0},null,{"$f":"COUNTIF($G26:$G28,\"X\")","v":0},{"$f":"COUNTIF($H26:$H28,\"X\")","v":0},{"$f":"COUNTIF($I26:$I28,\"X\")","v":0},{"$f":"COUNTIF($J26:$J28,\"X\")","v":0}]
[26,{"$nulls":7},{"$f":"IF(INDEX(periode1,NEVAL,Nenfant)=\"D\",\"X\",\"\")","v":{"$error":"#NAME?"}},{"$f":"IF(INDEX(periode1,NEVAL,Nenfant)=\"C\",\"X\",\"\")","v":{"$error":"#NAME?"}},{"$f":"IF(INDEX(periode1,NEVAL,Nenfant)=\"B\",\"X\",\"\")","v":{"$error":"#NAME?"}},{"$f":"IF(INDEX(periode1,NEVAL,Nenfant)=\"A\",\"X\",\"\")","v":{"$error":"#NAME?"}},null,{"$f":"IF(INDEX(periode2,NEVAL,Nenfant)=\"D\",\"X\",\"\")","v":{"$error":"#NAME?"}},{"$f":"IF(INDEX(periode2,NEVAL,Nenfant)=\"C\",\"X\",\"\")","v":{"$error":"#NAME?"}},{"$f":"IF(INDEX(periode2,NEVAL,Nenfant)=\"B\",\"X\",\"\")","v":{"$error":"#NAME?"}},{"$f":"IF(INDEX(periode2,NEVAL,Nenfant)=\"A\",\"X\",\"\")","v":{"$error":"#NAME?"}},null,{"$f":"IF(INDEX(periode3,NEVAL,Nenfant)=\"D\",\"X\",\"\")","v":{"$error":"#NAME?"}},{"$f":"IF(INDEX(periode3,NEVAL,Nenfant)=\"C\",\"X\",\"\")","v":{"$error":"#NAME?"}},{"$f":"IF(INDEX(periode3,NEVAL,Nenfant)=\"B\",\"X\",\"\")","v":{"$error":"#NAME?"}},{"$f":"IF(INDEX(periode3,NEVAL,Nenfant)=\"A\",\"X\",\"\")","v":{"$error":"#NAME?"}},null,{"$f":"IF(INDEX(periode4,NEVAL,Nenfant)=\"D\",\"X\",\"\")","v":{"$error":"#NAME?"}},{"$f":"IF(INDEX(periode4,NEVAL,Nenfant)=\"C\",\"X\",\"\")","v":{"$error":"#NAME?"}},{"$f":"IF(INDEX(periode4,NEVAL,Nenfant)=\"B\",\"X\",\"\")","v":{"$error":"#NAME?"}},{"$f":"IF(INDEX(periode4,NEVAL,Nenfant)=\"A\",\"X\",\"\")","v":{"$error":"#NAME?"}},null,{"$f":"IF(INDEX(periode5,NEVAL,Nenfant)=\"D\",\"X\",\"\")","v":{"$error":"#NAME?"}},{"$f":"IF(INDEX(periode5,NEVAL,Nenfant)=\"C\",\"X\",\"\")","v":{"$error":"#NAME?"}},{"$f":"IF(INDEX(periode5,NEVAL,Nenfant)=\"B\",\"X\",\"\")","v":{"$error":"#NAME?"}},{"$f":"IF(INDEX(periode5,NEVAL,Nenfant)=\"A\",\"X\",\"\")","v":{"$error":"#NAME?"}},null,{"$f":"IF(INDEX(periode6,NEVAL,Nenfant)=\"D\",\"X\",\"\")","v":{"$error":"#NAME?"}},{"$f":"IF(INDEX(periode6,NEVAL,Nenfant)=\"C\",\"X\",\"\")","v":{"$error":"#NAME?"}},{"$f":"IF(INDEX(periode6,NEVAL,Nenfant)=\"B\",\"X\",\"\")","v":{"$error":"#NAME?"}},{"$f":"IF(INDEX(periode6,NEVAL,Nenfant)=\"A\",\"X\",\"\")","v":{"$error":"#NAME?"}}]
[27,{"$nulls":7},{"$f":"IF(INDEX(periode1,NEVAL,Nenfant)=\"D\",\"X\",\"\")","v":{"$error":"#NAME?"}},{"$f":"IF(INDEX(periode1,NEVAL,Nenfant)=\"C\",\"X\",\"\")","v":{"$error":"#NAME?"}},{"$f":"IF(INDEX(periode1,NEVAL,Nenfant)=\"B\",\"X\",\"\")","v":{"$error":"#NAME?"}},{"$f":"IF(INDEX(periode1,NEVAL,Nenfant)=\"A\",\"X\",\"\")","v":{"$error":"#NAME?"}},null,{"$f":"IF(INDEX(periode2,NEVAL,Nenfant)=\"D\",\"X\",\"\")","v":{"$error":"#NAME?"}},{"$f":"IF(INDEX(periode2,NEVAL,Nenfant)=\"C\",\"X\",\"\")","v":{"$error":"#NAME?"}},{"$f":"IF(INDEX(periode2,NEVAL,Nenfant)=\"B\",\"X\",\"\")","v":{"$error":"#NAME?"}},{"$f":"IF(INDEX(periode2,NEVAL,Nenfant)=\"A\",\"X\",\"\")","v":{"$error":"#NAME?"}},null,{"$f":"IF(INDEX(periode3,NEVAL,Nenfant)=\"D\",\"X\",\"\")","v":{"$error":"#NAME?"}},{"$f":"IF(INDEX(periode3,NEVAL,Nenfant)=\"C\",\"X\",\"\")","v":{"$error":"#NAME?"}},{"$f":"IF(INDEX(periode3,NEVAL,Nenfant)=\"B\",\"X\",\"\")","v":{"$error":"#NAME?"}},{"$f":"IF(INDEX(periode3,NEVAL,Nenfant)=\"A\",\"X\",\"\")","v":{"$error":"#NAME?"}},null,{"$f":"IF(INDEX(periode4,NEVAL,Nenfant)=\"D\",\"X\",\"\")","v":{"$error":"#NAME?"}},{"$f":"IF(INDEX(periode4,NEVAL,Nenfant)=\"C\",\"X\",\"\")","v":{"$error":"#NAME?"}},{"$f":"IF(INDEX(periode4,NEVAL,Nenfant)=\"B\",\"X\",\"\")","v":{"$error":"#NAME?"}},{"$f":"IF(INDEX(periode4,NEVAL,Nenfant)=\"A\",\"X\",\"\")","v":{"$error":"#NAME?"}},null,{"$f":"IF(INDEX(periode5,NEVAL,Nenfant)=\"D\",\"X\",\"\")","v":{"$error":"#NAME?"}},{"$f":"IF(INDEX(periode5,NEVAL,Nenfant)=\"C\",\"X\",\"\")","v":{"$error":"#NAME?"}},{"$f":"IF(INDEX(periode5,NEVAL,Nenfant)=\"B\",\"X\",\"\")","v":{"$error":"#NAME?"}},{"$f":"IF(INDEX(periode5,NEVAL,Nenfant)=\"A\",\"X\",\"\")","v":{"$error":"#NAME?"}},null,{"$f":"IF(INDEX(periode6,NEVAL,Nenfant)=\"D\",\"X\",\"\")","v":{"$error":"#NAME?"}},{"$f":"IF(INDEX(periode6,NEVAL,Nenfant)=\"C\",\"X\",\"\")","v":{"$error":"#NAME?"}},{"$f":"IF(INDEX(periode6,NEVAL,Nenfant)=\"B\",\"X\",\"\")","v":{"$error":"#NAME?"}},{"$f":"IF(INDEX(periode6,NEVAL,Nenfant)=\"A\",\"X\",\"\")","v":{"$error":"#NAME?"}}]
[28,{"$nulls":7},{"$f":"IF(INDEX(periode1,NEVAL,Nenfant)=\"D\",\"X\",\"\")","v":{"$error":"#NAME?"}},{"$f":"IF(INDEX(periode1,NEVAL,Nenfant)=\"C\",\"X\",\"\")","v":{"$error":"#NAME?"}},{"$f":"IF(INDEX(periode1,NEVAL,Nenfant)=\"B\",\"X\",\"\")","v":{"$error":"#NAME?"}},{"$f":"IF(INDEX(periode1,NEVAL,Nenfant)=\"A\",\"X\",\"\")","v":{"$error":"#NAME?"}},null,{"$f":"IF(INDEX(periode2,NEVAL,Nenfant)=\"D\",\"X\",\"\")","v":{"$error":"#NAME?"}},{"$f":"IF(INDEX(periode2,NEVAL,Nenfant)=\"C\",\"X\",\"\")","v":{"$error":"#NAME?"}},{"$f":"IF(INDEX(periode2,NEVAL,Nenfant)=\"B\",\"X\",\"\")","v":{"$error":"#NAME?"}},{"$f":"IF(INDEX(periode2,NEVAL,Nenfant)=\"A\",\"X\",\"\")","v":{"$error":"#NAME?"}},null,{"$f":"IF(INDEX(periode3,NEVAL,Nenfant)=\"D\",\"X\",\"\")","v":{"$error":"#NAME?"}},{"$f":"IF(INDEX(periode3,NEVAL,Nenfant)=\"C\",\"X\",\"\")","v":{"$error":"#NAME?"}},{"$f":"IF(INDEX(periode3,NEVAL,Nenfant)=\"B\",\"X\",\"\")","v":{"$error":"#NAME?"}},{"$f":"IF(INDEX(periode3,NEVAL,Nenfant)=\"A\",\"X\",\"\")","v":{"$error":"#NAME?"}},null,{"$f":"IF(INDEX(periode4,NEVAL,Nenfant)=\"D\",\"X\",\"\")","v":{"$error":"#NAME?"}},{"$f":"IF(INDEX(periode4,NEVAL,Nenfant)=\"C\",\"X\",\"\")","v":{"$error":"#NAME?"}},{"$f":"IF(INDEX(periode4,NEVAL,Nenfant)=\"B\",\"X\",\"\")","v":{"$error":"#NAME?"}},{"$f":"IF(INDEX(periode4,NEVAL,Nenfant)=\"A\",\"X\",\"\")","v":{"$error":"#NAME?"}},null,{"$f":"IF(INDEX(periode5,NEVAL,Nenfant)=\"D\",\"X\",\"\")","v":{"$error":"#NAME?"}},{"$f":"IF(INDEX(periode5,NEVAL,Nenfant)=\"C\",\"X\",\"\")","v":{"$error":"#NAME?"}},{"$f":"IF(INDEX(periode5,NEVAL,Nenfant)=\"B\",\"X\",\"\")","v":{"$error":"#NAME?"}},{"$f":"IF(INDEX(periode5,NEVAL,Nenfant)=\"A\",\"X\",\"\")","v":{"$error":"#NAME?"}},null,{"$f":"IF(INDEX(periode6,NEVAL,Nenfant)=\"D\",\"X\",\"\")","v":{"$error":"#NAME?"}},{"$f":"IF(INDEX(periode6,NEVAL,Nenfant)=\"C\",\"X\",\"\")","v":{"$error":"#NAME?"}},{"$f":"IF(INDEX(periode6,NEVAL,Nenfant)=\"B\",\"X\",\"\")","v":{"$error":"#NAME?"}},{"$f":"IF(INDEX(periode6,NEVAL,Nenfant)=\"A\",\"X\",\"\")","v":{"$error":"#NAME?"}}]
[29,{"$nulls":7},{"$f":"NB.S($G30:$G37,\"X\")","v":{"$error":"#NAME?"}},{"$f":"COUNTIF($H30:$H37,\"X\")","v":0},{"$f":"COUNTIF($I30:$I37,\"X\")","v":0},{"$f":"COUNTIF($J30:$J37,\"X\")","v":0},null,{"$f":"NB.S($G30:$G37,\"X\")","v":{"$error":"#NAME?"}},{"$f":"COUNTIF($H30:$H37,\"X\")","v":0},{"$f":"COUNTIF($I30:$I37,\"X\")","v":0},{"$f":"COUNTIF($J30:$J37,\"X\")","v":0},null,{"$f":"NB.S($G30:$G37,\"X\")","v":{"$error":"#NAME?"}},{"$f":"COUNTIF($H30:$H37,\"X\")","v":0},{"$f":"COUNTIF($I30:$I37,\"X\")","v":0},{"$f":"COUNTIF($J30:$J37,\"X\")","v":0},null,{"$f":"NB.S($G30:$G37,\"X\")","v":{"$error":"#NAME?"}},{"$f":"COUNTIF($H30:$H37,\"X\")","v":0},{"$f":"COUNTIF($I30:$I37,\"X\")","v":0},{"$f":"COUNTIF(AA30:AA37,\"X\")","v":0},null,{"$f":"NB.S($G30:$G37,\"X\")","v":{"$error":"#NAME?"}},{"$f":"COUNTIF($H30:$H37,\"X\")","v":0},{"$f":"COUNTIF($I30:$I37,\"X\")","v":0},{"$f":"COUNTIF($J30:$J37,\"X\")","v":0},null,{"$f":"NB.S($G30:$G37,\"X\")","v":{"$error":"#NAME?"}},{"$f":"COUNTIF($H30:$H37,\"X\")","v":0},{"$f":"COUNTIF($I30:$I37,\"X\")","v":0},{"$f":"COUNTIF($J30:$J37,\"X\")","v":0}]
[30,{"$nulls":7},{"$f":"IF(INDEX(periode1,NEVAL,Nenfant)=\"D\",\"X\",\"\")","v":{"$error":"#NAME?"}},{"$f":"IF(INDEX(periode1,NEVAL,Nenfant)=\"C\",\"X\",\"\")","v":{"$error":"#NAME?"}},{"$f":"IF(INDEX(periode1,NEVAL,Nenfant)=\"B\",\"X\",\"\")","v":{"$error":"#NAME?"}},{"$f":"IF(INDEX(periode1,NEVAL,Nenfant)=\"A\",\"X\",\"\")","v":{"$error":"#NAME?"}},null,{"$f":"IF(INDEX(periode2,NEVAL,Nenfant)=\"D\",\"X\",\"\")","v":{"$error":"#NAME?"}},{"$f":"IF(INDEX(periode2,NEVAL,Nenfant)=\"C\",\"X\",\"\")","v":{"$error":"#NAME?"}},{"$f":"IF(INDEX(periode2,NEVAL,Nenfant)=\"B\",\"X\",\"\")","v":{"$error":"#NAME?"}},{"$f":"IF(INDEX(periode2,NEVAL,Nenfant)=\"A\",\"X\",\"\")","v":{"$error":"#NAME?"}},null,{"$f":"IF(INDEX(periode3,NEVAL,Nenfant)=\"D\",\"X\",\"\")","v":{"$error":"#NAME?"}},{"$f":"IF(INDEX(periode3,NEVAL,Nenfant)=\"C\",\"X\",\"\")","v":{"$error":"#NAME?"}},{"$f":"IF(INDEX(periode3,NEVAL,Nenfant)=\"B\",\"X\",\"\")","v":{"$error":"#NAME?"}},{"$f":"IF(INDEX(periode3,NEVAL,Nenfant)=\"A\",\"X\",\"\")","v":{"$error":"#NAME?"}},null,{"$f":"IF(INDEX(periode4,NEVAL,Nenfant)=\"D\",\"X\",\"\")","v":{"$error":"#NAME?"}},{"$f":"IF(INDEX(periode4,NEVAL,Nenfant)=\"C\",\"X\",\"\")","v":{"$error":"#NAME?"}},{"$f":"IF(INDEX(periode4,NEVAL,Nenfant)=\"B\",\"X\",\"\")","v":{"$error":"#NAME?"}},{"$f":"IF(INDEX(periode4,NEVAL,Nenfant)=\"A\",\"X\",\"\")","v":{"$error":"#NAME?"}},null,{"$f":"IF(INDEX(periode5,NEVAL,Nenfant)=\"D\",\"X\",\"\")","v":{"$error":"#NAME?"}},{"$f":"IF(INDEX(periode5,NEVAL,Nenfant)=\"C\",\"X\",\"\")","v":{"$error":"#NAME?"}},{"$f":"IF(INDEX(periode5,NEVAL,Nenfant)=\"B\",\"X\",\"\")","v":{"$error":"#NAME?"}},{"$f":"IF(INDEX(periode5,NEVAL,Nenfant)=\"A\",\"X\",\"\")","v":{"$error":"#NAME?"}},null,{"$f":"IF(INDEX(periode6,NEVAL,Nenfant)=\"D\",\"X\",\"\")","v":{"$error":"#NAME?"}},{"$f":"IF(INDEX(periode6,NEVAL,Nenfant)=\"C\",\"X\",\"\")","v":{"$error":"#NAME?"}},{"$f":"IF(INDEX(periode6,NEVAL,Nenfant)=\"B\",\"X\",\"\")","v":{"$error":"#NAME?"}},{"$f":"IF(INDEX(periode6,NEVAL,Nenfant)=\"A\",\"X\",\"\")","v":{"$error":"#NAME?"}}]
[{"$f":"A30+1","v":31},{"$nulls":7},{"$error":"#NAME?"},{"$error":"#NAME?"},{"$error":"#NAME?"},{"$error":"#NAME?"},null,{"$error":"#NAME?"},{"$error":"#NAME?"},{"$error":"#NAME?"},{"$error":"#NAME?"},null,{"$f":"IF(INDEX(periode3,NEVAL,Nenfant)=\"D\",\"X\",\"\")","v":{"$error":"#NAME?"}},{"$f":"IF(INDEX(periode3,NEVAL,Nenfant)=\"C\",\"X\",\"\")","v":{"$error":"#NAME?"}},{"$f":"IF(INDEX(periode3,NEVAL,Nenfant)=\"B\",\"X\",\"\")","v":{"$error":"#NAME?"}},{"$f":"IF(INDEX(periode3,NEVAL,Nenfant)=\"A\",\"X\",\"\")","v":{"$error":"#NAME?"}},null,{"$f":"IF(INDEX(periode4,NEVAL,Nenfant)=\"D\",\"X\",\"\")","v":{"$error":"#NAME?"}},{"$f":"IF(INDEX(periode4,NEVAL,Nenfant)=\"C\",\"X\",\"\")","v":{"$error":"#NAME?"}},{"$f":"IF(INDEX(periode4,NEVAL,Nenfant)=\"B\",\"X\",\"\")","v":{"$error":"#NAME?"}},{"$f":"IF(INDEX(periode4,NEVAL,Nenfant)=\"A\",\"X\",\"\")","v":{"$error":"#NAME?"}},null,{"$f":"IF(INDEX(periode5,NEVAL,Nenfant)=\"D\",\"X\",\"\")","v":{"$error":"#NAME?"}},{"$f":"IF(INDEX(periode5,NEVAL,Nenfant)=\"C\",\"X\",\"\")","v":{"$error":"#NAME?"}},{"$f":"IF(INDEX(periode5,NEVAL,Nenfant)=\"B\",\"X\",\"\")","v":{"$error":"#NAME?"}},{"$f":"IF(INDEX(periode5,NEVAL,Nenfant)=\"A\",\"X\",\"\")","v":{"$error":"#NAME?"}},null,{"$error":"#NAME?"},{"$f":"IF(INDEX(periode6,NEVAL,Nenfant)=\"C\",\"X\",\"\")","v":{"$error":"#NAME?"}},{"$f":"IF(INDEX(periode6,NEVAL,Nenfant)=\"B\",\"X\",\"\")","v":{"$error":"#NAME?"}},{"$f":"IF(INDEX(periode6,NEVAL,Nenfant)=\"A\",\"X\",\"\")","v":{"$error":"#NAME?"}}]
[32,{"$nulls":7},{"$error":"#NAME?"},{"$error":"#NAME?"},{"$error":"#NAME?"},{"$error":"#NAME?"},null,{"$error":"#NAME?"},{"$error":"#NAME?"},{"$error":"#NAME?"},{"$error":"#NAME?"},null,{"$f":"IF(INDEX(periode3,NEVAL,Nenfant)=\"D\",\"X\",\"\")","v":{"$error":"#NAME?"}},{"$f":"IF(INDEX(periode3,NEVAL,Nenfant)=\"C\",\"X\",\"\")","v":{"$error":"#NAME?"}},{"$f":"IF(INDEX(periode3,NEVAL,Nenfant)=\"B\",\"X\",\"\")","v":{"$error":"#NAME?"}},{"$f":"IF(INDEX(periode3,NEVAL,Nenfant)=\"A\",\"X\",\"\")","v":{"$error":"#NAME?"}},null,{"$f":"IF(INDEX(periode4,NEVAL,Nenfant)=\"D\",\"X\",\"\")","v":{"$error":"#NAME?"}},{"$f":"IF(INDEX(periode4,NEVAL,Nenfant)=\"C\",\"X\",\"\")","v":{"$error":"#NAME?"}},{"$f":"IF(INDEX(periode4,NEVAL,Nenfant)=\"B\",\"X\",\"\")","v":{"$error":"#NAME?"}},{"$f":"IF(INDEX(periode4,NEVAL,Nenfant)=\"A\",\"X\",\"\")","v":{"$error":"#NAME?"}},null,{"$f":"IF(INDEX(periode5,NEVAL,Nenfant)=\"D\",\"X\",\"\")","v":{"$error":"#NAME?"}},{"$f":"IF(INDEX(periode5,NEVAL,Nenfant)=\"C\",\"X\",\"\")","v":{"$error":"#NAME?"}},{"$f":"IF(INDEX(periode5,NEVAL,Nenfant)=\"B\",\"X\",\"\")","v":{"$error":"#NAME?"}},{"$f":"IF(INDEX(periode5,NEVAL,Nenfant)=\"A\",\"X\",\"\")","v":{"$error":"#NAME?"}},null,{"$error":"#NAME?"},{"$f":"IF(INDEX(periode6,NEVAL,Nenfant)=\"C\",\"X\",\"\")","v":{"$error":"#NAME?"}},{"$f":"IF(INDEX(periode6,NEVAL,Nenfant)=\"B\",\"X\",\"\")","v":{"$error":"#NAME?"}},{"$f":"IF(INDEX(periode6,NEVAL,Nenfant)=\"A\",\"X\",\"\")","v":{"$error":"#NAME?"}}]
[33,{"$nulls":7},{"$error":"#NAME?"},{"$error":"#NAME?"},{"$error":"#NAME?"},{"$error":"#NAME?"},null,{"$error":"#NAME?"},{"$error":"#NAME?"},{"$error":"#NAME?"},{"$error":"#NAME?"},null,{"$f":"IF(INDEX(periode3,NEVAL,Nenfant)=\"D\",\"X\",\"\")","v":{"$error":"#NAME?"}},{"$f":"IF(INDEX(periode3,NEVAL,Nenfant)=\"C\",\"X\",\"\")","v":{"$error":"#NAME?"}},{"$f":"IF(INDEX(periode3,NEVAL,Nenfant)=\"B\",\"X\",\"\")","v":{"$error":"#NAME?"}},{"$f":"IF(INDEX(periode3,NEVAL,Nenfant)=\"A\",\"X\",\"\")","v":{"$error":"#NAME?"}},null,{"$f":"IF(INDEX(periode4,NEVAL,Nenfant)=\"D\",\"X\",\"\")","v":{"$error":"#NAME?"}},{"$f":"IF(INDEX(periode4,NEVAL,Nenfant)=\"C\",\"X\",\"\")","v":{"$error":"#NAME?"}},{"$f":"IF(INDEX(periode4,NEVAL,Nenfant)=\"B\",\"X\",\"\")","v":{"$error":"#NAME?"}},{"$f":"IF(INDEX(periode4,NEVAL,Nenfant)=\"A\",\"X\",\"\")","v":{"$error":"#NAME?"}},null,{"$f":"IF(INDEX(periode5,NEVAL,Nenfant)=\"D\",\"X\",\"\")","v":{"$error":"#NAME?"}},{"$f":"IF(INDEX(periode5,NEVAL,Nenfant)=\"C\",\"X\",\"\")","v":{"$error":"#NAME?"}},{"$f":"IF(INDEX(periode5,NEVAL,Nenfant)=\"B\",\"X\",\"\")","v":{"$error":"#NAME?"}},{"$f":"IF(INDEX(periode5,NEVAL,Nenfant)=\"A\",\"X\",\"\")","v":{"$error":"#NAME?"}},null,{"$error":"#NAME?"},{"$f":"IF(INDEX(periode6,NEVAL,Nenfant)=\"C\",\"X\",\"\")","v":{"$error":"#NAME?"}},{"$f":"IF(INDEX(periode6,NEVAL,Nenfant)=\"B\",\"X\",\"\")","v":{"$error":"#NAME?"}},{"$f":"IF(INDEX(periode6,NEVAL,Nenfant)=\"A\",\"X\",\"\")","v":{"$error":"#NAME?"}}]
[34,{"$nulls":7},{"$error":"#NAME?"},{"$error":"#NAME?"},{"$error":"#NAME?"},{"$error":"#NAME?"},null,{"$error":"#NAME?"},{"$error":"#NAME?"},{"$error":"#NAME?"},{"$error":"#NAME?"},null,{"$f":"IF(INDEX(periode3,NEVAL,Nenfant)=\"D\",\"X\",\"\")","v":{"$error":"#NAME?"}},{"$f":"IF(INDEX(periode3,NEVAL,Nenfant)=\"C\",\"X\",\"\")","v":{"$error":"#NAME?"}},{"$f":"IF(INDEX(periode3,NEVAL,Nenfant)=\"B\",\"X\",\"\")","v":{"$error":"#NAME?"}},{"$f":"IF(INDEX(periode3,NEVAL,Nenfant)=\"A\",\"X\",\"\")","v":{"$error":"#NAME?"}},null,{"$f":"IF(INDEX(periode4,NEVAL,Nenfant)=\"D\",\"X\",\"\")","v":{"$error":"#NAME?"}},{"$f":"IF(INDEX(periode4,NEVAL,Nenfant)=\"C\",\"X\",\"\")","v":{"$error":"#NAME?"}},{"$f":"IF(INDEX(periode4,NEVAL,Nenfant)=\"B\",\"X\",\"\")","v":{"$error":"#NAME?"}},{"$f":"IF(INDEX(periode4,NEVAL,Nenfant)=\"A\",\"X\",\"\")","v":{"$error":"#NAME?"}},null,{"$f":"IF(INDEX(periode5,NEVAL,Nenfant)=\"D\",\"X\",\"\")","v":{"$error":"#NAME?"}},{"$f":"IF(INDEX(periode5,NEVAL,Nenfant)=\"C\",\"X\",\"\")","v":{"$error":"#NAME?"}},{"$f":"IF(INDEX(periode5,NEVAL,Nenfant)=\"B\",\"X\",\"\")","v":{"$error":"#NAME?"}},{"$f":"IF(INDEX(periode5,NEVAL,Nenfant)=\"A\",\"X\",\"\")","v":{"$error":"#NAME?"}},null,{"$error":"#NAME?"},{"$f":"IF(INDEX(periode6,NEVAL,Nenfant)=\"C\",\"X\",\"\")","v":{"$error":"#NAME?"}},{"$f":"IF(INDEX(periode6,NEVAL,Nenfant)=\"B\",\"X\",\"\")","v":{"$error":"#NAME?"}},{"$f":"IF(INDEX(periode6,NEVAL,Nenfant)=\"A\",\"X\",\"\")","v":{"$error":"#NAME?"}}]
[35,{"$nulls":7},{"$error":"#NAME?"},{"$error":"#NAME?"},{"$error":"#NAME?"},{"$error":"#NAME?"},null,{"$error":"#NAME?"},{"$error":"#NAME?"},{"$error":"#NAME?"},{"$error":"#NAME?"},null,{"$f":"IF(INDEX(periode3,NEVAL,Nenfant)=\"D\",\"X\",\"\")","v":{"$error":"#NAME?"}},{"$f":"IF(INDEX(periode3,NEVAL,Nenfant)=\"C\",\"X\",\"\")","v":{"$error":"#NAME?"}},{"$f":"IF(INDEX(periode3,NEVAL,Nenfant)=\"B\",\"X\",\"\")","v":{"$error":"#NAME?"}},{"$f":"IF(INDEX(periode3,NEVAL,Nenfant)=\"A\",\"X\",\"\")","v":{"$error":"#NAME?"}},null,{"$f":"IF(INDEX(periode4,NEVAL,Nenfant)=\"D\",\"X\",\"\")","v":{"$error":"#NAME?"}},{"$f":"IF(INDEX(periode4,NEVAL,Nenfant)=\"C\",\"X\",\"\")","v":{"$error":"#NAME?"}},{"$f":"IF(INDEX(periode4,NEVAL,Nenfant)=\"B\",\"X\",\"\")","v":{"$error":"#NAME?"}},{"$f":"IF(INDEX(periode4,NEVAL,Nenfant)=\"A\",\"X\",\"\")","v":{"$error":"#NAME?"}},null,{"$f":"IF(INDEX(periode5,NEVAL,Nenfant)=\"D\",\"X\",\"\")","v":{"$error":"#NAME?"}},{"$f":"IF(INDEX(periode5,NEVAL,Nenfant)=\"C\",\"X\",\"\")","v":{"$error":"#NAME?"}},{"$f":"IF(INDEX(periode5,NEVAL,Nenfant)=\"B\",\"X\",\"\")","v":{"$error":"#NAME?"}},{"$f":"IF(INDEX(periode5,NEVAL,Nenfant)=\"A\",\"X\",\"\")","v":{"$error":"#NAME?"}},null,{"$error":"#NAME?"},{"$f":"IF(INDEX(periode6,NEVAL,Nenfant)=\"C\",\"X\",\"\")","v":{"$error":"#NAME?"}},{"$f":"IF(INDEX(periode6,NEVAL,Nenfant)=\"B\",\"X\",\"\")","v":{"$error":"#NAME?"}},{"$f":"IF(INDEX(periode6,NEVAL,Nenfant)=\"A\",\"X\",\"\")","v":{"$error":"#NAME?"}}]
[36,{"$nulls":7},{"$error":"#NAME?"},{"$error":"#NAME?"},{"$error":"#NAME?"},{"$error":"#NAME?"},null,{"$error":"#NAME?"},{"$error":"#NAME?"},{"$error":"#NAME?"},{"$error":"#NAME?"},null,{"$f":"IF(INDEX(periode3,NEVAL,Nenfant)=\"D\",\"X\",\"\")","v":{"$error":"#NAME?"}},{"$f":"IF(INDEX(periode3,NEVAL,Nenfant)=\"C\",\"X\",\"\")","v":{"$error":"#NAME?"}},{"$f":"IF(INDEX(periode3,NEVAL,Nenfant)=\"B\",\"X\",\"\")","v":{"$error":"#NAME?"}},{"$f":"IF(INDEX(periode3,NEVAL,Nenfant)=\"A\",\"X\",\"\")","v":{"$error":"#NAME?"}},null,{"$f":"IF(INDEX(periode4,NEVAL,Nenfant)=\"D\",\"X\",\"\")","v":{"$error":"#NAME?"}},{"$f":"IF(INDEX(periode4,NEVAL,Nenfant)=\"C\",\"X\",\"\")","v":{"$error":"#NAME?"}},{"$f":"IF(INDEX(periode4,NEVAL,Nenfant)=\"B\",\"X\",\"\")","v":{"$error":"#NAME?"}},{"$f":"IF(INDEX(periode4,NEVAL,Nenfant)=\"A\",\"X\",\"\")","v":{"$error":"#NAME?"}},null,{"$f":"IF(INDEX(periode5,NEVAL,Nenfant)=\"D\",\"X\",\"\")","v":{"$error":"#NAME?"}},{"$f":"IF(INDEX(periode5,NEVAL,Nenfant)=\"C\",\"X\",\"\")","v":{"$error":"#NAME?"}},{"$f":"IF(INDEX(periode5,NEVAL,Nenfant)=\"B\",\"X\",\"\")","v":{"$error":"#NAME?"}},{"$f":"IF(INDEX(periode5,NEVAL,Nenfant)=\"A\",\"X\",\"\")","v":{"$error":"#NAME?"}},null,{"$error":"#NAME?"},{"$f":"IF(INDEX(periode6,NEVAL,Nenfant)=\"C\",\"X\",\"\")","v":{"$error":"#NAME?"}},{"$f":"IF(INDEX(periode6,NEVAL,Nenfant)=\"B\",\"X\",\"\")","v":{"$error":"#NAME?"}},{"$f":"IF(INDEX(periode6,NEVAL,Nenfant)=\"A\",\"X\",\"\")","v":{"$error":"#NAME?"}}]
[37,{"$nulls":7},{"$error":"#NAME?"},{"$error":"#NAME?"},{"$error":"#NAME?"},{"$error":"#NAME?"},null,{"$error":"#NAME?"},{"$error":"#NAME?"},{"$error":"#NAME?"},{"$error":"#NAME?"},null,{"$f":"IF(INDEX(periode3,NEVAL,Nenfant)=\"D\",\"X\",\"\")","v":{"$error":"#NAME?"}},{"$f":"IF(INDEX(periode3,NEVAL,Nenfant)=\"C\",\"X\",\"\")","v":{"$error":"#NAME?"}},{"$f":"IF(INDEX(periode3,NEVAL,Nenfant)=\"B\",\"X\",\"\")","v":{"$error":"#NAME?"}},{"$f":"IF(INDEX(periode3,NEVAL,Nenfant)=\"A\",\"X\",\"\")","v":{"$error":"#NAME?"}},null,{"$f":"IF(INDEX(periode4,NEVAL,Nenfant)=\"D\",\"X\",\"\")","v":{"$error":"#NAME?"}},{"$f":"IF(INDEX(periode4,NEVAL,Nenfant)=\"C\",\"X\",\"\")","v":{"$error":"#NAME?"}},{"$f":"IF(INDEX(periode4,NEVAL,Nenfant)=\"B\",\"X\",\"\")","v":{"$error":"#NAME?"}},{"$f":"IF(INDEX(periode4,NEVAL,Nenfant)=\"A\",\"X\",\"\")","v":{"$error":"#NAME?"}},null,{"$f":"IF(INDEX(periode5,NEVAL,Nenfant)=\"D\",\"X\",\"\")","v":{"$error":"#NAME?"}},{"$f":"IF(INDEX(periode5,NEVAL,Nenfant)=\"C\",\"X\",\"\")","v":{"$error":"#NAME?"}},{"$f":"IF(INDEX(periode5,NEVAL,Nenfant)=\"B\",\"X\",\"\")","v":{"$error":"#NAME?"}},{"$f":"IF(INDEX(periode5,NEVAL,Nenfant)=\"A\",\"X\",\"\")","v":{"$error":"#NAME?"}},null,{"$error":"#NAME?"},{"$f":"IF(INDEX(periode6,NEVAL,Nenfant)=\"C\",\"X\",\"\")","v":{"$error":"#NAME?"}},{"$f":"IF(INDEX(periode6,NEVAL,Nenfant)=\"B\",\"X\",\"\")","v":{"$error":"#NAME?"}},{"$f":"IF(INDEX(periode6,NEVAL,Nenfant)=\"A\",\"X\",\"\")","v":{"$error":"#NAME?"}}]
[38,{"$nulls":7},{"$f":"COUNTIF($G39:$G42,\"X\")","v":0},{"$f":"COUNTIF($H39:$H42,\"X\")","v":0},{"$f":"COUNTIF($I39:$I42,\"X\")","v":0},{"$f":"COUNTIF($J39:$J42,\"X\")","v":0},null,{"$f":"COUNTIF($G39:$G42,\"X\")","v":0},{"$f":"COUNTIF($H39:$H42,\"X\")","v":0},{"$f":"COUNTIF($I39:$I42,\"X\")","v":0},{"$f":"COUNTIF($J39:$J42,\"X\")","v":0},null,{"$f":"COUNTIF($G39:$G42,\"X\")","v":0},{"$f":"COUNTIF($H39:$H42,\"X\")","v":0},{"$f":"COUNTIF($I39:$I42,\"X\")","v":0},{"$f":"COUNTIF($J39:$J42,\"X\")","v":0},null,{"$f":"COUNTIF($G39:$G42,\"X\")","v":0},{"$f":"COUNTIF($H39:$H42,\"X\")","v":0},{"$f":"COUNTIF($I39:$I42,\"X\")","v":0},{"$f":"COUNTIF(AA39:AA42,\"X\")","v":0},null,{"$f":"COUNTIF($G39:$G42,\"X\")","v":0},{"$f":"COUNTIF($H39:$H42,\"X\")","v":0},{"$f":"COUNTIF($I39:$I42,\"X\")","v":0},{"$f":"COUNTIF($J39:$J42,\"X\")","v":0},null,{"$f":"COUNTIF($G39:$G42,\"X\")","v":0},{"$f":"COUNTIF($H39:$H42,\"X\")","v":0},{"$f":"COUNTIF($I39:$I42,\"X\")","v":0},{"$f":"COUNTIF($J39:$J42,\"X\")","v":0}]
[39,{"$nulls":7},{"$f":"IF(INDEX(periode1,NEVAL,Nenfant)=\"D\",\"X\",\"\")","v":{"$error":"#NAME?"}},{"$f":"IF(INDEX(periode1,NEVAL,Nenfant)=\"C\",\"X\",\"\")","v":{"$error":"#NAME?"}},{"$f":"IF(INDEX(periode1,NEVAL,Nenfant)=\"B\",\"X\",\"\")","v":{"$error":"#NAME?"}},{"$f":"IF(INDEX(periode1,NEVAL,Nenfant)=\"A\",\"X\",\"\")","v":{"$error":"#NAME?"}},null,{"$f":"IF(INDEX(periode2,NEVAL,Nenfant)=\"D\",\"X\",\"\")","v":{"$error":"#NAME?"}},{"$f":"IF(INDEX(periode2,NEVAL,Nenfant)=\"C\",\"X\",\"\")","v":{"$error":"#NAME?"}},{"$f":"IF(INDEX(periode2,NEVAL,Nenfant)=\"B\",\"X\",\"\")","v":{"$error":"#NAME?"}},{"$f":"IF(INDEX(periode2,NEVAL,Nenfant)=\"A\",\"X\",\"\")","v":{"$error":"#NAME?"}},null,{"$f":"IF(INDEX(periode3,NEVAL,Nenfant)=\"D\",\"X\",\"\")","v":{"$error":"#NAME?"}},{"$f":"IF(INDEX(periode3,NEVAL,Nenfant)=\"C\",\"X\",\"\")","v":{"$error":"#NAME?"}},{"$f":"IF(INDEX(periode3,NEVAL,Nenfant)=\"B\",\"X\",\"\")","v":{"$error":"#NAME?"}},{"$f":"IF(INDEX(periode3,NEVAL,Nenfant)=\"A\",\"X\",\"\")","v":{"$error":"#NAME?"}},null,{"$f":"IF(INDEX(periode4,NEVAL,Nenfant)=\"D\",\"X\",\"\")","v":{"$error":"#NAME?"}},{"$f":"IF(INDEX(periode4,NEVAL,Nenfant)=\"C\",\"X\",\"\")","v":{"$error":"#NAME?"}},{"$f":"IF(INDEX(periode4,NEVAL,Nenfant)=\"B\",\"X\",\"\")","v":{"$error":"#NAME?"}},{"$f":"IF(INDEX(periode4,NEVAL,Nenfant)=\"A\",\"X\",\"\")","v":{"$error":"#NAME?"}},null,{"$f":"IF(INDEX(periode5,NEVAL,Nenfant)=\"D\",\"X\",\"\")","v":{"$error":"#NAME?"}},{"$f":"IF(INDEX(periode5,NEVAL,Nenfant)=\"C\",\"X\",\"\")","v":{"$error":"#NAME?"}},{"$f":"IF(INDEX(periode5,NEVAL,Nenfant)=\"B\",\"X\",\"\")","v":{"$error":"#NAME?"}},{"$f":"IF(INDEX(periode5,NEVAL,Nenfant)=\"A\",\"X\",\"\")","v":{"$error":"#NAME?"}},null,{"$f":"IF(INDEX(periode6,NEVAL,Nenfant)=\"D\",\"X\",\"\")","v":{"$error":"#NAME?"}},{"$f":"IF(INDEX(periode6,NEVAL,Nenfant)=\"C\",\"X\",\"\")","v":{"$error":"#NAME?"}},{"$f":"IF(INDEX(periode6,NEVAL,Nenfant)=\"B\",\"X\",\"\")","v":{"$error":"#NAME?"}},{"$f":"IF(INDEX(periode6,NEVAL,Nenfant)=\"A\",\"X\",\"\")","v":{"$error":"#NAME?"}}]
[40,{"$nulls":7},{"$f":"IF(INDEX(periode1,NEVAL,Nenfant)=\"D\",\"X\",\"\")","v":{"$error":"#NAME?"}},{"$f":"IF(INDEX(periode1,NEVAL,Nenfant)=\"C\",\"X\",\"\")","v":{"$error":"#NAME?"}},{"$f":"IF(INDEX(periode1,NEVAL,Nenfant)=\"B\",\"X\",\"\")","v":{"$error":"#NAME?"}},{"$f":"IF(INDEX(periode1,NEVAL,Nenfant)=\"A\",\"X\",\"\")","v":{"$error":"#NAME?"}},null,{"$f":"IF(INDEX(periode2,NEVAL,Nenfant)=\"D\",\"X\",\"\")","v":{"$error":"#NAME?"}},{"$f":"IF(INDEX(periode2,NEVAL,Nenfant)=\"C\",\"X\",\"\")","v":{"$error":"#NAME?"}},{"$f":"IF(INDEX(periode2,NEVAL,Nenfant)=\"B\",\"X\",\"\")","v":{"$error":"#NAME?"}},{"$f":"IF(INDEX(periode2,NEVAL,Nenfant)=\"A\",\"X\",\"\")","v":{"$error":"#NAME?"}},null,{"$f":"IF(INDEX(periode3,NEVAL,Nenfant)=\"D\",\"X\",\"\")","v":{"$error":"#NAME?"}},{"$f":"IF(INDEX(periode3,NEVAL,Nenfant)=\"C\",\"X\",\"\")","v":{"$error":"#NAME?"}},{"$f":"IF(INDEX(periode3,NEVAL,Nenfant)=\"B\",\"X\",\"\")","v":{"$error":"#NAME?"}},{"$f":"IF(INDEX(periode3,NEVAL,Nenfant)=\"A\",\"X\",\"\")","v":{"$error":"#NAME?"}},null,{"$f":"IF(INDEX(periode4,NEVAL,Nenfant)=\"D\",\"X\",\"\")","v":{"$error":"#NAME?"}},{"$f":"IF(INDEX(periode4,NEVAL,Nenfant)=\"C\",\"X\",\"\")","v":{"$error":"#NAME?"}},{"$f":"IF(INDEX(periode4,NEVAL,Nenfant)=\"B\",\"X\",\"\")","v":{"$error":"#NAME?"}},{"$f":"IF(INDEX(periode4,NEVAL,Nenfant)=\"A\",\"X\",\"\")","v":{"$error":"#NAME?"}},null,{"$f":"IF(INDEX(periode5,NEVAL,Nenfant)=\"D\",\"X\",\"\")","v":{"$error":"#NAME?"}},{"$f":"IF(INDEX(periode5,NEVAL,Nenfant)=\"C\",\"X\",\"\")","v":{"$error":"#NAME?"}},{"$f":"IF(INDEX(periode5,NEVAL,Nenfant)=\"B\",\"X\",\"\")","v":{"$error":"#NAME?"}},{"$f":"IF(INDEX(periode5,NEVAL,Nenfant)=\"A\",\"X\",\"\")","v":{"$error":"#NAME?"}},null,{"$f":"IF(INDEX(periode6,NEVAL,Nenfant)=\"D\",\"X\",\"\")","v":{"$error":"#NAME?"}},{"$f":"IF(INDEX(periode6,NEVAL,Nenfant)=\"C\",\"X\",\"\")","v":{"$error":"#NAME?"}},{"$f":"IF(INDEX(periode6,NEVAL,Nenfant)=\"B\",\"X\",\"\")","v":{"$error":"#NAME?"}},{"$f":"IF(INDEX(periode6,NEVAL,Nenfant)=\"A\",\"X\",\"\")","v":{"$error":"#NAME?"}}]
[41,{"$nulls":7},{"$f":"IF(INDEX(periode1,NEVAL,Nenfant)=\"D\",\"X\",\"\")","v":{"$error":"#NAME?"}},{"$f":"IF(INDEX(periode1,NEVAL,Nenfant)=\"C\",\"X\",\"\")","v":{"$error":"#NAME?"}},{"$f":"IF(INDEX(periode1,NEVAL,Nenfant)=\"B\",\"X\",\"\")","v":{"$error":"#NAME?"}},{"$f":"IF(INDEX(periode1,NEVAL,Nenfant)=\"A\",\"X\",\"\")","v":{"$error":"#NAME?"}},null,{"$f":"IF(INDEX(periode2,NEVAL,Nenfant)=\"D\",\"X\",\"\")","v":{"$error":"#NAME?"}},{"$f":"IF(INDEX(periode2,NEVAL,Nenfant)=\"C\",\"X\",\"\")","v":{"$error":"#NAME?"}},{"$f":"IF(INDEX(periode2,NEVAL,Nenfant)=\"B\",\"X\",\"\")","v":{"$error":"#NAME?"}},{"$f":"IF(INDEX(periode2,NEVAL,Nenfant)=\"A\",\"X\",\"\")","v":{"$error":"#NAME?"}},null,{"$f":"IF(INDEX(periode3,NEVAL,Nenfant)=\"D\",\"X\",\"\")","v":{"$error":"#NAME?"}},{"$f":"IF(INDEX(periode3,NEVAL,Nenfant)=\"C\",\"X\",\"\")","v":{"$error":"#NAME?"}},{"$f":"IF(INDEX(periode3,NEVAL,Nenfant)=\"B\",\"X\",\"\")","v":{"$error":"#NAME?"}},{"$f":"IF(INDEX(periode3,NEVAL,Nenfant)=\"A\",\"X\",\"\")","v":{"$error":"#NAME?"}},null,{"$f":"IF(INDEX(periode4,NEVAL,Nenfant)=\"D\",\"X\",\"\")","v":{"$error":"#NAME?"}},{"$f":"IF(INDEX(periode4,NEVAL,Nenfant)=\"C\",\"X\",\"\")","v":{"$error":"#NAME?"}},{"$f":"IF(INDEX(periode4,NEVAL,Nenfant)=\"B\",\"X\",\"\")","v":{"$error":"#NAME?"}},{"$f":"IF(INDEX(periode4,NEVAL,Nenfant)=\"A\",\"X\",\"\")","v":{"$error":"#NAME?"}},null,{"$f":"IF(INDEX(periode5,NEVAL,Nenfant)=\"D\",\"X\",\"\")","v":{"$error":"#NAME?"}},{"$f":"IF(INDEX(periode5,NEVAL,Nenfant)=\"C\",\"X\",\"\")","v":{"$error":"#NAME?"}},{"$f":"IF(INDEX(periode5,NEVAL,Nenfant)=\"B\",\"X\",\"\")","v":{"$error":"#NAME?"}},{"$f":"IF(INDEX(periode5,NEVAL,Nenfant)=\"A\",\"X\",\"\")","v":{"$error":"#NAME?"}},null,{"$f":"IF(INDEX(periode6,NEVAL,Nenfant)=\"D\",\"X\",\"\")","v":{"$error":"#NAME?"}},{"$f":"IF(INDEX(periode6,NEVAL,Nenfant)=\"C\",\"X\",\"\")","v":{"$error":"#NAME?"}},{"$f":"IF(INDEX(periode6,NEVAL,Nenfant)=\"B\",\"X\",\"\")","v":{"$error":"#NAME?"}},{"$f":"IF(INDEX(periode6,NEVAL,Nenfant)=\"A\",\"X\",\"\")","v":{"$error":"#NAME?"}}]
[42,{"$nulls":7},{"$f":"IF(INDEX(periode1,NEVAL,Nenfant)=\"D\",\"X\",\"\")","v":{"$error":"#NAME?"}},{"$f":"IF(INDEX(periode1,NEVAL,Nenfant)=\"C\",\"X\",\"\")","v":{"$error":"#NAME?"}},{"$f":"IF(INDEX(periode1,NEVAL,Nenfant)=\"B\",\"X\",\"\")","v":{"$error":"#NAME?"}},{"$f":"IF(INDEX(periode1,NEVAL,Nenfant)=\"A\",\"X\",\"\")","v":{"$error":"#NAME?"}},null,{"$f":"IF(INDEX(periode2,NEVAL,Nenfant)=\"D\",\"X\",\"\")","v":{"$error":"#NAME?"}},{"$f":"IF(INDEX(periode2,NEVAL,Nenfant)=\"C\",\"X\",\"\")","v":{"$error":"#NAME?"}},{"$f":"IF(INDEX(periode2,NEVAL,Nenfant)=\"B\",\"X\",\"\")","v":{"$error":"#NAME?"}},{"$f":"IF(INDEX(periode2,NEVAL,Nenfant)=\"A\",\"X\",\"\")","v":{"$error":"#NAME?"}},null,{"$f":"IF(INDEX(periode3,NEVAL,Nenfant)=\"D\",\"X\",\"\")","v":{"$error":"#NAME?"}},{"$f":"IF(INDEX(periode3,NEVAL,Nenfant)=\"C\",\"X\",\"\")","v":{"$error":"#NAME?"}},{"$f":"IF(INDEX(periode3,NEVAL,Nenfant)=\"B\",\"X\",\"\")","v":{"$error":"#NAME?"}},{"$f":"IF(INDEX(periode3,NEVAL,Nenfant)=\"A\",\"X\",\"\")","v":{"$error":"#NAME?"}},null,{"$f":"IF(INDEX(periode4,NEVAL,Nenfant)=\"D\",\"X\",\"\")","v":{"$error":"#NAME?"}},{"$f":"IF(INDEX(periode4,NEVAL,Nenfant)=\"C\",\"X\",\"\")","v":{"$error":"#NAME?"}},{"$f":"IF(INDEX(periode4,NEVAL,Nenfant)=\"B\",\"X\",\"\")","v":{"$error":"#NAME?"}},{"$f":"IF(INDEX(periode4,NEVAL,Nenfant)=\"A\",\"X\",\"\")","v":{"$error":"#NAME?"}},null,{"$f":"IF(INDEX(periode5,NEVAL,Nenfant)=\"D\",\"X\",\"\")","v":{"$error":"#NAME?"}},{"$f":"IF(INDEX(periode5,NEVAL,Nenfant)=\"C\",\"X\",\"\")","v":{"$error":"#NAME?"}},{"$f":"IF(INDEX(periode5,NEVAL,Nenfant)=\"B\",\"X\",\"\")","v":{"$error":"#NAME?"}},{"$f":"IF(INDEX(periode5,NEVAL,Nenfant)=\"A\",\"X\",\"\")","v":{"$error":"#NAME?"}},null,{"$f":"IF(INDEX(periode6,NEVAL,Nenfant)=\"D\",\"X\",\"\")","v":{"$error":"#NAME?"}},{"$f":"IF(INDEX(periode6,NEVAL,Nenfant)=\"C\",\"X\",\"\")","v":{"$error":"#NAME?"}},{"$f":"IF(INDEX(periode6,NEVAL,Nenfant)=\"B\",\"X\",\"\")","v":{"$error":"#NAME?"}},{"$f":"IF(INDEX(periode6,NEVAL,Nenfant)=\"A\",\"X\",\"\")","v":{"$error":"#NAME?"}}]
[43,{"$nulls":7},{"$f":"COUNTIF($G44:$G46,\"X\")","v":0},{"$f":"COUNTIF($H44:$H46,\"X\")","v":0},{"$f":"COUNTIF($I44:$I46,\"X\")","v":0},{"$f":"COUNTIF($J44:$J46,\"X\")","v":0},null,{"$f":"COUNTIF($G44:$G46,\"X\")","v":0},{"$f":"COUNTIF($H44:$H46,\"X\")","v":0},{"$f":"COUNTIF($I44:$I46,\"X\")","v":0},{"$f":"COUNTIF($J44:$J46,\"X\")","v":0},null,{"$f":"COUNTIF($G44:$G46,\"X\")","v":0},{"$f":"COUNTIF($H44:$H46,\"X\")","v":0},{"$f":"COUNTIF($I44:$I46,\"X\")","v":0},{"$f":"COUNTIF($J44:$J46,\"X\")","v":0},null,{"$f":"COUNTIF($G44:$G46,\"X\")","v":0},{"$f":"COUNTIF($H44:$H46,\"X\")","v":0},{"$f":"COUNTIF($I44:$I46,\"X\")","v":0},{"$f":"COUNTIF(AA44:AA46,\"X\")","v":0},null,{"$f":"COUNTIF($G44:$G46,\"X\")","v":0},{"$f":"COUNTIF($H44:$H46,\"X\")","v":0},{"$f":"COUNTIF($I44:$I46,\"X\")","v":0},{"$f":"COUNTIF($J44:$J46,\"X\")","v":0},null,{"$f":"COUNTIF($G44:$G46,\"X\")","v":0},{"$f":"COUNTIF($H44:$H46,\"X\")","v":0},{"$f":"COUNTIF($I44:$I46,\"X\")","v":0},{"$f":"COUNTIF($J44:$J46,\"X\")","v":0}]
[44,{"$nulls":7},{"$f":"IF(INDEX(periode1,NEVAL,Nenfant)=\"D\",\"X\",\"\")","v":{"$error":"#NAME?"}},{"$f":"IF(INDEX(periode1,NEVAL,Nenfant)=\"C\",\"X\",\"\")","v":{"$error":"#NAME?"}},{"$f":"IF(INDEX(periode1,NEVAL,Nenfant)=\"B\",\"X\",\"\")","v":{"$error":"#NAME?"}},{"$f":"IF(INDEX(periode1,NEVAL,Nenfant)=\"A\",\"X\",\"\")","v":{"$error":"#NAME?"}},null,{"$f":"IF(INDEX(periode2,NEVAL,Nenfant)=\"D\",\"X\",\"\")","v":{"$error":"#NAME?"}},{"$f":"IF(INDEX(periode2,NEVAL,Nenfant)=\"C\",\"X\",\"\")","v":{"$error":"#NAME?"}},{"$f":"IF(INDEX(periode2,NEVAL,Nenfant)=\"B\",\"X\",\"\")","v":{"$error":"#NAME?"}},{"$f":"IF(INDEX(periode2,NEVAL,Nenfant)=\"A\",\"X\",\"\")","v":{"$error":"#NAME?"}},null,{"$f":"IF(INDEX(periode3,NEVAL,Nenfant)=\"D\",\"X\",\"\")","v":{"$error":"#NAME?"}},{"$f":"IF(INDEX(periode3,NEVAL,Nenfant)=\"C\",\"X\",\"\")","v":{"$error":"#NAME?"}},{"$f":"IF(INDEX(periode3,NEVAL,Nenfant)=\"B\",\"X\",\"\")","v":{"$error":"#NAME?"}},{"$f":"IF(INDEX(periode3,NEVAL,Nenfant)=\"A\",\"X\",\"\")","v":{"$error":"#NAME?"}},null,{"$f":"IF(INDEX(periode4,NEVAL,Nenfant)=\"D\",\"X\",\"\")","v":{"$error":"#NAME?"}},{"$f":"IF(INDEX(periode4,NEVAL,Nenfant)=\"C\",\"X\",\"\")","v":{"$error":"#NAME?"}},{"$f":"IF(INDEX(periode4,NEVAL,Nenfant)=\"B\",\"X\",\"\")","v":{"$error":"#NAME?"}},{"$f":"IF(INDEX(periode4,NEVAL,Nenfant)=\"A\",\"X\",\"\")","v":{"$error":"#NAME?"}},null,{"$f":"IF(INDEX(periode5,NEVAL,Nenfant)=\"D\",\"X\",\"\")","v":{"$error":"#NAME?"}},{"$f":"IF(INDEX(periode5,NEVAL,Nenfant)=\"C\",\"X\",\"\")","v":{"$error":"#NAME?"}},{"$f":"IF(INDEX(periode5,NEVAL,Nenfant)=\"B\",\"X\",\"\")","v":{"$error":"#NAME?"}},{"$f":"IF(INDEX(periode5,NEVAL,Nenfant)=\"A\",\"X\",\"\")","v":{"$error":"#NAME?"}},null,{"$f":"IF(INDEX(periode6,NEVAL,Nenfant)=\"D\",\"X\",\"\")","v":{"$error":"#NAME?"}},{"$f":"IF(INDEX(periode6,NEVAL,Nenfant)=\"C\",\"X\",\"\")","v":{"$error":"#NAME?"}},{"$f":"IF(INDEX(periode6,NEVAL,Nenfant)=\"B\",\"X\",\"\")","v":{"$error":"#NAME?"}},{"$f":"IF(INDEX(periode6,NEVAL,Nenfant)=\"A\",\"X\",\"\")","v":{"$error":"#NAME?"}}]
[45,{"$nulls":7},{"$f":"IF(INDEX(periode1,NEVAL,Nenfant)=\"D\",\"X\",\"\")","v":{"$error":"#NAME?"}},{"$f":"IF(INDEX(periode1,NEVAL,Nenfant)=\"C\",\"X\",\"\")","v":{"$error":"#NAME?"}},{"$f":"IF(INDEX(periode1,NEVAL,Nenfant)=\"B\",\"X\",\"\")","v":{"$error":"#NAME?"}},{"$f":"IF(INDEX(periode1,NEVAL,Nenfant)=\"A\",\"X\",\"\")","v":{"$error":"#NAME?"}},null,{"$f":"IF(INDEX(periode2,NEVAL,Nenfant)=\"D\",\"X\",\"\")","v":{"$error":"#NAME?"}},{"$f":"IF(INDEX(periode2,NEVAL,Nenfant)=\"C\",\"X\",\"\")","v":{"$error":"#NAME?"}},{"$f":"IF(INDEX(periode2,NEVAL,Nenfant)=\"B\",\"X\",\"\")","v":{"$error":"#NAME?"}},{"$f":"IF(INDEX(periode2,NEVAL,Nenfant)=\"A\",\"X\",\"\")","v":{"$error":"#NAME?"}},null,{"$f":"IF(INDEX(periode3,NEVAL,Nenfant)=\"D\",\"X\",\"\")","v":{"$error":"#NAME?"}},{"$f":"IF(INDEX(periode3,NEVAL,Nenfant)=\"C\",\"X\",\"\")","v":{"$error":"#NAME?"}},{"$f":"IF(INDEX(periode3,NEVAL,Nenfant)=\"B\",\"X\",\"\")","v":{"$error":"#NAME?"}},{"$f":"IF(INDEX(periode3,NEVAL,Nenfant)=\"A\",\"X\",\"\")","v":{"$error":"#NAME?"}},null,{"$f":"IF(INDEX(periode4,NEVAL,Nenfant)=\"D\",\"X\",\"\")","v":{"$error":"#NAME?"}},{"$f":"IF(INDEX(periode4,NEVAL,Nenfant)=\"C\",\"X\",\"\")","v":{"$error":"#NAME?"}},{"$f":"IF(INDEX(periode4,NEVAL,Nenfant)=\"B\",\"X\",\"\")","v":{"$error":"#NAME?"}},{"$f":"IF(INDEX(periode4,NEVAL,Nenfant)=\"A\",\"X\",\"\")","v":{"$error":"#NAME?"}},null,{"$f":"IF(INDEX(periode5,NEVAL,Nenfant)=\"D\",\"X\",\"\")","v":{"$error":"#NAME?"}},{"$f":"IF(INDEX(periode5,NEVAL,Nenfant)=\"C\",\"X\",\"\")","v":{"$error":"#NAME?"}},{"$f":"IF(INDEX(periode5,NEVAL,Nenfant)=\"B\",\"X\",\"\")","v":{"$error":"#NAME?"}},{"$f":"IF(INDEX(periode5,NEVAL,Nenfant)=\"A\",\"X\",\"\")","v":{"$error":"#NAME?"}},null,{"$f":"IF(INDEX(periode6,NEVAL,Nenfant)=\"D\",\"X\",\"\")","v":{"$error":"#NAME?"}},{"$f":"IF(INDEX(periode6,NEVAL,Nenfant)=\"C\",\"X\",\"\")","v":{"$error":"#NAME?"}},{"$f":"IF(INDEX(periode6,NEVAL,Nenfant)=\"B\",\"X\",\"\")","v":{"$error":"#NAME?"}},{"$f":"IF(INDEX(periode6,NEVAL,Nenfant)=\"A\",\"X\",\"\")","v":{"$error":"#NAME?"}}]
[46,{"$nulls":7},{"$f":"IF(INDEX(periode1,NEVAL,Nenfant)=\"D\",\"X\",\"\")","v":{"$error":"#NAME?"}},{"$f":"IF(INDEX(periode1,NEVAL,Nenfant)=\"C\",\"X\",\"\")","v":{"$error":"#NAME?"}},{"$f":"IF(INDEX(periode1,NEVAL,Nenfant)=\"B\",\"X\",\"\")","v":{"$error":"#NAME?"}},{"$f":"IF(INDEX(periode1,NEVAL,Nenfant)=\"A\",\"X\",\"\")","v":{"$error":"#NAME?"}},null,{"$f":"IF(INDEX(periode2,NEVAL,Nenfant)=\"D\",\"X\",\"\")","v":{"$error":"#NAME?"}},{"$f":"IF(INDEX(periode2,NEVAL,Nenfant)=\"C\",\"X\",\"\")","v":{"$error":"#NAME?"}},{"$f":"IF(INDEX(periode2,NEVAL,Nenfant)=\"B\",\"X\",\"\")","v":{"$error":"#NAME?"}},{"$f":"IF(INDEX(periode2,NEVAL,Nenfant)=\"A\",\"X\",\"\")","v":{"$error":"#NAME?"}},null,{"$f":"IF(INDEX(periode3,NEVAL,Nenfant)=\"D\",\"X\",\"\")","v":{"$error":"#NAME?"}},{"$f":"IF(INDEX(periode3,NEVAL,Nenfant)=\"C\",\"X\",\"\")","v":{"$error":"#NAME?"}},{"$f":"IF(INDEX(periode3,NEVAL,Nenfant)=\"B\",\"X\",\"\")","v":{"$error":"#NAME?"}},{"$f":"IF(INDEX(periode3,NEVAL,Nenfant)=\"A\",\"X\",\"\")","v":{"$error":"#NAME?"}},null,{"$f":"IF(INDEX(periode4,NEVAL,Nenfant)=\"D\",\"X\",\"\")","v":{"$error":"#NAME?"}},{"$f":"IF(INDEX(periode4,NEVAL,Nenfant)=\"C\",\"X\",\"\")","v":{"$error":"#NAME?"}},{"$f":"IF(INDEX(periode4,NEVAL,Nenfant)=\"B\",\"X\",\"\")","v":{"$error":"#NAME?"}},{"$f":"IF(INDEX(periode4,NEVAL,Nenfant)=\"A\",\"X\",\"\")","v":{"$error":"#NAME?"}},null,{"$f":"IF(INDEX(periode5,NEVAL,Nenfant)=\"D\",\"X\",\"\")","v":{"$error":"#NAME?"}},{"$f":"IF(INDEX(periode5,NEVAL,Nenfant)=\"C\",\"X\",\"\")","v":{"$error":"#NAME?"}},{"$f":"IF(INDEX(periode5,NEVAL,Nenfant)=\"B\",\"X\",\"\")","v":{"$error":"#NAME?"}},{"$f":"IF(INDEX(periode5,NEVAL,Nenfant)=\"A\",\"X\",\"\")","v":{"$error":"#NAME?"}},null,{"$f":"IF(INDEX(periode6,NEVAL,Nenfant)=\"D\",\"X\",\"\")","v":{"$error":"#NAME?"}},{"$f":"IF(INDEX(periode6,NEVAL,Nenfant)=\"C\",\"X\",\"\")","v":{"$error":"#NAME?"}},{"$f":"IF(INDEX(periode6,NEVAL,Nenfant)=\"B\",\"X\",\"\")","v":{"$error":"#NAME?"}},{"$f":"IF(INDEX(periode6,NEVAL,Nenfant)=\"A\",\"X\",\"\")","v":{"$error":"#NAME?"}}]
[47,{"$nulls":7},{"$f":"COUNTIF($G48:$G50,\"X\")","v":0},{"$f":"COUNTIF($H48:$H50,\"X\")","v":0},{"$f":"COUNTIF($I48:$I50,\"X\")","v":0},{"$f":"COUNTIF($J48:$J50,\"X\")","v":0},null,{"$f":"COUNTIF($G48:$G50,\"X\")","v":0},{"$f":"COUNTIF($H48:$H50,\"X\")","v":0},{"$f":"COUNTIF($I48:$I50,\"X\")","v":0},{"$f":"COUNTIF($J48:$J50,\"X\")","v":0},null,{"$f":"COUNTIF($G48:$G50,\"X\")","v":0},{"$f":"COUNTIF($H48:$H50,\"X\")","v":0},{"$f":"COUNTIF($I48:$I50,\"X\")","v":0},{"$f":"COUNTIF($J48:$J50,\"X\")","v":0},null,{"$f":"COUNTIF($G48:$G50,\"X\")","v":0},{"$f":"COUNTIF($H48:$H50,\"X\")","v":0},{"$f":"COUNTIF($I48:$I50,\"X\")","v":0},{"$f":"COUNTIF(AA48:AA50,\"X\")","v":0},null,{"$f":"COUNTIF($G48:$G50,\"X\")","v":0},{"$f":"COUNTIF($H48:$H50,\"X\")","v":0},{"$f":"COUNTIF($I48:$I50,\"X\")","v":0},{"$f":"COUNTIF($J48:$J50,\"X\")","v":0},null,{"$f":"COUNTIF($G48:$G50,\"X\")","v":0},{"$f":"COUNTIF($H48:$H50,\"X\")","v":0},{"$f":"COUNTIF($I48:$I50,\"X\")","v":0},{"$f":"COUNTIF($J48:$J50,\"X\")","v":0}]
[48,{"$nulls":7},{"$f":"IF(INDEX(periode1,NEVAL,Nenfant)=\"D\",\"X\",\"\")","v":{"$error":"#NAME?"}},{"$f":"IF(INDEX(periode1,NEVAL,Nenfant)=\"C\",\"X\",\"\")","v":{"$error":"#NAME?"}},{"$f":"IF(INDEX(periode1,NEVAL,Nenfant)=\"B\",\"X\",\"\")","v":{"$error":"#NAME?"}},{"$f":"IF(INDEX(periode1,NEVAL,Nenfant)=\"A\",\"X\",\"\")","v":{"$error":"#NAME?"}},null,{"$f":"IF(INDEX(periode2,NEVAL,Nenfant)=\"D\",\"X\",\"\")","v":{"$error":"#NAME?"}},{"$f":"IF(INDEX(periode2,NEVAL,Nenfant)=\"C\",\"X\",\"\")","v":{"$error":"#NAME?"}},{"$f":"IF(INDEX(periode2,NEVAL,Nenfant)=\"B\",\"X\",\"\")","v":{"$error":"#NAME?"}},{"$f":"IF(INDEX(periode2,NEVAL,Nenfant)=\"A\",\"X\",\"\")","v":{"$error":"#NAME?"}},null,{"$f":"IF(INDEX(periode3,NEVAL,Nenfant)=\"D\",\"X\",\"\")","v":{"$error":"#NAME?"}},{"$f":"IF(INDEX(periode3,NEVAL,Nenfant)=\"C\",\"X\",\"\")","v":{"$error":"#NAME?"}},{"$f":"IF(INDEX(periode3,NEVAL,Nenfant)=\"B\",\"X\",\"\")","v":{"$error":"#NAME?"}},{"$f":"IF(INDEX(periode3,NEVAL,Nenfant)=\"A\",\"X\",\"\")","v":{"$error":"#NAME?"}},null,{"$f":"IF(INDEX(periode4,NEVAL,Nenfant)=\"D\",\"X\",\"\")","v":{"$error":"#NAME?"}},{"$f":"IF(INDEX(periode4,NEVAL,Nenfant)=\"C\",\"X\",\"\")","v":{"$error":"#NAME?"}},{"$f":"IF(INDEX(periode4,NEVAL,Nenfant)=\"B\",\"X\",\"\")","v":{"$error":"#NAME?"}},{"$f":"IF(INDEX(periode4,NEVAL,Nenfant)=\"A\",\"X\",\"\")","v":{"$error":"#NAME?"}},null,{"$f":"IF(INDEX(periode5,NEVAL,Nenfant)=\"D\",\"X\",\"\")","v":{"$error":"#NAME?"}},{"$f":"IF(INDEX(periode5,NEVAL,Nenfant)=\"C\",\"X\",\"\")","v":{"$error":"#NAME?"}},{"$f":"IF(INDEX(periode5,NEVAL,Nenfant)=\"B\",\"X\",\"\")","v":{"$error":"#NAME?"}},{"$f":"IF(INDEX(periode5,NEVAL,Nenfant)=\"A\",\"X\",\"\")","v":{"$error":"#NAME?"}},null,{"$f":"IF(INDEX(periode6,NEVAL,Nenfant)=\"D\",\"X\",\"\")","v":{"$error":"#NAME?"}},{"$f":"IF(INDEX(periode6,NEVAL,Nenfant)=\"C\",\"X\",\"\")","v":{"$error":"#NAME?"}},{"$f":"IF(INDEX(periode6,NEVAL,Nenfant)=\"B\",\"X\",\"\")","v":{"$error":"#NAME?"}},{"$f":"IF(INDEX(periode6,NEVAL,Nenfant)=\"A\",\"X\",\"\")","v":{"$error":"#NAME?"}}]
[49,{"$nulls":7},{"$f":"IF(INDEX(periode1,NEVAL,Nenfant)=\"D\",\"X\",\"\")","v":{"$error":"#NAME?"}},{"$f":"IF(INDEX(periode1,NEVAL,Nenfant)=\"C\",\"X\",\"\")","v":{"$error":"#NAME?"}},{"$f":"IF(INDEX(periode1,NEVAL,Nenfant)=\"B\",\"X\",\"\")","v":{"$error":"#NAME?"}},{"$f":"IF(INDEX(periode1,NEVAL,Nenfant)=\"A\",\"X\",\"\")","v":{"$error":"#NAME?"}},null,{"$f":"IF(INDEX(periode2,NEVAL,Nenfant)=\"D\",\"X\",\"\")","v":{"$error":"#NAME?"}},{"$f":"IF(INDEX(periode2,NEVAL,Nenfant)=\"C\",\"X\",\"\")","v":{"$error":"#NAME?"}},{"$f":"IF(INDEX(periode2,NEVAL,Nenfant)=\"B\",\"X\",\"\")","v":{"$error":"#NAME?"}},{"$f":"IF(INDEX(periode2,NEVAL,Nenfant)=\"A\",\"X\",\"\")","v":{"$error":"#NAME?"}},null,{"$f":"IF(INDEX(periode3,NEVAL,Nenfant)=\"D\",\"X\",\"\")","v":{"$error":"#NAME?"}},{"$f":"IF(INDEX(periode3,NEVAL,Nenfant)=\"C\",\"X\",\"\")","v":{"$error":"#NAME?"}},{"$f":"IF(INDEX(periode3,NEVAL,Nenfant)=\"B\",\"X\",\"\")","v":{"$error":"#NAME?"}},{"$f":"IF(INDEX(periode3,NEVAL,Nenfant)=\"A\",\"X\",\"\")","v":{"$error":"#NAME?"}},null,{"$f":"IF(INDEX(periode4,NEVAL,Nenfant)=\"D\",\"X\",\"\")","v":{"$error":"#NAME?"}},{"$f":"IF(INDEX(periode4,NEVAL,Nenfant)=\"C\",\"X\",\"\")","v":{"$error":"#NAME?"}},{"$f":"IF(INDEX(periode4,NEVAL,Nenfant)=\"B\",\"X\",\"\")","v":{"$error":"#NAME?"}},{"$f":"IF(INDEX(periode4,NEVAL,Nenfant)=\"A\",\"X\",\"\")","v":{"$error":"#NAME?"}},null,{"$f":"IF(INDEX(periode5,NEVAL,Nenfant)=\"D\",\"X\",\"\")","v":{"$error":"#NAME?"}},{"$f":"IF(INDEX(periode5,NEVAL,Nenfant)=\"C\",\"X\",\"\")","v":{"$error":"#NAME?"}},{"$f":"IF(INDEX(periode5,NEVAL,Nenfant)=\"B\",\"X\",\"\")","v":{"$error":"#NAME?"}},{"$f":"IF(INDEX(periode5,NEVAL,Nenfant)=\"A\",\"X\",\"\")","v":{"$error":"#NAME?"}},null,{"$f":"IF(INDEX(periode6,NEVAL,Nenfant)=\"D\",\"X\",\"\")","v":{"$error":"#NAME?"}},{"$f":"IF(INDEX(periode6,NEVAL,Nenfant)=\"C\",\"X\",\"\")","v":{"$error":"#NAME?"}},{"$f":"IF(INDEX(periode6,NEVAL,Nenfant)=\"B\",\"X\",\"\")","v":{"$error":"#NAME?"}},{"$f":"IF(INDEX(periode6,NEVAL,Nenfant)=\"A\",\"X\",\"\")","v":{"$error":"#NAME?"}}]
[50,{"$nulls":7},{"$f":"IF(INDEX(periode1,NEVAL,Nenfant)=\"D\",\"X\",\"\")","v":{"$error":"#NAME?"}},{"$f":"IF(INDEX(periode1,NEVAL,Nenfant)=\"C\",\"X\",\"\")","v":{"$error":"#NAME?"}},{"$f":"IF(INDEX(periode1,NEVAL,Nenfant)=\"B\",\"X\",\"\")","v":{"$error":"#NAME?"}},{"$f":"IF(INDEX(periode1,NEVAL,Nenfant)=\"A\",\"X\",\"\")","v":{"$error":"#NAME?"}},null,{"$f":"IF(INDEX(periode2,NEVAL,Nenfant)=\"D\",\"X\",\"\")","v":{"$error":"#NAME?"}},{"$f":"IF(INDEX(periode2,NEVAL,Nenfant)=\"C\",\"X\",\"\")","v":{"$error":"#NAME?"}},{"$f":"IF(INDEX(periode2,NEVAL,Nenfant)=\"B\",\"X\",\"\")","v":{"$error":"#NAME?"}},{"$f":"IF(INDEX(periode2,NEVAL,Nenfant)=\"A\",\"X\",\"\")","v":{"$error":"#NAME?"}},null,{"$f":"IF(INDEX(periode3,NEVAL,Nenfant)=\"D\",\"X\",\"\")","v":{"$error":"#NAME?"}},{"$f":"IF(INDEX(periode3,NEVAL,Nenfant)=\"C\",\"X\",\"\")","v":{"$error":"#NAME?"}},{"$f":"IF(INDEX(periode3,NEVAL,Nenfant)=\"B\",\"X\",\"\")","v":{"$error":"#NAME?"}},{"$f":"IF(INDEX(periode3,NEVAL,Nenfant)=\"A\",\"X\",\"\")","v":{"$error":"#NAME?"}},null,{"$f":"IF(INDEX(periode4,NEVAL,Nenfant)=\"D\",\"X\",\"\")","v":{"$error":"#NAME?"}},{"$f":"IF(INDEX(periode4,NEVAL,Nenfant)=\"C\",\"X\",\"\")","v":{"$error":"#NAME?"}},{"$f":"IF(INDEX(periode4,NEVAL,Nenfant)=\"B\",\"X\",\"\")","v":{"$error":"#NAME?"}},{"$f":"IF(INDEX(periode4,NEVAL,Nenfant)=\"A\",\"X\",\"\")","v":{"$error":"#NAME?"}},null,{"$f":"IF(INDEX(periode5,NEVAL,Nenfant)=\"D\",\"X\",\"\")","v":{"$error":"#NAME?"}},{"$f":"IF(INDEX(periode5,NEVAL,Nenfant)=\"C\",\"X\",\"\")","v":{"$error":"#NAME?"}},{"$f":"IF(INDEX(periode5,NEVAL,Nenfant)=\"B\",\"X\",\"\")","v":{"$error":"#NAME?"}},{"$f":"IF(INDEX(periode5,NEVAL,Nenfant)=\"A\",\"X\",\"\")","v":{"$error":"#NAME?"}},null,{"$f":"IF(INDEX(periode6,NEVAL,Nenfant)=\"D\",\"X\",\"\")","v":{"$error":"#NAME?"}},{"$f":"IF(INDEX(periode6,NEVAL,Nenfant)=\"C\",\"X\",\"\")","v":{"$error":"#NAME?"}},{"$f":"IF(INDEX(periode6,NEVAL,Nenfant)=\"B\",\"X\",\"\")","v":{"$error":"#NAME?"}},{"$f":"IF(INDEX(periode6,NEVAL,Nenfant)=\"A\",\"X\",\"\")","v":{"$error":"#NAME?"}}]
[51,{"$nulls":7},{"$f":"COUNTIF($G52:$G53,\"X\")","v":0},{"$f":"COUNTIF($H52:$H53,\"X\")","v":0},{"$f":"COUNTIF($I52:$I53,\"X\")","v":0},{"$f":"COUNTIF($J52:$J53,\"X\")","v":0},null,{"$f":"COUNTIF($G52:$G53,\"X\")","v":0},{"$f":"COUNTIF($H52:$H53,\"X\")","v":0},{"$f":"COUNTIF($I52:$I53,\"X\")","v":0},{"$f":"COUNTIF($J52:$J53,\"X\")","v":0},null,{"$f":"COUNTIF($G52:$G53,\"X\")","v":0},{"$f":"COUNTIF($H52:$H53,\"X\")","v":0},{"$f":"COUNTIF($I52:$I53,\"X\")","v":0},{"$f":"COUNTIF($J52:$J53,\"X\")","v":0},null,{"$f":"COUNTIF($G52:$G53,\"X\")","v":0},{"$f":"COUNTIF($H52:$H53,\"X\")","v":0},{"$f":"COUNTIF($I52:$I53,\"X\")","v":0},{"$f":"COUNTIF(AA52:AA53,\"X\")","v":0},null,{"$f":"COUNTIF($G52:$G53,\"X\")","v":0},{"$f":"COUNTIF($H52:$H53,\"X\")","v":0},{"$f":"COUNTIF($I52:$I53,\"X\")","v":0},{"$f":"COUNTIF($J52:$J53,\"X\")","v":0},null,{"$f":"COUNTIF($G52:$G53,\"X\")","v":0},{"$f":"COUNTIF($H52:$H53,\"X\")","v":0},{"$f":"COUNTIF($I52:$I53,\"X\")","v":0},{"$f":"COUNTIF($J52:$J53,\"X\")","v":0}]
[52,{"$nulls":7},{"$f":"IF(INDEX(periode1,NEVAL,Nenfant)=\"D\",\"X\",\"\")","v":{"$error":"#NAME?"}},{"$f":"IF(INDEX(periode1,NEVAL,Nenfant)=\"C\",\"X\",\"\")","v":{"$error":"#NAME?"}},{"$f":"IF(INDEX(periode1,NEVAL,Nenfant)=\"B\",\"X\",\"\")","v":{"$error":"#NAME?"}},{"$f":"IF(INDEX(periode1,NEVAL,Nenfant)=\"A\",\"X\",\"\")","v":{"$error":"#NAME?"}},null,{"$f":"IF(INDEX(periode2,NEVAL,Nenfant)=\"D\",\"X\",\"\")","v":{"$error":"#NAME?"}},{"$f":"IF(INDEX(periode2,NEVAL,Nenfant)=\"C\",\"X\",\"\")","v":{"$error":"#NAME?"}},{"$f":"IF(INDEX(periode2,NEVAL,Nenfant)=\"B\",\"X\",\"\")","v":{"$error":"#NAME?"}},{"$f":"IF(INDEX(periode2,NEVAL,Nenfant)=\"A\",\"X\",\"\")","v":{"$error":"#NAME?"}},null,{"$f":"IF(INDEX(periode3,NEVAL,Nenfant)=\"D\",\"X\",\"\")","v":{"$error":"#NAME?"}},{"$f":"IF(INDEX(periode3,NEVAL,Nenfant)=\"C\",\"X\",\"\")","v":{"$error":"#NAME?"}},{"$f":"IF(INDEX(periode3,NEVAL,Nenfant)=\"B\",\"X\",\"\")","v":{"$error":"#NAME?"}},{"$f":"IF(INDEX(periode3,NEVAL,Nenfant)=\"A\",\"X\",\"\")","v":{"$error":"#NAME?"}},null,{"$f":"IF(INDEX(periode4,NEVAL,Nenfant)=\"D\",\"X\",\"\")","v":{"$error":"#NAME?"}},{"$f":"IF(INDEX(periode4,NEVAL,Nenfant)=\"C\",\"X\",\"\")","v":{"$error":"#NAME?"}},{"$f":"IF(INDEX(periode4,NEVAL,Nenfant)=\"B\",\"X\",\"\")","v":{"$error":"#NAME?"}},{"$f":"IF(INDEX(periode4,NEVAL,Nenfant)=\"A\",\"X\",\"\")","v":{"$error":"#NAME?"}},null,{"$f":"IF(INDEX(periode5,NEVAL,Nenfant)=\"D\",\"X\",\"\")","v":{"$error":"#NAME?"}},{"$f":"IF(INDEX(periode5,NEVAL,Nenfant)=\"C\",\"X\",\"\")","v":{"$error":"#NAME?"}},{"$f":"IF(INDEX(periode5,NEVAL,Nenfant)=\"B\",\"X\",\"\")","v":{"$error":"#NAME?"}},{"$f":"IF(INDEX(periode5,NEVAL,Nenfant)=\"A\",\"X\",\"\")","v":{"$error":"#NAME?"}},null,{"$f":"IF(INDEX(periode6,NEVAL,Nenfant)=\"D\",\"X\",\"\")","v":{"$error":"#NAME?"}},{"$f":"IF(INDEX(periode6,NEVAL,Nenfant)=\"C\",\"X\",\"\")","v":{"$error":"#NAME?"}},{"$f":"IF(INDEX(periode6,NEVAL,Nenfant)=\"B\",\"X\",\"\")","v":{"$error":"#NAME?"}},{"$f":"IF(INDEX(periode6,NEVAL,Nenfant)=\"A\",\"X\",\"\")","v":{"$error":"#NAME?"}}]
[53,{"$nulls":7},{"$f":"IF(INDEX(periode1,NEVAL,Nenfant)=\"D\",\"X\",\"\")","v":{"$error":"#NAME?"}},{"$f":"IF(INDEX(periode1,NEVAL,Nenfant)=\"C\",\"X\",\"\")","v":{"$error":"#NAME?"}},{"$f":"IF(INDEX(periode1,NEVAL,Nenfant)=\"B\",\"X\",\"\")","v":{"$error":"#NAME?"}},{"$f":"IF(INDEX(periode1,NEVAL,Nenfant)=\"A\",\"X\",\"\")","v":{"$error":"#NAME?"}},null,{"$f":"IF(INDEX(periode2,NEVAL,Nenfant)=\"D\",\"X\",\"\")","v":{"$error":"#NAME?"}},{"$f":"IF(INDEX(periode2,NEVAL,Nenfant)=\"C\",\"X\",\"\")","v":{"$error":"#NAME?"}},{"$f":"IF(INDEX(periode2,NEVAL,Nenfant)=\"B\",\"X\",\"\")","v":{"$error":"#NAME?"}},{"$f":"IF(INDEX(periode2,NEVAL,Nenfant)=\"A\",\"X\",\"\")","v":{"$error":"#NAME?"}},null,{"$f":"IF(INDEX(periode3,NEVAL,Nenfant)=\"D\",\"X\",\"\")","v":{"$error":"#NAME?"}},{"$f":"IF(INDEX(periode3,NEVAL,Nenfant)=\"C\",\"X\",\"\")","v":{"$error":"#NAME?"}},{"$f":"IF(INDEX(periode3,NEVAL,Nenfant)=\"B\",\"X\",\"\")","v":{"$error":"#NAME?"}},{"$f":"IF(INDEX(periode3,NEVAL,Nenfant)=\"A\",\"X\",\"\")","v":{"$error":"#NAME?"}},null,{"$f":"IF(INDEX(periode4,NEVAL,Nenfant)=\"D\",\"X\",\"\")","v":{"$error":"#NAME?"}},{"$f":"IF(INDEX(periode4,NEVAL,Nenfant)=\"C\",\"X\",\"\")","v":{"$error":"#NAME?"}},{"$f":"IF(INDEX(periode4,NEVAL,Nenfant)=\"B\",\"X\",\"\")","v":{"$error":"#NAME?"}},{"$f":"IF(INDEX(periode4,NEVAL,Nenfant)=\"A\",\"X\",\"\")","v":{"$error":"#NAME?"}},null,{"$f":"IF(INDEX(periode5,NEVAL,Nenfant)=\"D\",\"X\",\"\")","v":{"$error":"#NAME?"}},{"$f":"IF(INDEX(periode5,NEVAL,Nenfant)=\"C\",\"X\",\"\")","v":{"$error":"#NAME?"}},{"$f":"IF(INDEX(periode5,NEVAL,Nenfant)=\"B\",\"X\",\"\")","v":{"$error":"#NAME?"}},{"$f":"IF(INDEX(periode5,NEVAL,Nenfant)=\"A\",\"X\",\"\")","v":{"$error":"#NAME?"}},null,{"$f":"IF(INDEX(periode6,NEVAL,Nenfant)=\"D\",\"X\",\"\")","v":{"$error":"#NAME?"}},{"$f":"IF(INDEX(periode6,NEVAL,Nenfant)=\"C\",\"X\",\"\")","v":{"$error":"#NAME?"}},{"$f":"IF(INDEX(periode6,NEVAL,Nenfant)=\"B\",\"X\",\"\")","v":{"$error":"#NAME?"}},{"$f":"IF(INDEX(periode6,NEVAL,Nenfant)=\"A\",\"X\",\"\")","v":{"$error":"#NAME?"}}]
[54,{"$nulls":7},{"$f":"COUNTIF($G55:$G57,\"X\")","v":0},{"$f":"COUNTIF($H55:$H57,\"X\")","v":0},{"$f":"COUNTIF($I55:$I57,\"X\")","v":0},{"$f":"COUNTIF($J55:$J57,\"X\")","v":0},null,{"$f":"COUNTIF($G55:$G57,\"X\")","v":0},{"$f":"COUNTIF($H55:$H57,\"X\")","v":0},{"$f":"COUNTIF($I55:$I57,\"X\")","v":0},{"$f":"COUNTIF($J55:$J57,\"X\")","v":0},null,{"$f":"COUNTIF($G55:$G57,\"X\")","v":0},{"$f":"COUNTIF($H55:$H57,\"X\")","v":0},{"$f":"COUNTIF($I55:$I57,\"X\")","v":0},{"$f":"COUNTIF($J55:$J57,\"X\")","v":0},null,{"$f":"COUNTIF($G55:$G57,\"X\")","v":0},{"$f":"COUNTIF($H55:$H57,\"X\")","v":0},{"$f":"COUNTIF($I55:$I57,\"X\")","v":0},{"$f":"COUNTIF(AA55:AA57,\"X\")","v":0},null,{"$f":"COUNTIF($G55:$G57,\"X\")","v":0},{"$f":"COUNTIF($H55:$H57,\"X\")","v":0},{"$f":"COUNTIF($I55:$I57,\"X\")","v":0},{"$f":"COUNTIF($J55:$J57,\"X\")","v":0},null,{"$f":"COUNTIF($G55:$G57,\"X\")","v":0},{"$f":"COUNTIF($H55:$H57,\"X\")","v":0},{"$f":"COUNTIF($I55:$I57,\"X\")","v":0},{"$f":"COUNTIF($J55:$J57,\"X\")","v":0}]
[55,{"$nulls":7},{"$f":"IF(INDEX(periode1,NEVAL,Nenfant)=\"D\",\"X\",\"\")","v":{"$error":"#NAME?"}},{"$f":"IF(INDEX(periode1,NEVAL,Nenfant)=\"C\",\"X\",\"\")","v":{"$error":"#NAME?"}},{"$f":"IF(INDEX(periode1,NEVAL,Nenfant)=\"B\",\"X\",\"\")","v":{"$error":"#NAME?"}},{"$f":"IF(INDEX(periode1,NEVAL,Nenfant)=\"A\",\"X\",\"\")","v":{"$error":"#NAME?"}},null,{"$f":"IF(INDEX(periode2,NEVAL,Nenfant)=\"D\",\"X\",\"\")","v":{"$error":"#NAME?"}},{"$f":"IF(INDEX(periode2,NEVAL,Nenfant)=\"C\",\"X\",\"\")","v":{"$error":"#NAME?"}},{"$f":"IF(INDEX(periode2,NEVAL,Nenfant)=\"B\",\"X\",\"\")","v":{"$error":"#NAME?"}},{"$f":"IF(INDEX(periode2,NEVAL,Nenfant)=\"A\",\"X\",\"\")","v":{"$error":"#NAME?"}},null,{"$f":"IF(INDEX(periode3,NEVAL,Nenfant)=\"D\",\"X\",\"\")","v":{"$error":"#NAME?"}},{"$f":"IF(INDEX(periode3,NEVAL,Nenfant)=\"C\",\"X\",\"\")","v":{"$error":"#NAME?"}},{"$f":"IF(INDEX(periode3,NEVAL,Nenfant)=\"B\",\"X\",\"\")","v":{"$error":"#NAME?"}},{"$f":"IF(INDEX(periode3,NEVAL,Nenfant)=\"A\",\"X\",\"\")","v":{"$error":"#NAME?"}},null,{"$f":"IF(INDEX(periode4,NEVAL,Nenfant)=\"D\",\"X\",\"\")","v":{"$error":"#NAME?"}},{"$f":"IF(INDEX(periode4,NEVAL,Nenfant)=\"C\",\"X\",\"\")","v":{"$error":"#NAME?"}},{"$f":"IF(INDEX(periode4,NEVAL,Nenfant)=\"B\",\"X\",\"\")","v":{"$error":"#NAME?"}},{"$f":"IF(INDEX(periode4,NEVAL,Nenfant)=\"A\",\"X\",\"\")","v":{"$error":"#NAME?"}},null,{"$f":"IF(INDEX(periode5,NEVAL,Nenfant)=\"D\",\"X\",\"\")","v":{"$error":"#NAME?"}},{"$f":"IF(INDEX(periode5,NEVAL,Nenfant)=\"C\",\"X\",\"\")","v":{"$error":"#NAME?"}},{"$f":"IF(INDEX(periode5,NEVAL,Nenfant)=\"B\",\"X\",\"\")","v":{"$error":"#NAME?"}},{"$f":"IF(INDEX(periode5,NEVAL,Nenfant)=\"A\",\"X\",\"\")","v":{"$error":"#NAME?"}},null,{"$f":"IF(INDEX(periode6,NEVAL,Nenfant)=\"D\",\"X\",\"\")","v":{"$error":"#NAME?"}},{"$f":"IF(INDEX(periode6,NEVAL,Nenfant)=\"C\",\"X\",\"\")","v":{"$error":"#NAME?"}},{"$f":"IF(INDEX(periode6,NEVAL,Nenfant)=\"B\",\"X\",\"\")","v":{"$error":"#NAME?"}},{"$f":"IF(INDEX(periode6,NEVAL,Nenfant)=\"A\",\"X\",\"\")","v":{"$error":"#NAME?"}}]
[56,{"$nulls":7},{"$f":"IF(INDEX(periode1,NEVAL,Nenfant)=\"D\",\"X\",\"\")","v":{"$error":"#NAME?"}},{"$f":"IF(INDEX(periode1,NEVAL,Nenfant)=\"C\",\"X\",\"\")","v":{"$error":"#NAME?"}},{"$f":"IF(INDEX(periode1,NEVAL,Nenfant)=\"B\",\"X\",\"\")","v":{"$error":"#NAME?"}},{"$f":"IF(INDEX(periode1,NEVAL,Nenfant)=\"A\",\"X\",\"\")","v":{"$error":"#NAME?"}},null,{"$f":"IF(INDEX(periode2,NEVAL,Nenfant)=\"D\",\"X\",\"\")","v":{"$error":"#NAME?"}},{"$f":"IF(INDEX(periode2,NEVAL,Nenfant)=\"C\",\"X\",\"\")","v":{"$error":"#NAME?"}},{"$f":"IF(INDEX(periode2,NEVAL,Nenfant)=\"B\",\"X\",\"\")","v":{"$error":"#NAME?"}},{"$f":"IF(INDEX(periode2,NEVAL,Nenfant)=\"A\",\"X\",\"\")","v":{"$error":"#NAME?"}},null,{"$f":"IF(INDEX(periode3,NEVAL,Nenfant)=\"D\",\"X\",\"\")","v":{"$error":"#NAME?"}},{"$f":"IF(INDEX(periode3,NEVAL,Nenfant)=\"C\",\"X\",\"\")","v":{"$error":"#NAME?"}},{"$f":"IF(INDEX(periode3,NEVAL,Nenfant)=\"B\",\"X\",\"\")","v":{"$error":"#NAME?"}},{"$f":"IF(INDEX(periode3,NEVAL,Nenfant)=\"A\",\"X\",\"\")","v":{"$error":"#NAME?"}},null,{"$f":"IF(INDEX(periode4,NEVAL,Nenfant)=\"D\",\"X\",\"\")","v":{"$error":"#NAME?"}},{"$f":"IF(INDEX(periode4,NEVAL,Nenfant)=\"C\",\"X\",\"\")","v":{"$error":"#NAME?"}},{"$f":"IF(INDEX(periode4,NEVAL,Nenfant)=\"B\",\"X\",\"\")","v":{"$error":"#NAME?"}},{"$f":"IF(INDEX(periode4,NEVAL,Nenfant)=\"A\",\"X\",\"\")","v":{"$error":"#NAME?"}},null,{"$f":"IF(INDEX(periode5,NEVAL,Nenfant)=\"D\",\"X\",\"\")","v":{"$error":"#NAME?"}},{"$f":"IF(INDEX(periode5,NEVAL,Nenfant)=\"C\",\"X\",\"\")","v":{"$error":"#NAME?"}},{"$f":"IF(INDEX(periode5,NEVAL,Nenfant)=\"B\",\"X\",\"\")","v":{"$error":"#NAME?"}},{"$f":"IF(INDEX(periode5,NEVAL,Nenfant)=\"A\",\"X\",\"\")","v":{"$error":"#NAME?"}},null,{"$f":"IF(INDEX(periode6,NEVAL,Nenfant)=\"D\",\"X\",\"\")","v":{"$error":"#NAME?"}},{"$f":"IF(INDEX(periode6,NEVAL,Nenfant)=\"C\",\"X\",\"\")","v":{"$error":"#NAME?"}},{"$f":"IF(INDEX(periode6,NEVAL,Nenfant)=\"B\",\"X\",\"\")","v":{"$error":"#NAME?"}},{"$f":"IF(INDEX(periode6,NEVAL,Nenfant)=\"A\",\"X\",\"\")","v":{"$error":"#NAME?"}}]
[57,{"$nulls":7},{"$f":"IF(INDEX(periode1,NEVAL,Nenfant)=\"D\",\"X\",\"\")","v":{"$error":"#NAME?"}},{"$f":"IF(INDEX(periode1,NEVAL,Nenfant)=\"C\",\"X\",\"\")","v":{"$error":"#NAME?"}},{"$f":"IF(INDEX(periode1,NEVAL,Nenfant)=\"B\",\"X\",\"\")","v":{"$error":"#NAME?"}},{"$f":"IF(INDEX(periode1,NEVAL,Nenfant)=\"A\",\"X\",\"\")","v":{"$error":"#NAME?"}},null,{"$f":"IF(INDEX(periode2,NEVAL,Nenfant)=\"D\",\"X\",\"\")","v":{"$error":"#NAME?"}},{"$f":"IF(INDEX(periode2,NEVAL,Nenfant)=\"C\",\"X\",\"\")","v":{"$error":"#NAME?"}},{"$f":"IF(INDEX(periode2,NEVAL,Nenfant)=\"B\",\"X\",\"\")","v":{"$error":"#NAME?"}},{"$f":"IF(INDEX(periode2,NEVAL,Nenfant)=\"A\",\"X\",\"\")","v":{"$error":"#NAME?"}},null,{"$f":"IF(INDEX(periode3,NEVAL,Nenfant)=\"D\",\"X\",\"\")","v":{"$error":"#NAME?"}},{"$f":"IF(INDEX(periode3,NEVAL,Nenfant)=\"C\",\"X\",\"\")","v":{"$error":"#NAME?"}},{"$f":"IF(INDEX(periode3,NEVAL,Nenfant)=\"B\",\"X\",\"\")","v":{"$error":"#NAME?"}},{"$f":"IF(INDEX(periode3,NEVAL,Nenfant)=\"A\",\"X\",\"\")","v":{"$error":"#NAME?"}},null,{"$f":"IF(INDEX(periode4,NEVAL,Nenfant)=\"D\",\"X\",\"\")","v":{"$error":"#NAME?"}},{"$f":"IF(INDEX(periode4,NEVAL,Nenfant)=\"C\",\"X\",\"\")","v":{"$error":"#NAME?"}},{"$f":"IF(INDEX(periode4,NEVAL,Nenfant)=\"B\",\"X\",\"\")","v":{"$error":"#NAME?"}},{"$f":"IF(INDEX(periode4,NEVAL,Nenfant)=\"A\",\"X\",\"\")","v":{"$error":"#NAME?"}},null,{"$f":"IF(INDEX(periode5,NEVAL,Nenfant)=\"D\",\"X\",\"\")","v":{"$error":"#NAME?"}},{"$f":"IF(INDEX(periode5,NEVAL,Nenfant)=\"C\",\"X\",\"\")","v":{"$error":"#NAME?"}},{"$f":"IF(INDEX(periode5,NEVAL,Nenfant)=\"B\",\"X\",\"\")","v":{"$error":"#NAME?"}},{"$f":"IF(INDEX(periode5,NEVAL,Nenfant)=\"A\",\"X\",\"\")","v":{"$error":"#NAME?"}},null,{"$f":"IF(INDEX(periode6,NEVAL,Nenfant)=\"D\",\"X\",\"\")","v":{"$error":"#NAME?"}},{"$f":"IF(INDEX(periode6,NEVAL,Nenfant)=\"C\",\"X\",\"\")","v":{"$error":"#NAME?"}},{"$f":"IF(INDEX(periode6,NEVAL,Nenfant)=\"B\",\"X\",\"\")","v":{"$error":"#NAME?"}},{"$f":"IF(INDEX(periode6,NEVAL,Nenfant)=\"A\",\"X\",\"\")","v":{"$error":"#NAME?"}}]
[58,{"$nulls":7},{"$f":"COUNTIF($G59:$G62,\"X\")","v":0},{"$f":"COUNTIF($H59:$H62,\"X\")","v":0},{"$f":"COUNTIF($I59:$I62,\"X\")","v":0},{"$f":"COUNTIF($J59:$J62,\"X\")","v":0},null,{"$f":"COUNTIF($G59:$G62,\"X\")","v":0},{"$f":"COUNTIF($H59:$H62,\"X\")","v":0},{"$f":"COUNTIF($I59:$I62,\"X\")","v":0},{"$f":"COUNTIF($J59:$J62,\"X\")","v":0},null,{"$f":"COUNTIF($G59:$G62,\"X\")","v":0},{"$f":"COUNTIF($H59:$H62,\"X\")","v":0},{"$f":"COUNTIF($I59:$I62,\"X\")","v":0},{"$f":"COUNTIF($J59:$J62,\"X\")","v":0},null,{"$f":"COUNTIF($G59:$G62,\"X\")","v":0},{"$f":"COUNTIF($H59:$H62,\"X\")","v":0},{"$f":"COUNTIF($I59:$I62,\"X\")","v":0},{"$f":"COUNTIF(AA59:AA62,\"X\")","v":0},null,{"$f":"COUNTIF($G59:$G62,\"X\")","v":0},{"$f":"COUNTIF($H59:$H62,\"X\")","v":0},{"$f":"COUNTIF($I59:$I62,\"X\")","v":0},{"$f":"COUNTIF($J59:$J62,\"X\")","v":0},null,{"$f":"COUNTIF($G59:$G62,\"X\")","v":0},{"$f":"COUNTIF($H59:$H62,\"X\")","v":0},{"$f":"COUNTIF($I59:$I62,\"X\")","v":0},{"$f":"COUNTIF($J59:$J62,\"X\")","v":0}]
[59,{"$nulls":7},{"$f":"IF(INDEX(periode1,NEVAL,Nenfant)=\"D\",\"X\",\"\")","v":{"$error":"#NAME?"}},{"$f":"IF(INDEX(periode1,NEVAL,Nenfant)=\"C\",\"X\",\"\")","v":{"$error":"#NAME?"}},{"$f":"IF(INDEX(periode1,NEVAL,Nenfant)=\"B\",\"X\",\"\")","v":{"$error":"#NAME?"}},{"$f":"IF(INDEX(periode1,NEVAL,Nenfant)=\"A\",\"X\",\"\")","v":{"$error":"#NAME?"}},null,{"$f":"IF(INDEX(periode2,NEVAL,Nenfant)=\"D\",\"X\",\"\")","v":{"$error":"#NAME?"}},{"$f":"IF(INDEX(periode2,NEVAL,Nenfant)=\"C\",\"X\",\"\")","v":{"$error":"#NAME?"}},{"$f":"IF(INDEX(periode2,NEVAL,Nenfant)=\"B\",\"X\",\"\")","v":{"$error":"#NAME?"}},{"$f":"IF(INDEX(periode2,NEVAL,Nenfant)=\"A\",\"X\",\"\")","v":{"$error":"#NAME?"}},null,{"$f":"IF(INDEX(periode3,NEVAL,Nenfant)=\"D\",\"X\",\"\")","v":{"$error":"#NAME?"}},{"$f":"IF(INDEX(periode3,NEVAL,Nenfant)=\"C\",\"X\",\"\")","v":{"$error":"#NAME?"}},{"$f":"IF(INDEX(periode3,NEVAL,Nenfant)=\"B\",\"X\",\"\")","v":{"$error":"#NAME?"}},{"$f":"IF(INDEX(periode3,NEVAL,Nenfant)=\"A\",\"X\",\"\")","v":{"$error":"#NAME?"}},null,{"$f":"IF(INDEX(periode4,NEVAL,Nenfant)=\"D\",\"X\",\"\")","v":{"$error":"#NAME?"}},{"$f":"IF(INDEX(periode4,NEVAL,Nenfant)=\"C\",\"X\",\"\")","v":{"$error":"#NAME?"}},{"$f":"IF(INDEX(periode4,NEVAL,Nenfant)=\"B\",\"X\",\"\")","v":{"$error":"#NAME?"}},{"$f":"IF(INDEX(periode4,NEVAL,Nenfant)=\"A\",\"X\",\"\")","v":{"$error":"#NAME?"}},null,{"$f":"IF(INDEX(periode5,NEVAL,Nenfant)=\"D\",\"X\",\"\")","v":{"$error":"#NAME?"}},{"$f":"IF(INDEX(periode5,NEVAL,Nenfant)=\"C\",\"X\",\"\")","v":{"$error":"#NAME?"}},{"$f":"IF(INDEX(periode5,NEVAL,Nenfant)=\"B\",\"X\",\"\")","v":{"$error":"#NAME?"}},{"$f":"IF(INDEX(periode5,NEVAL,Nenfant)=\"A\",\"X\",\"\")","v":{"$error":"#NAME?"}},null,{"$f":"IF(INDEX(periode6,NEVAL,Nenfant)=\"D\",\"X\",\"\")","v":{"$error":"#NAME?"}},{"$f":"IF(INDEX(periode6,NEVAL,Nenfant)=\"C\",\"X\",\"\")","v":{"$error":"#NAME?"}},{"$f":"IF(INDEX(periode6,NEVAL,Nenfant)=\"B\",\"X\",\"\")","v":{"$error":"#NAME?"}},{"$f":"IF(INDEX(periode6,NEVAL,Nenfant)=\"A\",\"X\",\"\")","v":{"$error":"#NAME?"}}]
[60,{"$nulls":7},{"$f":"IF(INDEX(periode1,NEVAL,Nenfant)=\"D\",\"X\",\"\")","v":{"$error":"#NAME?"}},{"$f":"IF(INDEX(periode1,NEVAL,Nenfant)=\"C\",\"X\",\"\")","v":{"$error":"#NAME?"}},{"$f":"IF(INDEX(periode1,NEVAL,Nenfant)=\"B\",\"X\",\"\")","v":{"$error":"#NAME?"}},{"$f":"IF(INDEX(periode1,NEVAL,Nenfant)=\"A\",\"X\",\"\")","v":{"$error":"#NAME?"}},null,{"$f":"IF(INDEX(periode2,NEVAL,Nenfant)=\"D\",\"X\",\"\")","v":{"$error":"#NAME?"}},{"$f":"IF(INDEX(periode2,NEVAL,Nenfant)=\"C\",\"X\",\"\")","v":{"$error":"#NAME?"}},{"$f":"IF(INDEX(periode2,NEVAL,Nenfant)=\"B\",\"X\",\"\")","v":{"$error":"#NAME?"}},{"$f":"IF(INDEX(periode2,NEVAL,Nenfant)=\"A\",\"X\",\"\")","v":{"$error":"#NAME?"}},null,{"$f":"IF(INDEX(periode3,NEVAL,Nenfant)=\"D\",\"X\",\"\")","v":{"$error":"#NAME?"}},{"$f":"IF(INDEX(periode3,NEVAL,Nenfant)=\"C\",\"X\",\"\")","v":{"$error":"#NAME?"}},{"$f":"IF(INDEX(periode3,NEVAL,Nenfant)=\"B\",\"X\",\"\")","v":{"$error":"#NAME?"}},{"$f":"IF(INDEX(periode3,NEVAL,Nenfant)=\"A\",\"X\",\"\")","v":{"$error":"#NAME?"}},null,{"$f":"IF(INDEX(periode4,NEVAL,Nenfant)=\"D\",\"X\",\"\")","v":{"$error":"#NAME?"}},{"$f":"IF(INDEX(periode4,NEVAL,Nenfant)=\"C\",\"X\",\"\")","v":{"$error":"#NAME?"}},{"$f":"IF(INDEX(periode4,NEVAL,Nenfant)=\"B\",\"X\",\"\")","v":{"$error":"#NAME?"}},{"$f":"IF(INDEX(periode4,NEVAL,Nenfant)=\"A\",\"X\",\"\")","v":{"$error":"#NAME?"}},null,{"$f":"IF(INDEX(periode5,NEVAL,Nenfant)=\"D\",\"X\",\"\")","v":{"$error":"#NAME?"}},{"$f":"IF(INDEX(periode5,NEVAL,Nenfant)=\"C\",\"X\",\"\")","v":{"$error":"#NAME?"}},{"$f":"IF(INDEX(periode5,NEVAL,Nenfant)=\"B\",\"X\",\"\")","v":{"$error":"#NAME?"}},{"$f":"IF(INDEX(periode5,NEVAL,Nenfant)=\"A\",\"X\",\"\")","v":{"$error":"#NAME?"}},null,{"$f":"IF(INDEX(periode6,NEVAL,Nenfant)=\"D\",\"X\",\"\")","v":{"$error":"#NAME?"}},{"$f":"IF(INDEX(periode6,NEVAL,Nenfant)=\"C\",\"X\",\"\")","v":{"$error":"#NAME?"}},{"$f":"IF(INDEX(periode6,NEVAL,Nenfant)=\"B\",\"X\",\"\")","v":{"$error":"#NAME?"}},{"$f":"IF(INDEX(periode6,NEVAL,Nenfant)=\"A\",\"X\",\"\")","v":{"$error":"#NAME?"}}]
[61,{"$nulls":7},{"$f":"IF(INDEX(periode1,NEVAL,Nenfant)=\"D\",\"X\",\"\")","v":{"$error":"#NAME?"}},{"$f":"IF(INDEX(periode1,NEVAL,Nenfant)=\"C\",\"X\",\"\")","v":{"$error":"#NAME?"}},{"$f":"IF(INDEX(periode1,NEVAL,Nenfant)=\"B\",\"X\",\"\")","v":{"$error":"#NAME?"}},{"$f":"IF(INDEX(periode1,NEVAL,Nenfant)=\"A\",\"X\",\"\")","v":{"$error":"#NAME?"}},null,{"$f":"IF(INDEX(periode2,NEVAL,Nenfant)=\"D\",\"X\",\"\")","v":{"$error":"#NAME?"}},{"$f":"IF(INDEX(periode2,NEVAL,Nenfant)=\"C\",\"X\",\"\")","v":{"$error":"#NAME?"}},{"$f":"IF(INDEX(periode2,NEVAL,Nenfant)=\"B\",\"X\",\"\")","v":{"$error":"#NAME?"}},{"$f":"IF(INDEX(periode2,NEVAL,Nenfant)=\"A\",\"X\",\"\")","v":{"$error":"#NAME?"}},null,{"$f":"IF(INDEX(periode3,NEVAL,Nenfant)=\"D\",\"X\",\"\")","v":{"$error":"#NAME?"}},{"$f":"IF(INDEX(periode3,NEVAL,Nenfant)=\"C\",\"X\",\"\")","v":{"$error":"#NAME?"}},{"$f":"IF(INDEX(periode3,NEVAL,Nenfant)=\"B\",\"X\",\"\")","v":{"$error":"#NAME?"}},{"$f":"IF(INDEX(periode3,NEVAL,Nenfant)=\"A\",\"X\",\"\")","v":{"$error":"#NAME?"}},null,{"$f":"IF(INDEX(periode4,NEVAL,Nenfant)=\"D\",\"X\",\"\")","v":{"$error":"#NAME?"}},{"$f":"IF(INDEX(periode4,NEVAL,Nenfant)=\"C\",\"X\",\"\")","v":{"$error":"#NAME?"}},{"$f":"IF(INDEX(periode4,NEVAL,Nenfant)=\"B\",\"X\",\"\")","v":{"$error":"#NAME?"}},{"$f":"IF(INDEX(periode4,NEVAL,Nenfant)=\"A\",\"X\",\"\")","v":{"$error":"#NAME?"}},null,{"$f":"IF(INDEX(periode5,NEVAL,Nenfant)=\"D\",\"X\",\"\")","v":{"$error":"#NAME?"}},{"$f":"IF(INDEX(periode5,NEVAL,Nenfant)=\"C\",\"X\",\"\")","v":{"$error":"#NAME?"}},{"$f":"IF(INDEX(periode5,NEVAL,Nenfant)=\"B\",\"X\",\"\")","v":{"$error":"#NAME?"}},{"$f":"IF(INDEX(periode5,NEVAL,Nenfant)=\"A\",\"X\",\"\")","v":{"$error":"#NAME?"}},null,{"$f":"IF(INDEX(periode6,NEVAL,Nenfant)=\"D\",\"X\",\"\")","v":{"$error":"#NAME?"}},{"$f":"IF(INDEX(periode6,NEVAL,Nenfant)=\"C\",\"X\",\"\")","v":{"$error":"#NAME?"}},{"$f":"IF(INDEX(periode6,NEVAL,Nenfant)=\"B\",\"X\",\"\")","v":{"$error":"#NAME?"}},{"$f":"IF(INDEX(periode6,NEVAL,Nenfant)=\"A\",\"X\",\"\")","v":{"$error":"#NAME?"}}]
[62,{"$nulls":7},{"$f":"IF(INDEX(periode1,NEVAL,Nenfant)=\"D\",\"X\",\"\")","v":{"$error":"#NAME?"}},{"$f":"IF(INDEX(periode1,NEVAL,Nenfant)=\"C\",\"X\",\"\")","v":{"$error":"#NAME?"}},{"$f":"IF(INDEX(periode1,NEVAL,Nenfant)=\"B\",\"X\",\"\")","v":{"$error":"#NAME?"}},{"$f":"IF(INDEX(periode1,NEVAL,Nenfant)=\"A\",\"X\",\"\")","v":{"$error":"#NAME?"}},null,{"$f":"IF(INDEX(periode2,NEVAL,Nenfant)=\"D\",\"X\",\"\")","v":{"$error":"#NAME?"}},{"$f":"IF(INDEX(periode2,NEVAL,Nenfant)=\"C\",\"X\",\"\")","v":{"$error":"#NAME?"}},{"$f":"IF(INDEX(periode2,NEVAL,Nenfant)=\"B\",\"X\",\"\")","v":{"$error":"#NAME?"}},{"$f":"IF(INDEX(periode2,NEVAL,Nenfant)=\"A\",\"X\",\"\")","v":{"$error":"#NAME?"}},null,{"$f":"IF(INDEX(periode3,NEVAL,Nenfant)=\"D\",\"X\",\"\")","v":{"$error":"#NAME?"}},{"$f":"IF(INDEX(periode3,NEVAL,Nenfant)=\"C\",\"X\",\"\")","v":{"$error":"#NAME?"}},{"$f":"IF(INDEX(periode3,NEVAL,Nenfant)=\"B\",\"X\",\"\")","v":{"$error":"#NAME?"}},{"$f":"IF(INDEX(periode3,NEVAL,Nenfant)=\"A\",\"X\",\"\")","v":{"$error":"#NAME?"}},null,{"$f":"IF(INDEX(periode4,NEVAL,Nenfant)=\"D\",\"X\",\"\")","v":{"$error":"#NAME?"}},{"$f":"IF(INDEX(periode4,NEVAL,Nenfant)=\"C\",\"X\",\"\")","v":{"$error":"#NAME?"}},{"$f":"IF(INDEX(periode4,NEVAL,Nenfant)=\"B\",\"X\",\"\")","v":{"$error":"#NAME?"}},{"$f":"IF(INDEX(periode4,NEVAL,Nenfant)=\"A\",\"X\",\"\")","v":{"$error":"#NAME?"}},null,{"$f":"IF(INDEX(periode5,NEVAL,Nenfant)=\"D\",\"X\",\"\")","v":{"$error":"#NAME?"}},{"$f":"IF(INDEX(periode5,NEVAL,Nenfant)=\"C\",\"X\",\"\")","v":{"$error":"#NAME?"}},{"$f":"IF(INDEX(periode5,NEVAL,Nenfant)=\"B\",\"X\",\"\")","v":{"$error":"#NAME?"}},{"$f":"IF(INDEX(periode5,NEVAL,Nenfant)=\"A\",\"X\",\"\")","v":{"$error":"#NAME?"}},null,{"$f":"IF(INDEX(periode6,NEVAL,Nenfant)=\"D\",\"X\",\"\")","v":{"$error":"#NAME?"}},{"$f":"IF(INDEX(periode6,NEVAL,Nenfant)=\"C\",\"X\",\"\")","v":{"$error":"#NAME?"}},{"$f":"IF(INDEX(periode6,NEVAL,Nenfant)=\"B\",\"X\",\"\")","v":{"$error":"#NAME?"}},{"$f":"IF(INDEX(periode6,NEVAL,Nenfant)=\"A\",\"X\",\"\")","v":{"$error":"#NAME?"}}]
[63,{"$nulls":7},{"$f":"COUNTIF($G64,\"X\")","v":0},{"$f":"COUNTIF($H64,\"X\")","v":0},{"$f":"COUNTIF($I64,\"X\")","v":0},{"$f":"COUNTIF($J64,\"X\")","v":0},null,{"$f":"COUNTIF($G64,\"X\")","v":0},{"$f":"COUNTIF($H64,\"X\")","v":0},{"$f":"COUNTIF($I64,\"X\")","v":0},{"$f":"COUNTIF($J64,\"X\")","v":0},null,{"$f":"COUNTIF($G64,\"X\")","v":0},{"$f":"COUNTIF($H64,\"X\")","v":0},{"$f":"COUNTIF($I64,\"X\")","v":0},{"$f":"COUNTIF($J64,\"X\")","v":0},null,{"$f":"COUNTIF($G64,\"X\")","v":0},{"$f":"COUNTIF($H64,\"X\")","v":0},{"$f":"COUNTIF($I64,\"X\")","v":0},{"$f":"COUNTIF(AA64,\"X\")","v":0},null,{"$f":"COUNTIF($G64,\"X\")","v":0},{"$f":"COUNTIF($H64,\"X\")","v":0},{"$f":"COUNTIF($I64,\"X\")","v":0},{"$f":"COUNTIF($J64,\"X\")","v":0},null,{"$f":"COUNTIF($G64,\"X\")","v":0},{"$f":"COUNTIF($H64,\"X\")","v":0},{"$f":"COUNTIF($I64,\"X\")","v":0},{"$f":"COUNTIF($J64,\"X\")","v":0}]
[64,{"$nulls":7},{"$f":"IF(INDEX(periode1,NEVAL,Nenfant)=\"D\",\"X\",\"\")","v":{"$error":"#NAME?"}},{"$f":"IF(INDEX(periode1,NEVAL,Nenfant)=\"C\",\"X\",\"\")","v":{"$error":"#NAME?"}},{"$f":"IF(INDEX(periode1,NEVAL,Nenfant)=\"B\",\"X\",\"\")","v":{"$error":"#NAME?"}},{"$f":"IF(INDEX(periode1,NEVAL,Nenfant)=\"A\",\"X\",\"\")","v":{"$error":"#NAME?"}},null,{"$f":"IF(INDEX(periode2,NEVAL,Nenfant)=\"D\",\"X\",\"\")","v":{"$error":"#NAME?"}},{"$f":"IF(INDEX(periode2,NEVAL,Nenfant)=\"C\",\"X\",\"\")","v":{"$error":"#NAME?"}},{"$f":"IF(INDEX(periode2,NEVAL,Nenfant)=\"B\",\"X\",\"\")","v":{"$error":"#NAME?"}},{"$f":"IF(INDEX(periode2,NEVAL,Nenfant)=\"A\",\"X\",\"\")","v":{"$error":"#NAME?"}},null,{"$f":"IF(INDEX(periode3,NEVAL,Nenfant)=\"D\",\"X\",\"\")","v":{"$error":"#NAME?"}},{"$f":"IF(INDEX(periode3,NEVAL,Nenfant)=\"C\",\"X\",\"\")","v":{"$error":"#NAME?"}},{"$f":"IF(INDEX(periode3,NEVAL,Nenfant)=\"B\",\"X\",\"\")","v":{"$error":"#NAME?"}},{"$f":"IF(INDEX(periode3,NEVAL,Nenfant)=\"A\",\"X\",\"\")","v":{"$error":"#NAME?"}},null,{"$f":"IF(INDEX(periode4,NEVAL,Nenfant)=\"D\",\"X\",\"\")","v":{"$error":"#NAME?"}},{"$f":"IF(INDEX(periode4,NEVAL,Nenfant)=\"C\",\"X\",\"\")","v":{"$error":"#NAME?"}},{"$f":"IF(INDEX(periode4,NEVAL,Nenfant)=\"B\",\"X\",\"\")","v":{"$error":"#NAME?"}},{"$f":"IF(INDEX(periode4,NEVAL,Nenfant)=\"A\",\"X\",\"\")","v":{"$error":"#NAME?"}},null,{"$f":"IF(INDEX(periode5,NEVAL,Nenfant)=\"D\",\"X\",\"\")","v":{"$error":"#NAME?"}},{"$f":"IF(INDEX(periode5,NEVAL,Nenfant)=\"C\",\"X\",\"\")","v":{"$error":"#NAME?"}},{"$f":"IF(INDEX(periode5,NEVAL,Nenfant)=\"B\",\"X\",\"\")","v":{"$error":"#NAME?"}},{"$f":"IF(INDEX(periode5,NEVAL,Nenfant)=\"A\",\"X\",\"\")","v":{"$error":"#NAME?"}},null,{"$f":"IF(INDEX(periode6,NEVAL,Nenfant)=\"D\",\"X\",\"\")","v":{"$error":"#NAME?"}},{"$f":"IF(INDEX(periode6,NEVAL,Nenfant)=\"C\",\"X\",\"\")","v":{"$error":"#NAME?"}},{"$f":"IF(INDEX(periode6,NEVAL,Nenfant)=\"B\",\"X\",\"\")","v":{"$error":"#NAME?"}},{"$f":"IF(INDEX(periode6,NEVAL,Nenfant)=\"A\",\"X\",\"\")","v":{"$error":"#NAME?"}}]
[65,{"$nulls":7},{"$f":"COUNTIF($G66,\"X\")","v":0},{"$f":"COUNTIF($H66,\"X\")","v":0},{"$f":"COUNTIF($I66,\"X\")","v":0},{"$f":"COUNTIF($J66,\"X\")","v":0},null,{"$f":"COUNTIF($G66,\"X\")","v":0},{"$f":"COUNTIF($H66,\"X\")","v":0},{"$f":"COUNTIF($I66,\"X\")","v":0},{"$f":"COUNTIF($J66,\"X\")","v":0},null,{"$f":"COUNTIF($G66,\"X\")","v":0},{"$f":"COUNTIF($H66,\"X\")","v":0},{"$f":"COUNTIF($I66,\"X\")","v":0},{"$f":"COUNTIF($J66,\"X\")","v":0},null,{"$f":"COUNTIF($G66,\"X\")","v":0},{"$f":"COUNTIF($H66,\"X\")","v":0},{"$f":"COUNTIF($I66,\"X\")","v":0},{"$f":"COUNTIF(AA66,\"X\")","v":0},null,{"$f":"COUNTIF($G66,\"X\")","v":0},{"$f":"COUNTIF($H66,\"X\")","v":0},{"$f":"COUNTIF($I66,\"X\")","v":0},{"$f":"COUNTIF($J66,\"X\")","v":0},null,{"$f":"COUNTIF($G66,\"X\")","v":0},{"$f":"COUNTIF($H66,\"X\")","v":0},{"$f":"COUNTIF($I66,\"X\")","v":0},{"$f":"COUNTIF($J66,\"X\")","v":0}]
[66,{"$nulls":7},{"$f":"IF(INDEX(periode1,NEVAL,Nenfant)=\"D\",\"X\",\"\")","v":{"$error":"#NAME?"}},{"$f":"IF(INDEX(periode1,NEVAL,Nenfant)=\"C\",\"X\",\"\")","v":{"$error":"#NAME?"}},{"$f":"IF(INDEX(periode1,NEVAL,Nenfant)=\"B\",\"X\",\"\")","v":{"$error":"#NAME?"}},{"$f":"IF(INDEX(periode1,NEVAL,Nenfant)=\"A\",\"X\",\"\")","v":{"$error":"#NAME?"}},null,{"$f":"IF(INDEX(periode2,NEVAL,Nenfant)=\"D\",\"X\",\"\")","v":{"$error":"#NAME?"}},{"$f":"IF(INDEX(periode2,NEVAL,Nenfant)=\"C\",\"X\",\"\")","v":{"$error":"#NAME?"}},{"$f":"IF(INDEX(periode2,NEVAL,Nenfant)=\"B\",\"X\",\"\")","v":{"$error":"#NAME?"}},{"$f":"IF(INDEX(periode2,NEVAL,Nenfant)=\"A\",\"X\",\"\")","v":{"$error":"#NAME?"}},null,{"$f":"IF(INDEX(periode3,NEVAL,Nenfant)=\"D\",\"X\",\"\")","v":{"$error":"#NAME?"}},{"$f":"IF(INDEX(periode3,NEVAL,Nenfant)=\"C\",\"X\",\"\")","v":{"$error":"#NAME?"}},{"$f":"IF(INDEX(periode3,NEVAL,Nenfant)=\"B\",\"X\",\"\")","v":{"$error":"#NAME?"}},{"$f":"IF(INDEX(periode3,NEVAL,Nenfant)=\"A\",\"X\",\"\")","v":{"$error":"#NAME?"}},null,{"$f":"IF(INDEX(periode4,NEVAL,Nenfant)=\"D\",\"X\",\"\")","v":{"$error":"#NAME?"}},{"$f":"IF(INDEX(periode4,NEVAL,Nenfant)=\"C\",\"X\",\"\")","v":{"$error":"#NAME?"}},{"$f":"IF(INDEX(periode4,NEVAL,Nenfant)=\"B\",\"X\",\"\")","v":{"$error":"#NAME?"}},{"$f":"IF(INDEX(periode4,NEVAL,Nenfant)=\"A\",\"X\",\"\")","v":{"$error":"#NAME?"}},null,{"$f":"IF(INDEX(periode5,NEVAL,Nenfant)=\"D\",\"X\",\"\")","v":{"$error":"#NAME?"}},{"$f":"IF(INDEX(periode5,NEVAL,Nenfant)=\"C\",\"X\",\"\")","v":{"$error":"#NAME?"}},{"$f":"IF(INDEX(periode5,NEVAL,Nenfant)=\"B\",\"X\",\"\")","v":{"$error":"#NAME?"}},{"$f":"IF(INDEX(periode5,NEVAL,Nenfant)=\"A\",\"X\",\"\")","v":{"$error":"#NAME?"}},null,{"$f":"IF(INDEX(periode6,NEVAL,Nenfant)=\"D\",\"X\",\"\")","v":{"$error":"#NAME?"}},{"$f":"IF(INDEX(periode6,NEVAL,Nenfant)=\"C\",\"X\",\"\")","v":{"$error":"#NAME?"}},{"$f":"IF(INDEX(periode6,NEVAL,Nenfant)=\"B\",\"X\",\"\")","v":{"$error":"#NAME?"}},{"$f":"IF(INDEX(periode6,NEVAL,Nenfant)=\"A\",\"X\",\"\")","v":{"$error":"#NAME?"}}]
[67,{"$nulls":7},{"$f":"COUNTIF($G68:$G69,\"X\")","v":0},{"$f":"COUNTIF($H68:$H69,\"X\")","v":0},{"$f":"COUNTIF($I68:$I69,\"X\")","v":0},{"$f":"COUNTIF($J68:$J69,\"X\")","v":0},null,{"$f":"COUNTIF($G68:$G69,\"X\")","v":0},{"$f":"COUNTIF($H68:$H69,\"X\")","v":0},{"$f":"COUNTIF($I68:$I69,\"X\")","v":0},{"$f":"COUNTIF($J68:$J69,\"X\")","v":0},null,{"$f":"COUNTIF($G68:$G69,\"X\")","v":0},{"$f":"COUNTIF($H68:$H69,\"X\")","v":0},{"$f":"COUNTIF($I68:$I69,\"X\")","v":0},{"$f":"COUNTIF($J68:$J69,\"X\")","v":0},null,{"$f":"COUNTIF($G68:$G69,\"X\")","v":0},{"$f":"COUNTIF($H68:$H69,\"X\")","v":0},{"$f":"COUNTIF($I68:$I69,\"X\")","v":0},{"$f":"COUNTIF(AA68:AA69,\"X\")","v":0},null,{"$f":"COUNTIF($G68:$G69,\"X\")","v":0},{"$f":"COUNTIF($H68:$H69,\"X\")","v":0},{"$f":"COUNTIF($I68:$I69,\"X\")","v":0},{"$f":"COUNTIF($J68:$J69,\"X\")","v":0},null,{"$f":"COUNTIF($G68:$G69,\"X\")","v":0},{"$f":"COUNTIF($H68:$H69,\"X\")","v":0},{"$f":"COUNTIF($I68:$I69,\"X\")","v":0},{"$f":"COUNTIF($J68:$J69,\"X\")","v":0}]
[68,{"$nulls":7},{"$f":"IF(INDEX(periode1,NEVAL,Nenfant)=\"D\",\"X\",\"\")","v":{"$error":"#NAME?"}},{"$error":"#NAME?"},{"$error":"#NAME?"},{"$error":"#NAME?"},null,{"$f":"IF(INDEX(periode2,NEVAL,Nenfant)=\"D\",\"X\",\"\")","v":{"$error":"#NAME?"}},{"$f":"IF(INDEX(periode2,NEVAL,Nenfant)=\"C\",\"X\",\"\")","v":{"$error":"#NAME?"}},{"$f":"IF(INDEX(periode2,NEVAL,Nenfant)=\"B\",\"X\",\"\")","v":{"$error":"#NAME?"}},{"$f":"IF(INDEX(periode2,NEVAL,Nenfant)=\"A\",\"X\",\"\")","v":{"$error":"#NAME?"}},null,{"$f":"IF(INDEX(periode3,NEVAL,Nenfant)=\"D\",\"X\",\"\")","v":{"$error":"#NAME?"}},{"$f":"IF(INDEX(periode3,NEVAL,Nenfant)=\"C\",\"X\",\"\")","v":{"$error":"#NAME?"}},{"$f":"IF(INDEX(periode3,NEVAL,Nenfant)=\"B\",\"X\",\"\")","v":{"$error":"#NAME?"}},{"$f":"IF(INDEX(periode3,NEVAL,Nenfant)=\"A\",\"X\",\"\")","v":{"$error":"#NAME?"}},null,{"$f":"IF(INDEX(periode4,NEVAL,Nenfant)=\"D\",\"X\",\"\")","v":{"$error":"#NAME?"}},{"$f":"IF(INDEX(periode4,NEVAL,Nenfant)=\"C\",\"X\",\"\")","v":{"$error":"#NAME?"}},{"$f":"IF(INDEX(periode4,NEVAL,Nenfant)=\"B\",\"X\",\"\")","v":{"$error":"#NAME?"}},{"$f":"IF(INDEX(periode4,NEVAL,Nenfant)=\"A\",\"X\",\"\")","v":{"$error":"#NAME?"}},null,{"$f":"IF(INDEX(periode5,NEVAL,Nenfant)=\"D\",\"X\",\"\")","v":{"$error":"#NAME?"}},{"$f":"IF(INDEX(periode5,NEVAL,Nenfant)=\"C\",\"X\",\"\")","v":{"$error":"#NAME?"}},{"$f":"IF(INDEX(periode5,NEVAL,Nenfant)=\"B\",\"X\",\"\")","v":{"$error":"#NAME?"}},{"$f":"IF(INDEX(periode5,NEVAL,Nenfant)=\"A\",\"X\",\"\")","v":{"$error":"#NAME?"}},null,{"$f":"IF(INDEX(periode6,NEVAL,Nenfant)=\"D\",\"X\",\"\")","v":{"$error":"#NAME?"}},{"$f":"IF(INDEX(periode6,NEVAL,Nenfant)=\"C\",\"X\",\"\")","v":{"$error":"#NAME?"}},{"$f":"IF(INDEX(periode6,NEVAL,Nenfant)=\"B\",\"X\",\"\")","v":{"$error":"#NAME?"}},{"$f":"IF(INDEX(periode6,NEVAL,Nenfant)=\"A\",\"X\",\"\")","v":{"$error":"#NAME?"}}]
[69,{"$nulls":7},{"$f":"IF(INDEX(periode1,NEVAL,Nenfant)=\"D\",\"X\",\"\")","v":{"$error":"#NAME?"}},{"$error":"#NAME?"},{"$error":"#NAME?"},{"$error":"#NAME?"},null,{"$f":"IF(INDEX(periode2,NEVAL,Nenfant)=\"D\",\"X\",\"\")","v":{"$error":"#NAME?"}},{"$f":"IF(INDEX(periode2,NEVAL,Nenfant)=\"C\",\"X\",\"\")","v":{"$error":"#NAME?"}},{"$f":"IF(INDEX(periode2,NEVAL,Nenfant)=\"B\",\"X\",\"\")","v":{"$error":"#NAME?"}},{"$f":"IF(INDEX(periode2,NEVAL,Nenfant)=\"A\",\"X\",\"\")","v":{"$error":"#NAME?"}},null,{"$f":"IF(INDEX(periode3,NEVAL,Nenfant)=\"D\",\"X\",\"\")","v":{"$error":"#NAME?"}},{"$f":"IF(INDEX(periode3,NEVAL,Nenfant)=\"C\",\"X\",\"\")","v":{"$error":"#NAME?"}},{"$f":"IF(INDEX(periode3,NEVAL,Nenfant)=\"B\",\"X\",\"\")","v":{"$error":"#NAME?"}},{"$f":"IF(INDEX(periode3,NEVAL,Nenfant)=\"A\",\"X\",\"\")","v":{"$error":"#NAME?"}},null,{"$f":"IF(INDEX(periode4,NEVAL,Nenfant)=\"D\",\"X\",\"\")","v":{"$error":"#NAME?"}},{"$f":"IF(INDEX(periode4,NEVAL,Nenfant)=\"C\",\"X\",\"\")","v":{"$error":"#NAME?"}},{"$f":"IF(INDEX(periode4,NEVAL,Nenfant)=\"B\",\"X\",\"\")","v":{"$error":"#NAME?"}},{"$f":"IF(INDEX(periode4,NEVAL,Nenfant)=\"A\",\"X\",\"\")","v":{"$error":"#NAME?"}},null,{"$f":"IF(INDEX(periode5,NEVAL,Nenfant)=\"D\",\"X\",\"\")","v":{"$error":"#NAME?"}},{"$f":"IF(INDEX(periode5,NEVAL,Nenfant)=\"C\",\"X\",\"\")","v":{"$error":"#NAME?"}},{"$f":"IF(INDEX(periode5,NEVAL,Nenfant)=\"B\",\"X\",\"\")","v":{"$error":"#NAME?"}},{"$f":"IF(INDEX(periode5,NEVAL,Nenfant)=\"A\",\"X\",\"\")","v":{"$error":"#NAME?"}},null,{"$f":"IF(INDEX(periode6,NEVAL,Nenfant)=\"D\",\"X\",\"\")","v":{"$error":"#NAME?"}},{"$f":"IF(INDEX(periode6,NEVAL,Nenfant)=\"C\",\"X\",\"\")","v":{"$error":"#NAME?"}},{"$f":"IF(INDEX(periode6,NEVAL,Nenfant)=\"B\",\"X\",\"\")","v":{"$error":"#NAME?"}},{"$f":"IF(INDEX(periode6,NEVAL,Nenfant)=\"A\",\"X\",\"\")","v":{"$error":"#NAME?"}}]
[70,{"$nulls":7},{"$f":"COUNTIF($G71:$G72,\"X\")","v":0},{"$f":"COUNTIF($H71:$H72,\"X\")","v":0},{"$f":"COUNTIF($I71:$I72,\"X\")","v":0},{"$f":"COUNTIF($J71:$J72,\"X\")","v":0},null,{"$f":"COUNTIF($G71:$G72,\"X\")","v":0},{"$f":"COUNTIF($H71:$H72,\"X\")","v":0},{"$f":"COUNTIF($I71:$I72,\"X\")","v":0},{"$f":"COUNTIF($J71:$J72,\"X\")","v":0},null,{"$f":"COUNTIF($G71:$G72,\"X\")","v":0},{"$f":"COUNTIF($H71:$H72,\"X\")","v":0},{"$f":"COUNTIF($I71:$I72,\"X\")","v":0},{"$f":"COUNTIF($J71:$J72,\"X\")","v":0},null,{"$f":"COUNTIF($G71:$G72,\"X\")","v":0},{"$f":"COUNTIF($H71:$H72,\"X\")","v":0},{"$f":"COUNTIF($I71:$I72,\"X\")","v":0},{"$f":"COUNTIF(AA71:AA72,\"X\")","v":0},null,{"$f":"COUNTIF($G71:$G72,\"X\")","v":0},{"$f":"COUNTIF($H71:$H72,\"X\")","v":0},{"$f":"COUNTIF($I71:$I72,\"X\")","v":0},{"$f":"COUNTIF($J71:$J72,\"X\")","v":0},null,{"$f":"COUNTIF($G71:$G72,\"X\")","v":0},{"$f":"COUNTIF($H71:$H72,\"X\")","v":0},{"$f":"COUNTIF($I71:$I72,\"X\")","v":0},{"$f":"COUNTIF($J71:$J72,\"X\")","v":0}]
[71,{"$nulls":7},{"$f":"IF(INDEX(periode1,NEVAL,Nenfant)=\"D\",\"X\",\"\")","v":{"$error":"#NAME?"}},{"$error":"#NAME?"},{"$error":"#NAME?"},{"$error":"#NAME?"},null,{"$f":"IF(INDEX(periode2,NEVAL,Nenfant)=\"D\",\"X\",\"\")","v":{"$error":"#NAME?"}},{"$f":"IF(INDEX(periode2,NEVAL,Nenfant)=\"C\",\"X\",\"\")","v":{"$error":"#NAME?"}},{"$f":"IF(INDEX(periode2,NEVAL,Nenfant)=\"B\",\"X\",\"\")","v":{"$error":"#NAME?"}},{"$f":"IF(INDEX(periode2,NEVAL,Nenfant)=\"A\",\"X\",\"\")","v":{"$error":"#NAME?"}},null,{"$f":"IF(INDEX(periode3,NEVAL,Nenfant)=\"D\",\"X\",\"\")","v":{"$error":"#NAME?"}},{"$f":"IF(INDEX(periode3,NEVAL,Nenfant)=\"C\",\"X\",\"\")","v":{"$error":"#NAME?"}},{"$f":"IF(INDEX(periode3,NEVAL,Nenfant)=\"B\",\"X\",\"\")","v":{"$error":"#NAME?"}},{"$f":"IF(INDEX(periode3,NEVAL,Nenfant)=\"A\",\"X\",\"\")","v":{"$error":"#NAME?"}},null,{"$f":"IF(INDEX(periode4,NEVAL,Nenfant)=\"D\",\"X\",\"\")","v":{"$error":"#NAME?"}},{"$f":"IF(INDEX(periode4,NEVAL,Nenfant)=\"C\",\"X\",\"\")","v":{"$error":"#NAME?"}},{"$f":"IF(INDEX(periode4,NEVAL,Nenfant)=\"B\",\"X\",\"\")","v":{"$error":"#NAME?"}},{"$f":"IF(INDEX(periode4,NEVAL,Nenfant)=\"A\",\"X\",\"\")","v":{"$error":"#NAME?"}},null,{"$f":"IF(INDEX(periode5,NEVAL,Nenfant)=\"D\",\"X\",\"\")","v":{"$error":"#NAME?"}},{"$f":"IF(INDEX(periode5,NEVAL,Nenfant)=\"C\",\"X\",\"\")","v":{"$error":"#NAME?"}},{"$f":"IF(INDEX(periode5,NEVAL,Nenfant)=\"B\",\"X\",\"\")","v":{"$error":"#NAME?"}},{"$f":"IF(INDEX(periode5,NEVAL,Nenfant)=\"A\",\"X\",\"\")","v":{"$error":"#NAME?"}},null,{"$f":"IF(INDEX(periode6,NEVAL,Nenfant)=\"D\",\"X\",\"\")","v":{"$error":"#NAME?"}},{"$f":"IF(INDEX(periode6,NEVAL,Nenfant)=\"C\",\"X\",\"\")","v":{"$error":"#NAME?"}},{"$f":"IF(INDEX(periode6,NEVAL,Nenfant)=\"B\",\"X\",\"\")","v":{"$error":"#NAME?"}},{"$f":"IF(INDEX(periode6,NEVAL,Nenfant)=\"A\",\"X\",\"\")","v":{"$error":"#NAME?"}}]
[72,{"$nulls":7},{"$f":"IF(INDEX(periode1,NEVAL,Nenfant)=\"D\",\"X\",\"\")","v":{"$error":"#NAME?"}},{"$error":"#NAME?"},{"$error":"#NAME?"},{"$error":"#NAME?"},null,{"$f":"IF(INDEX(periode2,NEVAL,Nenfant)=\"D\",\"X\",\"\")","v":{"$error":"#NAME?"}},{"$f":"IF(INDEX(periode2,NEVAL,Nenfant)=\"C\",\"X\",\"\")","v":{"$error":"#NAME?"}},{"$f":"IF(INDEX(periode2,NEVAL,Nenfant)=\"B\",\"X\",\"\")","v":{"$error":"#NAME?"}},{"$f":"IF(INDEX(periode2,NEVAL,Nenfant)=\"A\",\"X\",\"\")","v":{"$error":"#NAME?"}},null,{"$f":"IF(INDEX(periode3,NEVAL,Nenfant)=\"D\",\"X\",\"\")","v":{"$error":"#NAME?"}},{"$f":"IF(INDEX(periode3,NEVAL,Nenfant)=\"C\",\"X\",\"\")","v":{"$error":"#NAME?"}},{"$f":"IF(INDEX(periode3,NEVAL,Nenfant)=\"B\",\"X\",\"\")","v":{"$error":"#NAME?"}},{"$f":"IF(INDEX(periode3,NEVAL,Nenfant)=\"A\",\"X\",\"\")","v":{"$error":"#NAME?"}},null,{"$f":"IF(INDEX(periode4,NEVAL,Nenfant)=\"D\",\"X\",\"\")","v":{"$error":"#NAME?"}},{"$f":"IF(INDEX(periode4,NEVAL,Nenfant)=\"C\",\"X\",\"\")","v":{"$error":"#NAME?"}},{"$f":"IF(INDEX(periode4,NEVAL,Nenfant)=\"B\",\"X\",\"\")","v":{"$error":"#NAME?"}},{"$f":"IF(INDEX(periode4,NEVAL,Nenfant)=\"A\",\"X\",\"\")","v":{"$error":"#NAME?"}},null,{"$f":"IF(INDEX(periode5,NEVAL,Nenfant)=\"D\",\"X\",\"\")","v":{"$error":"#NAME?"}},{"$f":"IF(INDEX(periode5,NEVAL,Nenfant)=\"C\",\"X\",\"\")","v":{"$error":"#NAME?"}},{"$f":"IF(INDEX(periode5,NEVAL,Nenfant)=\"B\",\"X\",\"\")","v":{"$error":"#NAME?"}},{"$f":"IF(INDEX(periode5,NEVAL,Nenfant)=\"A\",\"X\",\"\")","v":{"$error":"#NAME?"}},null,{"$f":"IF(INDEX(periode6,NEVAL,Nenfant)=\"D\",\"X\",\"\")","v":{"$error":"#NAME?"}},{"$f":"IF(INDEX(periode6,NEVAL,Nenfant)=\"C\",\"X\",\"\")","v":{"$error":"#NAME?"}},{"$f":"IF(INDEX(periode6,NEVAL,Nenfant)=\"B\",\"X\",\"\")","v":{"$error":"#NAME?"}},{"$f":"IF(INDEX(periode6,NEVAL,Nenfant)=\"A\",\"X\",\"\")","v":{"$error":"#NAME?"}}]
[73,{"$nulls":7},{"$f":"COUNTIF($G74:$G77,\"X\")","v":0},{"$f":"COUNTIF($H74:$H77,\"X\")","v":0},{"$f":"COUNTIF($I74:$I77,\"X\")","v":0},{"$f":"COUNTIF($J74:$J77,\"X\")","v":0},null,{"$f":"COUNTIF($G74:$G77,\"X\")","v":0},{"$f":"COUNTIF($H74:$H77,\"X\")","v":0},{"$f":"COUNTIF($I74:$I77,\"X\")","v":0},{"$f":"COUNTIF($J74:$J77,\"X\")","v":0},null,{"$f":"COUNTIF($G74:$G77,\"X\")","v":0},{"$f":"COUNTIF($H74:$H77,\"X\")","v":0},{"$f":"COUNTIF($I74:$I77,\"X\")","v":0},{"$f":"COUNTIF($J74:$J77,\"X\")","v":0},null,{"$f":"COUNTIF($G74:$G77,\"X\")","v":0},{"$f":"COUNTIF($H74:$H77,\"X\")","v":0},{"$f":"COUNTIF($I74:$I77,\"X\")","v":0},{"$f":"COUNTIF(AA74:AA77,\"X\")","v":0},null,{"$f":"COUNTIF($G74:$G77,\"X\")","v":0},{"$f":"COUNTIF($H74:$H77,\"X\")","v":0},{"$f":"COUNTIF($I74:$I77,\"X\")","v":0},{"$f":"COUNTIF($J74:$J77,\"X\")","v":0},null,{"$f":"COUNTIF($G74:$G77,\"X\")","v":0},{"$f":"COUNTIF($H74:$H77,\"X\")","v":0},{"$f":"COUNTIF($I74:$I77,\"X\")","v":0},{"$f":"COUNTIF($J74:$J77,\"X\")","v":0}]
[74,{"$nulls":7},{"$f":"IF(INDEX(periode1,NEVAL,Nenfant)=\"D\",\"X\",\"\")","v":{"$error":"#NAME?"}},{"$f":"IF(INDEX(periode1,NEVAL,Nenfant)=\"C\",\"X\",\"\")","v":{"$error":"#NAME?"}},{"$f":"IF(INDEX(periode1,NEVAL,Nenfant)=\"B\",\"X\",\"\")","v":{"$error":"#NAME?"}},{"$f":"IF(INDEX(periode1,NEVAL,Nenfant)=\"A\",\"X\",\"\")","v":{"$error":"#NAME?"}},null,{"$f":"IF(INDEX(periode2,NEVAL,Nenfant)=\"D\",\"X\",\"\")","v":{"$error":"#NAME?"}},{"$f":"IF(INDEX(periode2,NEVAL,Nenfant)=\"C\",\"X\",\"\")","v":{"$error":"#NAME?"}},{"$f":"IF(INDEX(periode2,NEVAL,Nenfant)=\"B\",\"X\",\"\")","v":{"$error":"#NAME?"}},{"$f":"IF(INDEX(periode2,NEVAL,Nenfant)=\"A\",\"X\",\"\")","v":{"$error":"#NAME?"}},null,{"$f":"IF(INDEX(periode3,NEVAL,Nenfant)=\"D\",\"X\",\"\")","v":{"$error":"#NAME?"}},{"$f":"IF(INDEX(periode3,NEVAL,Nenfant)=\"C\",\"X\",\"\")","v":{"$error":"#NAME?"}},{"$f":"IF(INDEX(periode3,NEVAL,Nenfant)=\"B\",\"X\",\"\")","v":{"$error":"#NAME?"}},{"$f":"IF(INDEX(periode3,NEVAL,Nenfant)=\"A\",\"X\",\"\")","v":{"$error":"#NAME?"}},null,{"$f":"IF(INDEX(periode4,NEVAL,Nenfant)=\"D\",\"X\",\"\")","v":{"$error":"#NAME?"}},{"$f":"IF(INDEX(periode4,NEVAL,Nenfant)=\"C\",\"X\",\"\")","v":{"$error":"#NAME?"}},{"$f":"IF(INDEX(periode4,NEVAL,Nenfant)=\"B\",\"X\",\"\")","v":{"$error":"#NAME?"}},{"$f":"IF(INDEX(periode4,NEVAL,Nenfant)=\"A\",\"X\",\"\")","v":{"$error":"#NAME?"}},null,{"$f":"IF(INDEX(periode5,NEVAL,Nenfant)=\"D\",\"X\",\"\")","v":{"$error":"#NAME?"}},{"$f":"IF(INDEX(periode5,NEVAL,Nenfant)=\"C\",\"X\",\"\")","v":{"$error":"#NAME?"}},{"$f":"IF(INDEX(periode5,NEVAL,Nenfant)=\"B\",\"X\",\"\")","v":{"$error":"#NAME?"}},{"$f":"IF(INDEX(periode5,NEVAL,Nenfant)=\"A\",\"X\",\"\")","v":{"$error":"#NAME?"}},null,{"$f":"IF(INDEX(periode6,NEVAL,Nenfant)=\"D\",\"X\",\"\")","v":{"$error":"#NAME?"}},{"$f":"IF(INDEX(periode6,NEVAL,Nenfant)=\"C\",\"X\",\"\")","v":{"$error":"#NAME?"}},{"$f":"IF(INDEX(periode6,NEVAL,Nenfant)=\"B\",\"X\",\"\")","v":{"$error":"#NAME?"}},{"$f":"IF(INDEX(periode6,NEVAL,Nenfant)=\"A\",\"X\",\"\")","v":{"$error":"#NAME?"}}]
[75,{"$nulls":7},{"$f":"IF(INDEX(periode1,NEVAL,Nenfant)=\"D\",\"X\",\"\")","v":{"$error":"#NAME?"}},{"$f":"IF(INDEX(periode1,NEVAL,Nenfant)=\"C\",\"X\",\"\")","v":{"$error":"#NAME?"}},{"$f":"IF(INDEX(periode1,NEVAL,Nenfant)=\"B\",\"X\",\"\")","v":{"$error":"#NAME?"}},{"$f":"IF(INDEX(periode1,NEVAL,Nenfant)=\"A\",\"X\",\"\")","v":{"$error":"#NAME?"}},null,{"$f":"IF(INDEX(periode2,NEVAL,Nenfant)=\"D\",\"X\",\"\")","v":{"$error":"#NAME?"}},{"$f":"IF(INDEX(periode2,NEVAL,Nenfant)=\"C\",\"X\",\"\")","v":{"$error":"#NAME?"}},{"$f":"IF(INDEX(periode2,NEVAL,Nenfant)=\"B\",\"X\",\"\")","v":{"$error":"#NAME?"}},{"$f":"IF(INDEX(periode2,NEVAL,Nenfant)=\"A\",\"X\",\"\")","v":{"$error":"#NAME?"}},null,{"$f":"IF(INDEX(periode3,NEVAL,Nenfant)=\"D\",\"X\",\"\")","v":{"$error":"#NAME?"}},{"$f":"IF(INDEX(periode3,NEVAL,Nenfant)=\"C\",\"X\",\"\")","v":{"$error":"#NAME?"}},{"$f":"IF(INDEX(periode3,NEVAL,Nenfant)=\"B\",\"X\",\"\")","v":{"$error":"#NAME?"}},{"$f":"IF(INDEX(periode3,NEVAL,Nenfant)=\"A\",\"X\",\"\")","v":{"$error":"#NAME?"}},null,{"$f":"IF(INDEX(periode4,NEVAL,Nenfant)=\"D\",\"X\",\"\")","v":{"$error":"#NAME?"}},{"$f":"IF(INDEX(periode4,NEVAL,Nenfant)=\"C\",\"X\",\"\")","v":{"$error":"#NAME?"}},{"$f":"IF(INDEX(periode4,NEVAL,Nenfant)=\"B\",\"X\",\"\")","v":{"$error":"#NAME?"}},{"$f":"IF(INDEX(periode4,NEVAL,Nenfant)=\"A\",\"X\",\"\")","v":{"$error":"#NAME?"}},null,{"$f":"IF(INDEX(periode5,NEVAL,Nenfant)=\"D\",\"X\",\"\")","v":{"$error":"#NAME?"}},{"$f":"IF(INDEX(periode5,NEVAL,Nenfant)=\"C\",\"X\",\"\")","v":{"$error":"#NAME?"}},{"$f":"IF(INDEX(periode5,NEVAL,Nenfant)=\"B\",\"X\",\"\")","v":{"$error":"#NAME?"}},{"$f":"IF(INDEX(periode5,NEVAL,Nenfant)=\"A\",\"X\",\"\")","v":{"$error":"#NAME?"}},null,{"$f":"IF(INDEX(periode6,NEVAL,Nenfant)=\"D\",\"X\",\"\")","v":{"$error":"#NAME?"}},{"$f":"IF(INDEX(periode6,NEVAL,Nenfant)=\"C\",\"X\",\"\")","v":{"$error":"#NAME?"}},{"$f":"IF(INDEX(periode6,NEVAL,Nenfant)=\"B\",\"X\",\"\")","v":{"$error":"#NAME?"}},{"$f":"IF(INDEX(periode6,NEVAL,Nenfant)=\"A\",\"X\",\"\")","v":{"$error":"#NAME?"}}]
[76,{"$nulls":7},{"$f":"IF(INDEX(periode1,NEVAL,Nenfant)=\"D\",\"X\",\"\")","v":{"$error":"#NAME?"}},{"$f":"IF(INDEX(periode1,NEVAL,Nenfant)=\"C\",\"X\",\"\")","v":{"$error":"#NAME?"}},{"$f":"IF(INDEX(periode1,NEVAL,Nenfant)=\"B\",\"X\",\"\")","v":{"$error":"#NAME?"}},{"$f":"IF(INDEX(periode1,NEVAL,Nenfant)=\"A\",\"X\",\"\")","v":{"$error":"#NAME?"}},null,{"$f":"IF(INDEX(periode2,NEVAL,Nenfant)=\"D\",\"X\",\"\")","v":{"$error":"#NAME?"}},{"$f":"IF(INDEX(periode2,NEVAL,Nenfant)=\"C\",\"X\",\"\")","v":{"$error":"#NAME?"}},{"$f":"IF(INDEX(periode2,NEVAL,Nenfant)=\"B\",\"X\",\"\")","v":{"$error":"#NAME?"}},{"$f":"IF(INDEX(periode2,NEVAL,Nenfant)=\"A\",\"X\",\"\")","v":{"$error":"#NAME?"}},null,{"$f":"IF(INDEX(periode3,NEVAL,Nenfant)=\"D\",\"X\",\"\")","v":{"$error":"#NAME?"}},{"$f":"IF(INDEX(periode3,NEVAL,Nenfant)=\"C\",\"X\",\"\")","v":{"$error":"#NAME?"}},{"$f":"IF(INDEX(periode3,NEVAL,Nenfant)=\"B\",\"X\",\"\")","v":{"$error":"#NAME?"}},{"$f":"IF(INDEX(periode3,NEVAL,Nenfant)=\"A\",\"X\",\"\")","v":{"$error":"#NAME?"}},null,{"$f":"IF(INDEX(periode4,NEVAL,Nenfant)=\"D\",\"X\",\"\")","v":{"$error":"#NAME?"}},{"$f":"IF(INDEX(periode4,NEVAL,Nenfant)=\"C\",\"X\",\"\")","v":{"$error":"#NAME?"}},{"$f":"IF(INDEX(periode4,NEVAL,Nenfant)=\"B\",\"X\",\"\")","v":{"$error":"#NAME?"}},{"$f":"IF(INDEX(periode4,NEVAL,Nenfant)=\"A\",\"X\",\"\")","v":{"$error":"#NAME?"}},null,{"$f":"IF(INDEX(periode5,NEVAL,Nenfant)=\"D\",\"X\",\"\")","v":{"$error":"#NAME?"}},{"$f":"IF(INDEX(periode5,NEVAL,Nenfant)=\"C\",\"X\",\"\")","v":{"$error":"#NAME?"}},{"$f":"IF(INDEX(periode5,NEVAL,Nenfant)=\"B\",\"X\",\"\")","v":{"$error":"#NAME?"}},{"$f":"IF(INDEX(periode5,NEVAL,Nenfant)=\"A\",\"X\",\"\")","v":{"$error":"#NAME?"}},null,{"$f":"IF(INDEX(periode6,NEVAL,Nenfant)=\"D\",\"X\",\"\")","v":{"$error":"#NAME?"}},{"$f":"IF(INDEX(periode6,NEVAL,Nenfant)=\"C\",\"X\",\"\")","v":{"$error":"#NAME?"}},{"$f":"IF(INDEX(periode6,NEVAL,Nenfant)=\"B\",\"X\",\"\")","v":{"$error":"#NAME?"}},{"$f":"IF(INDEX(periode6,NEVAL,Nenfant)=\"A\",\"X\",\"\")","v":{"$error":"#NAME?"}}]
[77,{"$nulls":7},{"$f":"IF(INDEX(periode1,NEVAL,Nenfant)=\"D\",\"X\",\"\")","v":{"$error":"#NAME?"}},{"$f":"IF(INDEX(periode1,NEVAL,Nenfant)=\"C\",\"X\",\"\")","v":{"$error":"#NAME?"}},{"$f":"IF(INDEX(periode1,NEVAL,Nenfant)=\"B\",\"X\",\"\")","v":{"$error":"#NAME?"}},{"$f":"IF(INDEX(periode1,NEVAL,Nenfant)=\"A\",\"X\",\"\")","v":{"$error":"#NAME?"}},null,{"$f":"IF(INDEX(periode2,NEVAL,Nenfant)=\"D\",\"X\",\"\")","v":{"$error":"#NAME?"}},{"$f":"IF(INDEX(periode2,NEVAL,Nenfant)=\"C\",\"X\",\"\")","v":{"$error":"#NAME?"}},{"$f":"IF(INDEX(periode2,NEVAL,Nenfant)=\"B\",\"X\",\"\")","v":{"$error":"#NAME?"}},{"$f":"IF(INDEX(periode2,NEVAL,Nenfant)=\"A\",\"X\",\"\")","v":{"$error":"#NAME?"}},null,{"$f":"IF(INDEX(periode3,NEVAL,Nenfant)=\"D\",\"X\",\"\")","v":{"$error":"#NAME?"}},{"$f":"IF(INDEX(periode3,NEVAL,Nenfant)=\"C\",\"X\",\"\")","v":{"$error":"#NAME?"}},{"$f":"IF(INDEX(periode3,NEVAL,Nenfant)=\"B\",\"X\",\"\")","v":{"$error":"#NAME?"}},{"$f":"IF(INDEX(periode3,NEVAL,Nenfant)=\"A\",\"X\",\"\")","v":{"$error":"#NAME?"}},null,{"$f":"IF(INDEX(periode4,NEVAL,Nenfant)=\"D\",\"X\",\"\")","v":{"$error":"#NAME?"}},{"$f":"IF(INDEX(periode4,NEVAL,Nenfant)=\"C\",\"X\",\"\")","v":{"$error":"#NAME?"}},{"$f":"IF(INDEX(periode4,NEVAL,Nenfant)=\"B\",\"X\",\"\")","v":{"$error":"#NAME?"}},{"$f":"IF(INDEX(periode4,NEVAL,Nenfant)=\"A\",\"X\",\"\")","v":{"$error":"#NAME?"}},null,{"$f":"IF(INDEX(periode5,NEVAL,Nenfant)=\"D\",\"X\",\"\")","v":{"$error":"#NAME?"}},{"$f":"IF(INDEX(periode5,NEVAL,Nenfant)=\"C\",\"X\",\"\")","v":{"$error":"#NAME?"}},{"$f":"IF(INDEX(periode5,NEVAL,Nenfant)=\"B\",\"X\",\"\")","v":{"$error":"#NAME?"}},{"$f":"IF(INDEX(periode5,NEVAL,Nenfant)=\"A\",\"X\",\"\")","v":{"$error":"#NAME?"}},null,{"$f":"IF(INDEX(periode6,NEVAL,Nenfant)=\"D\",\"X\",\"\")","v":{"$error":"#NAME?"}},{"$f":"IF(INDEX(periode6,NEVAL,Nenfant)=\"C\",\"X\",\"\")","v":{"$error":"#NAME?"}},{"$f":"IF(INDEX(periode6,NEVAL,Nenfant)=\"B\",\"X\",\"\")","v":{"$error":"#NAME?"}},{"$f":"IF(INDEX(periode6,NEVAL,Nenfant)=\"A\",\"X\",\"\")","v":{"$error":"#NAME?"}}]
[78,{"$nulls":7},{"$f":"COUNTIF($G79:$G80,\"X\")","v":0},{"$f":"COUNTIF($H79:$H80,\"X\")","v":0},{"$f":"COUNTIF($I79:$I80,\"X\")","v":0},{"$f":"COUNTIF($J79:$J80,\"X\")","v":0},null,{"$f":"COUNTIF($G79:$G80,\"X\")","v":0},{"$f":"COUNTIF($H79:$H80,\"X\")","v":0},{"$f":"COUNTIF($I79:$I80,\"X\")","v":0},{"$f":"COUNTIF($J79:$J80,\"X\")","v":0},null,{"$f":"COUNTIF($G79:$G80,\"X\")","v":0},{"$f":"COUNTIF($H79:$H80,\"X\")","v":0},{"$f":"COUNTIF($I79:$I80,\"X\")","v":0},{"$f":"COUNTIF($J79:$J80,\"X\")","v":0},null,{"$f":"COUNTIF($G79:$G80,\"X\")","v":0},{"$f":"COUNTIF($H79:$H80,\"X\")","v":0},{"$f":"COUNTIF($I79:$I80,\"X\")","v":0},{"$f":"COUNTIF(AA79:AA80,\"X\")","v":0},null,{"$f":"COUNTIF($G79:$G80,\"X\")","v":0},{"$f":"COUNTIF($H79:$H80,\"X\")","v":0},{"$f":"COUNTIF($I79:$I80,\"X\")","v":0},{"$f":"COUNTIF($J79:$J80,\"X\")","v":0},null,{"$f":"COUNTIF($G79:$G80,\"X\")","v":0},{"$f":"COUNTIF($H79:$H80,\"X\")","v":0},{"$f":"COUNTIF($I79:$I80,\"X\")","v":0},{"$f":"COUNTIF($J79:$J80,\"X\")","v":0}]
[79,{"$nulls":7},{"$f":"IF(INDEX(periode1,NEVAL,Nenfant)=\"D\",\"X\",\"\")","v":{"$error":"#NAME?"}},{"$f":"IF(INDEX(periode1,NEVAL,Nenfant)=\"C\",\"X\",\"\")","v":{"$error":"#NAME?"}},{"$f":"IF(INDEX(periode1,NEVAL,Nenfant)=\"B\",\"X\",\"\")","v":{"$error":"#NAME?"}},{"$f":"IF(INDEX(periode1,NEVAL,Nenfant)=\"A\",\"X\",\"\")","v":{"$error":"#NAME?"}},null,{"$f":"IF(INDEX(periode2,NEVAL,Nenfant)=\"D\",\"X\",\"\")","v":{"$error":"#NAME?"}},{"$f":"IF(INDEX(periode2,NEVAL,Nenfant)=\"C\",\"X\",\"\")","v":{"$error":"#NAME?"}},{"$f":"IF(INDEX(periode2,NEVAL,Nenfant)=\"B\",\"X\",\"\")","v":{"$error":"#NAME?"}},{"$f":"IF(INDEX(periode2,NEVAL,Nenfant)=\"A\",\"X\",\"\")","v":{"$error":"#NAME?"}},null,{"$f":"IF(INDEX(periode3,NEVAL,Nenfant)=\"D\",\"X\",\"\")","v":{"$error":"#NAME?"}},{"$f":"IF(INDEX(periode3,NEVAL,Nenfant)=\"C\",\"X\",\"\")","v":{"$error":"#NAME?"}},{"$f":"IF(INDEX(periode3,NEVAL,Nenfant)=\"B\",\"X\",\"\")","v":{"$error":"#NAME?"}},{"$f":"IF(INDEX(periode3,NEVAL,Nenfant)=\"A\",\"X\",\"\")","v":{"$error":"#NAME?"}},null,{"$f":"IF(INDEX(periode4,NEVAL,Nenfant)=\"D\",\"X\",\"\")","v":{"$error":"#NAME?"}},{"$f":"IF(INDEX(periode4,NEVAL,Nenfant)=\"C\",\"X\",\"\")","v":{"$error":"#NAME?"}},{"$f":"IF(INDEX(periode4,NEVAL,Nenfant)=\"B\",\"X\",\"\")","v":{"$error":"#NAME?"}},{"$f":"IF(INDEX(periode4,NEVAL,Nenfant)=\"A\",\"X\",\"\")","v":{"$error":"#NAME?"}},null,{"$f":"IF(INDEX(periode5,NEVAL,Nenfant)=\"D\",\"X\",\"\")","v":{"$error":"#NAME?"}},{"$f":"IF(INDEX(periode5,NEVAL,Nenfant)=\"C\",\"X\",\"\")","v":{"$error":"#NAME?"}},{"$f":"IF(INDEX(periode5,NEVAL,Nenfant)=\"B\",\"X\",\"\")","v":{"$error":"#NAME?"}},{"$f":"IF(INDEX(periode5,NEVAL,Nenfant)=\"A\",\"X\",\"\")","v":{"$error":"#NAME?"}},null,{"$f":"IF(INDEX(periode6,NEVAL,Nenfant)=\"D\",\"X\",\"\")","v":{"$error":"#NAME?"}},{"$f":"IF(INDEX(periode6,NEVAL,Nenfant)=\"C\",\"X\",\"\")","v":{"$error":"#NAME?"}},{"$f":"IF(INDEX(periode6,NEVAL,Nenfant)=\"B\",\"X\",\"\")","v":{"$error":"#NAME?"}},{"$f":"IF(INDEX(periode6,NEVAL,Nenfant)=\"A\",\"X\",\"\")","v":{"$error":"#NAME?"}}]
[80,{"$nulls":7},{"$f":"IF(INDEX(periode1,NEVAL,Nenfant)=\"D\",\"X\",\"\")","v":{"$error":"#NAME?"}},{"$f":"IF(INDEX(periode1,NEVAL,Nenfant)=\"C\",\"X\",\"\")","v":{"$error":"#NAME?"}},{"$f":"IF(INDEX(periode1,NEVAL,Nenfant)=\"B\",\"X\",\"\")","v":{"$error":"#NAME?"}},{"$f":"IF(INDEX(periode1,NEVAL,Nenfant)=\"A\",\"X\",\"\")","v":{"$error":"#NAME?"}},null,{"$f":"IF(INDEX(periode2,NEVAL,Nenfant)=\"D\",\"X\",\"\")","v":{"$error":"#NAME?"}},{"$f":"IF(INDEX(periode2,NEVAL,Nenfant)=\"C\",\"X\",\"\")","v":{"$error":"#NAME?"}},{"$f":"IF(INDEX(periode2,NEVAL,Nenfant)=\"B\",\"X\",\"\")","v":{"$error":"#NAME?"}},{"$f":"IF(INDEX(periode2,NEVAL,Nenfant)=\"A\",\"X\",\"\")","v":{"$error":"#NAME?"}},null,{"$f":"IF(INDEX(periode3,NEVAL,Nenfant)=\"D\",\"X\",\"\")","v":{"$error":"#NAME?"}},{"$f":"IF(INDEX(periode3,NEVAL,Nenfant)=\"C\",\"X\",\"\")","v":{"$error":"#NAME?"}},{"$f":"IF(INDEX(periode3,NEVAL,Nenfant)=\"B\",\"X\",\"\")","v":{"$error":"#NAME?"}},{"$f":"IF(INDEX(periode3,NEVAL,Nenfant)=\"A\",\"X\",\"\")","v":{"$error":"#NAME?"}},null,{"$f":"IF(INDEX(periode4,NEVAL,Nenfant)=\"D\",\"X\",\"\")","v":{"$error":"#NAME?"}},{"$f":"IF(INDEX(periode4,NEVAL,Nenfant)=\"C\",\"X\",\"\")","v":{"$error":"#NAME?"}},{"$f":"IF(INDEX(periode4,NEVAL,Nenfant)=\"B\",\"X\",\"\")","v":{"$error":"#NAME?"}},{"$f":"IF(INDEX(periode4,NEVAL,Nenfant)=\"A\",\"X\",\"\")","v":{"$error":"#NAME?"}},null,{"$f":"IF(INDEX(periode5,NEVAL,Nenfant)=\"D\",\"X\",\"\")","v":{"$error":"#NAME?"}},{"$f":"IF(INDEX(periode5,NEVAL,Nenfant)=\"C\",\"X\",\"\")","v":{"$error":"#NAME?"}},{"$f":"IF(INDEX(periode5,NEVAL,Nenfant)=\"B\",\"X\",\"\")","v":{"$error":"#NAME?"}},{"$f":"IF(INDEX(periode5,NEVAL,Nenfant)=\"A\",\"X\",\"\")","v":{"$error":"#NAME?"}},null,{"$f":"IF(INDEX(periode6,NEVAL,Nenfant)=\"D\",\"X\",\"\")","v":{"$error":"#NAME?"}},{"$f":"IF(INDEX(periode6,NEVAL,Nenfant)=\"C\",\"X\",\"\")","v":{"$error":"#NAME?"}},{"$f":"IF(INDEX(periode6,NEVAL,Nenfant)=\"B\",\"X\",\"\")","v":{"$error":"#NAME?"}},{"$f":"IF(INDEX(periode6,NEVAL,Nenfant)=\"A\",\"X\",\"\")","v":{"$error":"#NAME?"}}]
[81,{"$nulls":7},{"$f":"COUNTIF($G82:$G85,\"X\")","v":0},{"$f":"COUNTIF($H82:$H85,\"X\")","v":0},{"$f":"COUNTIF($I82:$I85,\"X\")","v":0},{"$f":"COUNTIF($J82:$J85,\"X\")","v":0},null,{"$f":"COUNTIF($G82:$G85,\"X\")","v":0},{"$f":"COUNTIF($H82:$H85,\"X\")","v":0},{"$f":"COUNTIF($I82:$I85,\"X\")","v":0},{"$f":"COUNTIF($J82:$J85,\"X\")","v":0},null,{"$f":"COUNTIF($G82:$G85,\"X\")","v":0},{"$f":"COUNTIF($H82:$H85,\"X\")","v":0},{"$f":"COUNTIF($I82:$I85,\"X\")","v":0},{"$f":"COUNTIF(V82:V85,\"X\")","v":0},null,{"$f":"COUNTIF($G82:$G85,\"X\")","v":0},{"$f":"COUNTIF($H82:$H85,\"X\")","v":0},{"$f":"COUNTIF($I82:$I85,\"X\")","v":0},{"$f":"COUNTIF(AA82:AA85,\"X\")","v":0},null,{"$f":"COUNTIF($G82:$G85,\"X\")","v":0},{"$f":"COUNTIF($H82:$H85,\"X\")","v":0},{"$f":"COUNTIF($I82:$I85,\"X\")","v":0},{"$f":"COUNTIF($J82:$J85,\"X\")","v":0},null,{"$f":"COUNTIF($G82:$G85,\"X\")","v":0},{"$f":"COUNTIF($H82:$H85,\"X\")","v":0},{"$f":"COUNTIF($I82:$I85,\"X\")","v":0},{"$f":"COUNTIF($J82:$J85,\"X\")","v":0}]
[82,{"$nulls":7},{"$f":"IF(INDEX(periode1,NEVAL,Nenfant)=\"D\",\"X\",\"\")","v":{"$error":"#NAME?"}},{"$f":"IF(INDEX(periode1,NEVAL,Nenfant)=\"C\",\"X\",\"\")","v":{"$error":"#NAME?"}},{"$f":"IF(INDEX(periode1,NEVAL,Nenfant)=\"B\",\"X\",\"\")","v":{"$error":"#NAME?"}},{"$f":"IF(INDEX(periode1,NEVAL,Nenfant)=\"A\",\"X\",\"\")","v":{"$error":"#NAME?"}},null,{"$f":"IF(INDEX(periode2,NEVAL,Nenfant)=\"D\",\"X\",\"\")","v":{"$error":"#NAME?"}},{"$f":"IF(INDEX(periode2,NEVAL,Nenfant)=\"C\",\"X\",\"\")","v":{"$error":"#NAME?"}},{"$f":"IF(INDEX(periode2,NEVAL,Nenfant)=\"B\",\"X\",\"\")","v":{"$error":"#NAME?"}},{"$f":"IF(INDEX(periode2,NEVAL,Nenfant)=\"A\",\"X\",\"\")","v":{"$error":"#NAME?"}},null,{"$f":"IF(INDEX(periode3,NEVAL,Nenfant)=\"D\",\"X\",\"\")","v":{"$error":"#NAME?"}},{"$f":"IF(INDEX(periode3,NEVAL,Nenfant)=\"C\",\"X\",\"\")","v":{"$error":"#NAME?"}},{"$f":"IF(INDEX(periode3,NEVAL,Nenfant)=\"B\",\"X\",\"\")","v":{"$error":"#NAME?"}},{"$f":"IF(INDEX(periode3,NEVAL,Nenfant)=\"A\",\"X\",\"\")","v":{"$error":"#NAME?"}},null,{"$f":"IF(INDEX(periode4,NEVAL,Nenfant)=\"D\",\"X\",\"\")","v":{"$error":"#NAME?"}},{"$f":"IF(INDEX(periode4,NEVAL,Nenfant)=\"C\",\"X\",\"\")","v":{"$error":"#NAME?"}},{"$f":"IF(INDEX(periode4,NEVAL,Nenfant)=\"B\",\"X\",\"\")","v":{"$error":"#NAME?"}},{"$f":"IF(INDEX(periode4,NEVAL,Nenfant)=\"A\",\"X\",\"\")","v":{"$error":"#NAME?"}},null,{"$f":"IF(INDEX(periode5,NEVAL,Nenfant)=\"D\",\"X\",\"\")","v":{"$error":"#NAME?"}},{"$f":"IF(INDEX(periode5,NEVAL,Nenfant)=\"C\",\"X\",\"\")","v":{"$error":"#NAME?"}},{"$f":"IF(INDEX(periode5,NEVAL,Nenfant)=\"B\",\"X\",\"\")","v":{"$error":"#NAME?"}},{"$f":"IF(INDEX(periode5,NEVAL,Nenfant)=\"A\",\"X\",\"\")","v":{"$error":"#NAME?"}},null,{"$f":"IF(INDEX(periode6,NEVAL,Nenfant)=\"D\",\"X\",\"\")","v":{"$error":"#NAME?"}},{"$f":"IF(INDEX(periode6,NEVAL,Nenfant)=\"C\",\"X\",\"\")","v":{"$error":"#NAME?"}},{"$f":"IF(INDEX(periode6,NEVAL,Nenfant)=\"B\",\"X\",\"\")","v":{"$error":"#NAME?"}},{"$f":"IF(INDEX(periode6,NEVAL,Nenfant)=\"A\",\"X\",\"\")","v":{"$error":"#NAME?"}}]
[83,{"$nulls":7},{"$f":"IF(INDEX(periode1,NEVAL,Nenfant)=\"D\",\"X\",\"\")","v":{"$error":"#NAME?"}},{"$f":"IF(INDEX(periode1,NEVAL,Nenfant)=\"C\",\"X\",\"\")","v":{"$error":"#NAME?"}},{"$f":"IF(INDEX(periode1,NEVAL,Nenfant)=\"B\",\"X\",\"\")","v":{"$error":"#NAME?"}},{"$f":"IF(INDEX(periode1,NEVAL,Nenfant)=\"A\",\"X\",\"\")","v":{"$error":"#NAME?"}},null,{"$f":"IF(INDEX(periode2,NEVAL,Nenfant)=\"D\",\"X\",\"\")","v":{"$error":"#NAME?"}},{"$f":"IF(INDEX(periode2,NEVAL,Nenfant)=\"C\",\"X\",\"\")","v":{"$error":"#NAME?"}},{"$f":"IF(INDEX(periode2,NEVAL,Nenfant)=\"B\",\"X\",\"\")","v":{"$error":"#NAME?"}},{"$f":"IF(INDEX(periode2,NEVAL,Nenfant)=\"A\",\"X\",\"\")","v":{"$error":"#NAME?"}},null,{"$f":"IF(INDEX(periode3,NEVAL,Nenfant)=\"D\",\"X\",\"\")","v":{"$error":"#NAME?"}},{"$f":"IF(INDEX(periode3,NEVAL,Nenfant)=\"C\",\"X\",\"\")","v":{"$error":"#NAME?"}},{"$f":"IF(INDEX(periode3,NEVAL,Nenfant)=\"B\",\"X\",\"\")","v":{"$error":"#NAME?"}},{"$f":"IF(INDEX(periode3,NEVAL,Nenfant)=\"A\",\"X\",\"\")","v":{"$error":"#NAME?"}},null,{"$f":"IF(INDEX(periode4,NEVAL,Nenfant)=\"D\",\"X\",\"\")","v":{"$error":"#NAME?"}},{"$f":"IF(INDEX(periode4,NEVAL,Nenfant)=\"C\",\"X\",\"\")","v":{"$error":"#NAME?"}},{"$f":"IF(INDEX(periode4,NEVAL,Nenfant)=\"B\",\"X\",\"\")","v":{"$error":"#NAME?"}},{"$f":"IF(INDEX(periode4,NEVAL,Nenfant)=\"A\",\"X\",\"\")","v":{"$error":"#NAME?"}},null,{"$f":"IF(INDEX(periode5,NEVAL,Nenfant)=\"D\",\"X\",\"\")","v":{"$error":"#NAME?"}},{"$f":"IF(INDEX(periode5,NEVAL,Nenfant)=\"C\",\"X\",\"\")","v":{"$error":"#NAME?"}},{"$f":"IF(INDEX(periode5,NEVAL,Nenfant)=\"B\",\"X\",\"\")","v":{"$error":"#NAME?"}},{"$f":"IF(INDEX(periode5,NEVAL,Nenfant)=\"A\",\"X\",\"\")","v":{"$error":"#NAME?"}},null,{"$f":"IF(INDEX(periode6,NEVAL,Nenfant)=\"D\",\"X\",\"\")","v":{"$error":"#NAME?"}},{"$f":"IF(INDEX(periode6,NEVAL,Nenfant)=\"C\",\"X\",\"\")","v":{"$error":"#NAME?"}},{"$f":"IF(INDEX(periode6,NEVAL,Nenfant)=\"B\",\"X\",\"\")","v":{"$error":"#NAME?"}},{"$f":"IF(INDEX(periode6,NEVAL,Nenfant)=\"A\",\"X\",\"\")","v":{"$error":"#NAME?"}}]
[84,{"$nulls":7},{"$f":"IF(INDEX(periode1,NEVAL,Nenfant)=\"D\",\"X\",\"\")","v":{"$error":"#NAME?"}},{"$f":"IF(INDEX(periode1,NEVAL,Nenfant)=\"C\",\"X\",\"\")","v":{"$error":"#NAME?"}},{"$f":"IF(INDEX(periode1,NEVAL,Nenfant)=\"B\",\"X\",\"\")","v":{"$error":"#NAME?"}},{"$f":"IF(INDEX(periode1,NEVAL,Nenfant)=\"A\",\"X\",\"\")","v":{"$error":"#NAME?"}},null,{"$f":"IF(INDEX(periode2,NEVAL,Nenfant)=\"D\",\"X\",\"\")","v":{"$error":"#NAME?"}},{"$f":"IF(INDEX(periode2,NEVAL,Nenfant)=\"C\",\"X\",\"\")","v":{"$error":"#NAME?"}},{"$f":"IF(INDEX(periode2,NEVAL,Nenfant)=\"B\",\"X\",\"\")","v":{"$error":"#NAME?"}},{"$f":"IF(INDEX(periode2,NEVAL,Nenfant)=\"A\",\"X\",\"\")","v":{"$error":"#NAME?"}},null,{"$f":"IF(INDEX(periode3,NEVAL,Nenfant)=\"D\",\"X\",\"\")","v":{"$error":"#NAME?"}},{"$f":"IF(INDEX(periode3,NEVAL,Nenfant)=\"C\",\"X\",\"\")","v":{"$error":"#NAME?"}},{"$f":"IF(INDEX(periode3,NEVAL,Nenfant)=\"B\",\"X\",\"\")","v":{"$error":"#NAME?"}},{"$f":"IF(INDEX(periode3,NEVAL,Nenfant)=\"A\",\"X\",\"\")","v":{"$error":"#NAME?"}},null,{"$f":"IF(INDEX(periode4,NEVAL,Nenfant)=\"D\",\"X\",\"\")","v":{"$error":"#NAME?"}},{"$f":"IF(INDEX(periode4,NEVAL,Nenfant)=\"C\",\"X\",\"\")","v":{"$error":"#NAME?"}},{"$f":"IF(INDEX(periode4,NEVAL,Nenfant)=\"B\",\"X\",\"\")","v":{"$error":"#NAME?"}},{"$f":"IF(INDEX(periode4,NEVAL,Nenfant)=\"A\",\"X\",\"\")","v":{"$error":"#NAME?"}},null,{"$f":"IF(INDEX(periode5,NEVAL,Nenfant)=\"D\",\"X\",\"\")","v":{"$error":"#NAME?"}},{"$f":"IF(INDEX(periode5,NEVAL,Nenfant)=\"C\",\"X\",\"\")","v":{"$error":"#NAME?"}},{"$f":"IF(INDEX(periode5,NEVAL,Nenfant)=\"B\",\"X\",\"\")","v":{"$error":"#NAME?"}},{"$f":"IF(INDEX(periode5,NEVAL,Nenfant)=\"A\",\"X\",\"\")","v":{"$error":"#NAME?"}},null,{"$f":"IF(INDEX(periode6,NEVAL,Nenfant)=\"D\",\"X\",\"\")","v":{"$error":"#NAME?"}},{"$f":"IF(INDEX(periode6,NEVAL,Nenfant)=\"C\",\"X\",\"\")","v":{"$error":"#NAME?"}},{"$f":"IF(INDEX(periode6,NEVAL,Nenfant)=\"B\",\"X\",\"\")","v":{"$error":"#NAME?"}},{"$f":"IF(INDEX(periode6,NEVAL,Nenfant)=\"A\",\"X\",\"\")","v":{"$error":"#NAME?"}}]
[85,{"$nulls":7},{"$f":"IF(INDEX(periode1,NEVAL,Nenfant)=\"D\",\"X\",\"\")","v":{"$error":"#NAME?"}},{"$f":"IF(INDEX(periode1,NEVAL,Nenfant)=\"C\",\"X\",\"\")","v":{"$error":"#NAME?"}},{"$f":"IF(INDEX(periode1,NEVAL,Nenfant)=\"B\",\"X\",\"\")","v":{"$error":"#NAME?"}},{"$f":"IF(INDEX(periode1,NEVAL,Nenfant)=\"A\",\"X\",\"\")","v":{"$error":"#NAME?"}},null,{"$f":"IF(INDEX(periode2,NEVAL,Nenfant)=\"D\",\"X\",\"\")","v":{"$error":"#NAME?"}},{"$f":"IF(INDEX(periode2,NEVAL,Nenfant)=\"C\",\"X\",\"\")","v":{"$error":"#NAME?"}},{"$f":"IF(INDEX(periode2,NEVAL,Nenfant)=\"B\",\"X\",\"\")","v":{"$error":"#NAME?"}},{"$f":"IF(INDEX(periode2,NEVAL,Nenfant)=\"A\",\"X\",\"\")","v":{"$error":"#NAME?"}},null,{"$f":"IF(INDEX(periode3,NEVAL,Nenfant)=\"D\",\"X\",\"\")","v":{"$error":"#NAME?"}},{"$f":"IF(INDEX(periode3,NEVAL,Nenfant)=\"C\",\"X\",\"\")","v":{"$error":"#NAME?"}},{"$f":"IF(INDEX(periode3,NEVAL,Nenfant)=\"B\",\"X\",\"\")","v":{"$error":"#NAME?"}},{"$f":"IF(INDEX(periode3,NEVAL,Nenfant)=\"A\",\"X\",\"\")","v":{"$error":"#NAME?"}},null,{"$f":"IF(INDEX(periode4,NEVAL,Nenfant)=\"D\",\"X\",\"\")","v":{"$error":"#NAME?"}},{"$f":"IF(INDEX(periode4,NEVAL,Nenfant)=\"C\",\"X\",\"\")","v":{"$error":"#NAME?"}},{"$f":"IF(INDEX(periode4,NEVAL,Nenfant)=\"B\",\"X\",\"\")","v":{"$error":"#NAME?"}},{"$f":"IF(INDEX(periode4,NEVAL,Nenfant)=\"A\",\"X\",\"\")","v":{"$error":"#NAME?"}},null,{"$f":"IF(INDEX(periode5,NEVAL,Nenfant)=\"D\",\"X\",\"\")","v":{"$error":"#NAME?"}},{"$f":"IF(INDEX(periode5,NEVAL,Nenfant)=\"C\",\"X\",\"\")","v":{"$error":"#NAME?"}},{"$f":"IF(INDEX(periode5,NEVAL,Nenfant)=\"B\",\"X\",\"\")","v":{"$error":"#NAME?"}},{"$f":"IF(INDEX(periode5,NEVAL,Nenfant)=\"A\",\"X\",\"\")","v":{"$error":"#NAME?"}},null,{"$f":"IF(INDEX(periode6,NEVAL,Nenfant)=\"D\",\"X\",\"\")","v":{"$error":"#NAME?"}},{"$f":"IF(INDEX(periode6,NEVAL,Nenfant)=\"C\",\"X\",\"\")","v":{"$error":"#NAME?"}},{"$f":"IF(INDEX(periode6,NEVAL,Nenfant)=\"B\",\"X\",\"\")","v":{"$error":"#NAME?"}},{"$f":"IF(INDEX(periode6,NEVAL,Nenfant)=\"A\",\"X\",\"\")","v":{"$error":"#NAME?"}}]
[86,{"$nulls":7},{"$f":"COUNTIF($G87:$G93,\"X\")","v":0},{"$f":"COUNTIF($H87:$H93,\"X\")","v":0},{"$f":"COUNTIF($I87:$I93,\"X\")","v":0},{"$f":"COUNTIF($J87:$J93,\"X\")","v":0},null,{"$f":"COUNTIF($G87:$G93,\"X\")","v":0},{"$f":"COUNTIF($H87:$H93,\"X\")","v":0},{"$f":"COUNTIF($I87:$I93,\"X\")","v":0},{"$f":"COUNTIF($J87:$J93,\"X\")","v":0},null,{"$f":"COUNTIF($G87:$G93,\"X\")","v":0},{"$f":"COUNTIF($H87:$H93,\"X\")","v":0},{"$f":"COUNTIF($I87:$I93,\"X\")","v":0},{"$f":"COUNTIF($J87:$J93,\"X\")","v":0},null,{"$f":"COUNTIF($G87:$G93,\"X\")","v":0},{"$f":"COUNTIF($H87:$H93,\"X\")","v":0},{"$f":"COUNTIF($I87:$I93,\"X\")","v":0},{"$f":"COUNTIF(AA87:AA93,\"X\")","v":0},null,{"$f":"COUNTIF($G87:$G93,\"X\")","v":0},{"$f":"COUNTIF($H87:$H93,\"X\")","v":0},{"$f":"COUNTIF($I87:$I93,\"X\")","v":0},{"$f":"COUNTIF($J87:$J93,\"X\")","v":0},null,{"$f":"COUNTIF($G87:$G93,\"X\")","v":0},{"$f":"COUNTIF($H87:$H93,\"X\")","v":0},{"$f":"COUNTIF($I87:$I93,\"X\")","v":0},{"$f":"COUNTIF($J87:$J93,\"X\")","v":0}]
[87,{"$nulls":7},{"$f":"IF(INDEX(periode1,NEVAL,Nenfant)=\"D\",\"X\",\"\")","v":{"$error":"#NAME?"}},{"$f":"IF(INDEX(periode1,NEVAL,Nenfant)=\"C\",\"X\",\"\")","v":{"$error":"#NAME?"}},{"$f":"IF(INDEX(periode1,NEVAL,Nenfant)=\"B\",\"X\",\"\")","v":{"$error":"#NAME?"}},{"$f":"IF(INDEX(periode1,NEVAL,Nenfant)=\"A\",\"X\",\"\")","v":{"$error":"#NAME?"}},null,{"$f":"IF(INDEX(periode2,NEVAL,Nenfant)=\"D\",\"X\",\"\")","v":{"$error":"#NAME?"}},{"$f":"IF(INDEX(periode2,NEVAL,Nenfant)=\"C\",\"X\",\"\")","v":{"$error":"#NAME?"}},{"$f":"IF(INDEX(periode2,NEVAL,Nenfant)=\"B\",\"X\",\"\")","v":{"$error":"#NAME?"}},{"$f":"IF(INDEX(periode2,NEVAL,Nenfant)=\"A\",\"X\",\"\")","v":{"$error":"#NAME?"}},null,{"$f":"IF(INDEX(periode3,NEVAL,Nenfant)=\"D\",\"X\",\"\")","v":{"$error":"#NAME?"}},{"$f":"IF(INDEX(periode3,NEVAL,Nenfant)=\"C\",\"X\",\"\")","v":{"$error":"#NAME?"}},{"$f":"IF(INDEX(periode3,NEVAL,Nenfant)=\"B\",\"X\",\"\")","v":{"$error":"#NAME?"}},{"$f":"IF(INDEX(periode3,NEVAL,Nenfant)=\"A\",\"X\",\"\")","v":{"$error":"#NAME?"}},null,{"$f":"IF(INDEX(periode4,NEVAL,Nenfant)=\"D\",\"X\",\"\")","v":{"$error":"#NAME?"}},{"$f":"IF(INDEX(periode4,NEVAL,Nenfant)=\"C\",\"X\",\"\")","v":{"$error":"#NAME?"}},{"$f":"IF(INDEX(periode4,NEVAL,Nenfant)=\"B\",\"X\",\"\")","v":{"$error":"#NAME?"}},{"$f":"IF(INDEX(periode4,NEVAL,Nenfant)=\"A\",\"X\",\"\")","v":{"$error":"#NAME?"}},null,{"$f":"IF(INDEX(periode5,NEVAL,Nenfant)=\"D\",\"X\",\"\")","v":{"$error":"#NAME?"}},{"$f":"IF(INDEX(periode5,NEVAL,Nenfant)=\"C\",\"X\",\"\")","v":{"$error":"#NAME?"}},{"$f":"IF(INDEX(periode5,NEVAL,Nenfant)=\"B\",\"X\",\"\")","v":{"$error":"#NAME?"}},{"$f":"IF(INDEX(periode5,NEVAL,Nenfant)=\"A\",\"X\",\"\")","v":{"$error":"#NAME?"}},null,{"$f":"IF(INDEX(periode6,NEVAL,Nenfant)=\"D\",\"X\",\"\")","v":{"$error":"#NAME?"}},{"$f":"IF(INDEX(periode6,NEVAL,Nenfant)=\"C\",\"X\",\"\")","v":{"$error":"#NAME?"}},{"$f":"IF(INDEX(periode6,NEVAL,Nenfant)=\"B\",\"X\",\"\")","v":{"$error":"#NAME?"}},{"$f":"IF(INDEX(periode6,NEVAL,Nenfant)=\"A\",\"X\",\"\")","v":{"$error":"#NAME?"}}]
[88,{"$nulls":7},{"$f":"COUNTIF($G89:$G95,\"X\")","v":0},{"$f":"COUNTIF($H89:$H95,\"X\")","v":0},{"$f":"COUNTIF($I89:$I95,\"X\")","v":0},{"$f":"COUNTIF($J89:$J95,\"X\")","v":0},null,{"$f":"COUNTIF($G89:$G95,\"X\")","v":0},{"$f":"COUNTIF($H89:$H95,\"X\")","v":0},{"$f":"COUNTIF($I89:$I95,\"X\")","v":0},{"$f":"COUNTIF($J89:$J95,\"X\")","v":0},null,{"$f":"COUNTIF($G89:$G95,\"X\")","v":0},{"$f":"COUNTIF($H89:$H95,\"X\")","v":0},{"$f":"COUNTIF($I89:$I95,\"X\")","v":0},{"$f":"COUNTIF($J89:$J95,\"X\")","v":0},null,{"$f":"COUNTIF($G89:$G95,\"X\")","v":0},{"$f":"COUNTIF($H89:$H95,\"X\")","v":0},{"$f":"COUNTIF($I89:$I95,\"X\")","v":0},{"$f":"COUNTIF(AA89:AA95,\"X\")","v":0},null,{"$f":"COUNTIF($G89:$G95,\"X\")","v":0},{"$f":"COUNTIF($H89:$H95,\"X\")","v":0},{"$f":"COUNTIF($I89:$I95,\"X\")","v":0},{"$f":"COUNTIF($J89:$J95,\"X\")","v":0},null,{"$f":"COUNTIF($G89:$G95,\"X\")","v":0},{"$f":"COUNTIF($H89:$H95,\"X\")","v":0},{"$f":"COUNTIF($I89:$I95,\"X\")","v":0},{"$f":"COUNTIF($J89:$J95,\"X\")","v":0}]
[89,{"$nulls":7},{"$f":"IF(INDEX(periode1,NEVAL,Nenfant)=\"D\",\"X\",\"\")","v":{"$error":"#NAME?"}},{"$f":"IF(INDEX(periode1,NEVAL,Nenfant)=\"C\",\"X\",\"\")","v":{"$error":"#NAME?"}},{"$f":"IF(INDEX(periode1,NEVAL,Nenfant)=\"B\",\"X\",\"\")","v":{"$error":"#NAME?"}},{"$f":"IF(INDEX(periode1,NEVAL,Nenfant)=\"A\",\"X\",\"\")","v":{"$error":"#NAME?"}},null,{"$f":"IF(INDEX(periode2,NEVAL,Nenfant)=\"D\",\"X\",\"\")","v":{"$error":"#NAME?"}},{"$f":"IF(INDEX(periode2,NEVAL,Nenfant)=\"C\",\"X\",\"\")","v":{"$error":"#NAME?"}},{"$f":"IF(INDEX(periode2,NEVAL,Nenfant)=\"B\",\"X\",\"\")","v":{"$error":"#NAME?"}},{"$f":"IF(INDEX(periode2,NEVAL,Nenfant)=\"A\",\"X\",\"\")","v":{"$error":"#NAME?"}},null,{"$f":"IF(INDEX(periode3,NEVAL,Nenfant)=\"D\",\"X\",\"\")","v":{"$error":"#NAME?"}},{"$f":"IF(INDEX(periode3,NEVAL,Nenfant)=\"C\",\"X\",\"\")","v":{"$error":"#NAME?"}},{"$f":"IF(INDEX(periode3,NEVAL,Nenfant)=\"B\",\"X\",\"\")","v":{"$error":"#NAME?"}},{"$f":"IF(INDEX(periode3,NEVAL,Nenfant)=\"A\",\"X\",\"\")","v":{"$error":"#NAME?"}},null,{"$f":"IF(INDEX(periode4,NEVAL,Nenfant)=\"D\",\"X\",\"\")","v":{"$error":"#NAME?"}},{"$f":"IF(INDEX(periode4,NEVAL,Nenfant)=\"C\",\"X\",\"\")","v":{"$error":"#NAME?"}},{"$f":"IF(INDEX(periode4,NEVAL,Nenfant)=\"B\",\"X\",\"\")","v":{"$error":"#NAME?"}},{"$f":"IF(INDEX(periode4,NEVAL,Nenfant)=\"A\",\"X\",\"\")","v":{"$error":"#NAME?"}},null,{"$f":"IF(INDEX(periode5,NEVAL,Nenfant)=\"D\",\"X\",\"\")","v":{"$error":"#NAME?"}},{"$f":"IF(INDEX(periode5,NEVAL,Nenfant)=\"C\",\"X\",\"\")","v":{"$error":"#NAME?"}},{"$f":"IF(INDEX(periode5,NEVAL,Nenfant)=\"B\",\"X\",\"\")","v":{"$error":"#NAME?"}},{"$f":"IF(INDEX(periode5,NEVAL,Nenfant)=\"A\",\"X\",\"\")","v":{"$error":"#NAME?"}},null,{"$f":"IF(INDEX(periode6,NEVAL,Nenfant)=\"D\",\"X\",\"\")","v":{"$error":"#NAME?"}},{"$f":"IF(INDEX(periode6,NEVAL,Nenfant)=\"C\",\"X\",\"\")","v":{"$error":"#NAME?"}},{"$f":"IF(INDEX(periode6,NEVAL,Nenfant)=\"B\",\"X\",\"\")","v":{"$error":"#NAME?"}},{"$f":"IF(INDEX(periode6,NEVAL,Nenfant)=\"A\",\"X\",\"\")","v":{"$error":"#NAME?"}}]
[90,{"$nulls":7},{"$f":"COUNTIF($G91:$G97,\"X\")","v":0},{"$f":"COUNTIF($H91:$H97,\"X\")","v":0},{"$f":"COUNTIF($I91:$I97,\"X\")","v":0},{"$f":"COUNTIF($J91:$J97,\"X\")","v":0},null,{"$f":"COUNTIF($G91:$G97,\"X\")","v":0},{"$f":"COUNTIF($H91:$H97,\"X\")","v":0},{"$f":"COUNTIF($I91:$I97,\"X\")","v":0},{"$f":"COUNTIF($J91:$J97,\"X\")","v":0},null,{"$f":"COUNTIF($G91:$G97,\"X\")","v":0},{"$f":"COUNTIF($H91:$H97,\"X\")","v":0},{"$f":"COUNTIF($I91:$I97,\"X\")","v":0},{"$f":"COUNTIF($J91:$J97,\"X\")","v":0},null,{"$f":"COUNTIF($G91:$G97,\"X\")","v":0},{"$f":"COUNTIF($H91:$H97,\"X\")","v":0},{"$f":"COUNTIF($I91:$I97,\"X\")","v":0},{"$f":"COUNTIF(AA91:AA97,\"X\")","v":0},null,{"$f":"COUNTIF($G91:$G97,\"X\")","v":0},{"$f":"COUNTIF($H91:$H97,\"X\")","v":0},{"$f":"COUNTIF($I91:$I97,\"X\")","v":0},{"$f":"COUNTIF($J91:$J97,\"X\")","v":0},null,{"$f":"COUNTIF($G91:$G97,\"X\")","v":0},{"$f":"COUNTIF($H91:$H97,\"X\")","v":0},{"$f":"COUNTIF($I91:$I97,\"X\")","v":0},{"$f":"COUNTIF($J91:$J97,\"X\")","v":0}]
[91,{"$nulls":7},{"$f":"IF(INDEX(periode1,NEVAL,Nenfant)=\"D\",\"X\",\"\")","v":{"$error":"#NAME?"}},{"$f":"IF(INDEX(periode1,NEVAL,Nenfant)=\"C\",\"X\",\"\")","v":{"$error":"#NAME?"}},{"$f":"IF(INDEX(periode1,NEVAL,Nenfant)=\"B\",\"X\",\"\")","v":{"$error":"#NAME?"}},{"$f":"IF(INDEX(periode1,NEVAL,Nenfant)=\"A\",\"X\",\"\")","v":{"$error":"#NAME?"}},null,{"$f":"IF(INDEX(periode2,NEVAL,Nenfant)=\"D\",\"X\",\"\")","v":{"$error":"#NAME?"}},{"$f":"IF(INDEX(periode2,NEVAL,Nenfant)=\"C\",\"X\",\"\")","v":{"$error":"#NAME?"}},{"$f":"IF(INDEX(periode2,NEVAL,Nenfant)=\"B\",\"X\",\"\")","v":{"$error":"#NAME?"}},{"$f":"IF(INDEX(periode2,NEVAL,Nenfant)=\"A\",\"X\",\"\")","v":{"$error":"#NAME?"}},null,{"$f":"IF(INDEX(periode3,NEVAL,Nenfant)=\"D\",\"X\",\"\")","v":{"$error":"#NAME?"}},{"$f":"IF(INDEX(periode3,NEVAL,Nenfant)=\"C\",\"X\",\"\")","v":{"$error":"#NAME?"}},{"$f":"IF(INDEX(periode3,NEVAL,Nenfant)=\"B\",\"X\",\"\")","v":{"$error":"#NAME?"}},{"$f":"IF(INDEX(periode3,NEVAL,Nenfant)=\"A\",\"X\",\"\")","v":{"$error":"#NAME?"}},null,{"$f":"IF(INDEX(periode4,NEVAL,Nenfant)=\"D\",\"X\",\"\")","v":{"$error":"#NAME?"}},{"$f":"IF(INDEX(periode4,NEVAL,Nenfant)=\"C\",\"X\",\"\")","v":{"$error":"#NAME?"}},{"$f":"IF(INDEX(periode4,NEVAL,Nenfant)=\"B\",\"X\",\"\")","v":{"$error":"#NAME?"}},{"$f":"IF(INDEX(periode4,NEVAL,Nenfant)=\"A\",\"X\",\"\")","v":{"$error":"#NAME?"}},null,{"$f":"IF(INDEX(periode5,NEVAL,Nenfant)=\"D\",\"X\",\"\")","v":{"$error":"#NAME?"}},{"$f":"IF(INDEX(periode5,NEVAL,Nenfant)=\"C\",\"X\",\"\")","v":{"$error":"#NAME?"}},{"$f":"IF(INDEX(periode5,NEVAL,Nenfant)=\"B\",\"X\",\"\")","v":{"$error":"#NAME?"}},{"$f":"IF(INDEX(periode5,NEVAL,Nenfant)=\"A\",\"X\",\"\")","v":{"$error":"#NAME?"}},null,{"$f":"IF(INDEX(periode6,NEVAL,Nenfant)=\"D\",\"X\",\"\")","v":{"$error":"#NAME?"}},{"$f":"IF(INDEX(periode6,NEVAL,Nenfant)=\"C\",\"X\",\"\")","v":{"$error":"#NAME?"}},{"$f":"IF(INDEX(periode6,NEVAL,Nenfant)=\"B\",\"X\",\"\")","v":{"$error":"#NAME?"}},{"$f":"IF(INDEX(periode6,NEVAL,Nenfant)=\"A\",\"X\",\"\")","v":{"$error":"#NAME?"}}]
[92,{"$nulls":7},{"$f":"COUNTIF($G93:$G98,\"X\")","v":0},{"$f":"COUNTIF($H93:$H98,\"X\")","v":0},{"$f":"COUNTIF($I93:$I98,\"X\")","v":0},{"$f":"COUNTIF($J93:$J98,\"X\")","v":0},null,{"$f":"COUNTIF($G93:$G98,\"X\")","v":0},{"$f":"COUNTIF($H93:$H98,\"X\")","v":0},{"$f":"COUNTIF($I93:$I98,\"X\")","v":0},{"$f":"COUNTIF($J93:$J98,\"X\")","v":0},null,{"$f":"COUNTIF($G93:$G98,\"X\")","v":0},{"$f":"COUNTIF($H93:$H98,\"X\")","v":0},{"$f":"COUNTIF($I93:$I98,\"X\")","v":0},{"$f":"COUNTIF($J93:$J98,\"X\")","v":0},null,{"$f":"COUNTIF($G93:$G98,\"X\")","v":0},{"$f":"COUNTIF($H93:$H98,\"X\")","v":0},{"$f":"COUNTIF($I93:$I98,\"X\")","v":0},{"$f":"COUNTIF(AA93:AA98,\"X\")","v":0},null,{"$f":"COUNTIF($G93:$G98,\"X\")","v":0},{"$f":"COUNTIF($H93:$H98,\"X\")","v":0},{"$f":"COUNTIF($I93:$I98,\"X\")","v":0},{"$f":"COUNTIF($J93:$J98,\"X\")","v":0},null,{"$f":"COUNTIF($G93:$G98,\"X\")","v":0},{"$f":"COUNTIF($H93:$H98,\"X\")","v":0},{"$f":"COUNTIF($I93:$I98,\"X\")","v":0},{"$f":"COUNTIF($J93:$J98,\"X\")","v":0}]
[93,{"$nulls":7},{"$f":"IF(INDEX(periode1,NEVAL,Nenfant)=\"D\",\"X\",\"\")","v":{"$error":"#NAME?"}},{"$f":"IF(INDEX(periode1,NEVAL,Nenfant)=\"C\",\"X\",\"\")","v":{"$error":"#NAME?"}},{"$f":"IF(INDEX(periode1,NEVAL,Nenfant)=\"B\",\"X\",\"\")","v":{"$error":"#NAME?"}},{"$f":"IF(INDEX(periode1,NEVAL,Nenfant)=\"A\",\"X\",\"\")","v":{"$error":"#NAME?"}},null,{"$f":"IF(INDEX(periode2,NEVAL,Nenfant)=\"D\",\"X\",\"\")","v":{"$error":"#NAME?"}},{"$f":"IF(INDEX(periode2,NEVAL,Nenfant)=\"C\",\"X\",\"\")","v":{"$error":"#NAME?"}},{"$f":"IF(INDEX(periode2,NEVAL,Nenfant)=\"B\",\"X\",\"\")","v":{"$error":"#NAME?"}},{"$f":"IF(INDEX(periode2,NEVAL,Nenfant)=\"A\",\"X\",\"\")","v":{"$error":"#NAME?"}},null,{"$f":"IF(INDEX(periode3,NEVAL,Nenfant)=\"D\",\"X\",\"\")","v":{"$error":"#NAME?"}},{"$f":"IF(INDEX(periode3,NEVAL,Nenfant)=\"C\",\"X\",\"\")","v":{"$error":"#NAME?"}},{"$f":"IF(INDEX(periode3,NEVAL,Nenfant)=\"B\",\"X\",\"\")","v":{"$error":"#NAME?"}},{"$f":"IF(INDEX(periode3,NEVAL,Nenfant)=\"A\",\"X\",\"\")","v":{"$error":"#NAME?"}},null,{"$f":"IF(INDEX(periode4,NEVAL,Nenfant)=\"D\",\"X\",\"\")","v":{"$error":"#NAME?"}},{"$f":"IF(INDEX(periode4,NEVAL,Nenfant)=\"C\",\"X\",\"\")","v":{"$error":"#NAME?"}},{"$f":"IF(INDEX(periode4,NEVAL,Nenfant)=\"B\",\"X\",\"\")","v":{"$error":"#NAME?"}},{"$f":"IF(INDEX(periode4,NEVAL,Nenfant)=\"A\",\"X\",\"\")","v":{"$error":"#NAME?"}},null,{"$f":"IF(INDEX(periode5,NEVAL,Nenfant)=\"D\",\"X\",\"\")","v":{"$error":"#NAME?"}},{"$f":"IF(INDEX(periode5,NEVAL,Nenfant)=\"C\",\"X\",\"\")","v":{"$error":"#NAME?"}},{"$f":"IF(INDEX(periode5,NEVAL,Nenfant)=\"B\",\"X\",\"\")","v":{"$error":"#NAME?"}},{"$f":"IF(INDEX(periode5,NEVAL,Nenfant)=\"A\",\"X\",\"\")","v":{"$error":"#NAME?"}},null,{"$f":"IF(INDEX(periode6,NEVAL,Nenfant)=\"D\",\"X\",\"\")","v":{"$error":"#NAME?"}},{"$f":"IF(INDEX(periode6,NEVAL,Nenfant)=\"C\",\"X\",\"\")","v":{"$error":"#NAME?"}},{"$f":"IF(INDEX(periode6,NEVAL,Nenfant)=\"B\",\"X\",\"\")","v":{"$error":"#NAME?"}},{"$f":"IF(INDEX(periode6,NEVAL,Nenfant)=\"A\",\"X\",\"\")","v":{"$error":"#NAME?"}}]
[94,{"$nulls":7},{"$f":"COUNTIF($G95:$G98,\"X\")","v":0},{"$f":"COUNTIF($H95:$H98,\"X\")","v":0},{"$f":"COUNTIF($I95:$I98,\"X\")","v":0},{"$f":"COUNTIF($J95:$J98,\"X\")","v":0},null,{"$f":"COUNTIF($G95:$G98,\"X\")","v":0},{"$f":"COUNTIF($H95:$H98,\"X\")","v":0},{"$f":"COUNTIF($I95:$I98,\"X\")","v":0},{"$f":"COUNTIF($J95:$J98,\"X\")","v":0},null,{"$f":"COUNTIF($G95:$G98,\"X\")","v":0},{"$f":"COUNTIF($H95:$H98,\"X\")","v":0},{"$f":"COUNTIF($I95:$I98,\"X\")","v":0},{"$f":"COUNTIF($J95:$J98,\"X\")","v":0},null,{"$f":"COUNTIF($G95:$G98,\"X\")","v":0},{"$f":"COUNTIF($H95:$H98,\"X\")","v":0},{"$f":"COUNTIF($I95:$I98,\"X\")","v":0},{"$f":"COUNTIF(AA95:AA98,\"X\")","v":0},null,{"$f":"COUNTIF($G95:$G98,\"X\")","v":0},{"$f":"COUNTIF($H95:$H98,\"X\")","v":0},{"$f":"COUNTIF($I95:$I98,\"X\")","v":0},{"$f":"COUNTIF($J95:$J98,\"X\")","v":0},null,{"$f":"COUNTIF($G95:$G98,\"X\")","v":0},{"$f":"COUNTIF($H95:$H98,\"X\")","v":0},{"$f":"COUNTIF($I95:$I98,\"X\")","v":0},{"$f":"COUNTIF($J95:$J98,\"X\")","v":0}]
[95,{"$nulls":7},{"$f":"IF(INDEX(periode1,NEVAL,Nenfant)=\"D\",\"X\",\"\")","v":{"$error":"#NAME?"}},{"$f":"IF(INDEX(periode1,NEVAL,Nenfant)=\"C\",\"X\",\"\")","v":{"$error":"#NAME?"}},{"$f":"IF(INDEX(periode1,NEVAL,Nenfant)=\"B\",\"X\",\"\")","v":{"$error":"#NAME?"}},{"$f":"IF(INDEX(periode1,NEVAL,Nenfant)=\"A\",\"X\",\"\")","v":{"$error":"#NAME?"}},null,{"$f":"IF(INDEX(periode2,NEVAL,Nenfant)=\"D\",\"X\",\"\")","v":{"$error":"#NAME?"}},{"$f":"IF(INDEX(periode2,NEVAL,Nenfant)=\"C\",\"X\",\"\")","v":{"$error":"#NAME?"}},{"$f":"IF(INDEX(periode2,NEVAL,Nenfant)=\"B\",\"X\",\"\")","v":{"$error":"#NAME?"}},{"$f":"IF(INDEX(periode2,NEVAL,Nenfant)=\"A\",\"X\",\"\")","v":{"$error":"#NAME?"}},null,{"$f":"IF(INDEX(periode3,NEVAL,Nenfant)=\"D\",\"X\",\"\")","v":{"$error":"#NAME?"}},{"$f":"IF(INDEX(periode3,NEVAL,Nenfant)=\"C\",\"X\",\"\")","v":{"$error":"#NAME?"}},{"$f":"IF(INDEX(periode3,NEVAL,Nenfant)=\"B\",\"X\",\"\")","v":{"$error":"#NAME?"}},{"$f":"IF(INDEX(periode3,NEVAL,Nenfant)=\"A\",\"X\",\"\")","v":{"$error":"#NAME?"}},null,{"$f":"IF(INDEX(periode4,NEVAL,Nenfant)=\"D\",\"X\",\"\")","v":{"$error":"#NAME?"}},{"$f":"IF(INDEX(periode4,NEVAL,Nenfant)=\"C\",\"X\",\"\")","v":{"$error":"#NAME?"}},{"$f":"IF(INDEX(periode4,NEVAL,Nenfant)=\"B\",\"X\",\"\")","v":{"$error":"#NAME?"}},{"$f":"IF(INDEX(periode4,NEVAL,Nenfant)=\"A\",\"X\",\"\")","v":{"$error":"#NAME?"}},null,{"$f":"IF(INDEX(periode5,NEVAL,Nenfant)=\"D\",\"X\",\"\")","v":{"$error":"#NAME?"}},{"$f":"IF(INDEX(periode5,NEVAL,Nenfant)=\"C\",\"X\",\"\")","v":{"$error":"#NAME?"}},{"$f":"IF(INDEX(periode5,NEVAL,Nenfant)=\"B\",\"X\",\"\")","v":{"$error":"#NAME?"}},{"$f":"IF(INDEX(periode5,NEVAL,Nenfant)=\"A\",\"X\",\"\")","v":{"$error":"#NAME?"}},null,{"$f":"IF(INDEX(periode6,NEVAL,Nenfant)=\"D\",\"X\",\"\")","v":{"$error":"#NAME?"}},{"$f":"IF(INDEX(periode6,NEVAL,Nenfant)=\"C\",\"X\",\"\")","v":{"$error":"#NAME?"}},{"$f":"IF(INDEX(periode6,NEVAL,Nenfant)=\"B\",\"X\",\"\")","v":{"$error":"#NAME?"}},{"$f":"IF(INDEX(periode6,NEVAL,Nenfant)=\"A\",\"X\",\"\")","v":{"$error":"#NAME?"}}]
[96,{"$nulls":7},{"$f":"IF(INDEX(periode1,NEVAL,Nenfant)=\"D\",\"X\",\"\")","v":{"$error":"#NAME?"}},{"$f":"IF(INDEX(periode1,NEVAL,Nenfant)=\"C\",\"X\",\"\")","v":{"$error":"#NAME?"}},{"$f":"IF(INDEX(periode1,NEVAL,Nenfant)=\"B\",\"X\",\"\")","v":{"$error":"#NAME?"}},{"$f":"IF(INDEX(periode1,NEVAL,Nenfant)=\"A\",\"X\",\"\")","v":{"$error":"#NAME?"}},null,{"$f":"IF(INDEX(periode2,NEVAL,Nenfant)=\"D\",\"X\",\"\")","v":{"$error":"#NAME?"}},{"$f":"IF(INDEX(periode2,NEVAL,Nenfant)=\"C\",\"X\",\"\")","v":{"$error":"#NAME?"}},{"$f":"IF(INDEX(periode2,NEVAL,Nenfant)=\"B\",\"X\",\"\")","v":{"$error":"#NAME?"}},{"$f":"IF(INDEX(periode2,NEVAL,Nenfant)=\"A\",\"X\",\"\")","v":{"$error":"#NAME?"}},null,{"$f":"IF(INDEX(periode3,NEVAL,Nenfant)=\"D\",\"X\",\"\")","v":{"$error":"#NAME?"}},{"$f":"IF(INDEX(periode3,NEVAL,Nenfant)=\"C\",\"X\",\"\")","v":{"$error":"#NAME?"}},{"$f":"IF(INDEX(periode3,NEVAL,Nenfant)=\"B\",\"X\",\"\")","v":{"$error":"#NAME?"}},{"$f":"IF(INDEX(periode3,NEVAL,Nenfant)=\"A\",\"X\",\"\")","v":{"$error":"#NAME?"}},null,{"$f":"IF(INDEX(periode4,NEVAL,Nenfant)=\"D\",\"X\",\"\")","v":{"$error":"#NAME?"}},{"$f":"IF(INDEX(periode4,NEVAL,Nenfant)=\"C\",\"X\",\"\")","v":{"$error":"#NAME?"}},{"$f":"IF(INDEX(periode4,NEVAL,Nenfant)=\"B\",\"X\",\"\")","v":{"$error":"#NAME?"}},{"$f":"IF(INDEX(periode4,NEVAL,Nenfant)=\"A\",\"X\",\"\")","v":{"$error":"#NAME?"}},null,{"$f":"IF(INDEX(periode5,NEVAL,Nenfant)=\"D\",\"X\",\"\")","v":{"$error":"#NAME?"}},{"$f":"IF(INDEX(periode5,NEVAL,Nenfant)=\"C\",\"X\",\"\")","v":{"$error":"#NAME?"}},{"$f":"IF(INDEX(periode5,NEVAL,Nenfant)=\"B\",\"X\",\"\")","v":{"$error":"#NAME?"}},{"$f":"IF(INDEX(periode5,NEVAL,Nenfant)=\"A\",\"X\",\"\")","v":{"$error":"#NAME?"}},null,{"$f":"IF(INDEX(periode6,NEVAL,Nenfant)=\"D\",\"X\",\"\")","v":{"$error":"#NAME?"}},{"$f":"IF(INDEX(periode6,NEVAL,Nenfant)=\"C\",\"X\",\"\")","v":{"$error":"#NAME?"}},{"$f":"IF(INDEX(periode6,NEVAL,Nenfant)=\"B\",\"X\",\"\")","v":{"$error":"#NAME?"}},{"$f":"IF(INDEX(periode6,NEVAL,Nenfant)=\"A\",\"X\",\"\")","v":{"$error":"#NAME?"}}]
[97,{"$nulls":7},{"$f":"IF(INDEX(periode1,NEVAL,Nenfant)=\"D\",\"X\",\"\")","v":{"$error":"#NAME?"}},{"$f":"IF(INDEX(periode1,NEVAL,Nenfant)=\"C\",\"X\",\"\")","v":{"$error":"#NAME?"}},{"$f":"IF(INDEX(periode1,NEVAL,Nenfant)=\"B\",\"X\",\"\")","v":{"$error":"#NAME?"}},{"$f":"IF(INDEX(periode1,NEVAL,Nenfant)=\"A\",\"X\",\"\")","v":{"$error":"#NAME?"}},null,{"$f":"IF(INDEX(periode2,NEVAL,Nenfant)=\"D\",\"X\",\"\")","v":{"$error":"#NAME?"}},{"$f":"IF(INDEX(periode2,NEVAL,Nenfant)=\"C\",\"X\",\"\")","v":{"$error":"#NAME?"}},{"$f":"IF(INDEX(periode2,NEVAL,Nenfant)=\"B\",\"X\",\"\")","v":{"$error":"#NAME?"}},{"$f":"IF(INDEX(periode2,NEVAL,Nenfant)=\"A\",\"X\",\"\")","v":{"$error":"#NAME?"}},null,{"$f":"IF(INDEX(periode3,NEVAL,Nenfant)=\"D\",\"X\",\"\")","v":{"$error":"#NAME?"}},{"$f":"IF(INDEX(periode3,NEVAL,Nenfant)=\"C\",\"X\",\"\")","v":{"$error":"#NAME?"}},{"$f":"IF(INDEX(periode3,NEVAL,Nenfant)=\"B\",\"X\",\"\")","v":{"$error":"#NAME?"}},{"$f":"IF(INDEX(periode3,NEVAL,Nenfant)=\"A\",\"X\",\"\")","v":{"$error":"#NAME?"}},null,{"$f":"IF(INDEX(periode4,NEVAL,Nenfant)=\"D\",\"X\",\"\")","v":{"$error":"#NAME?"}},{"$f":"IF(INDEX(periode4,NEVAL,Nenfant)=\"C\",\"X\",\"\")","v":{"$error":"#NAME?"}},{"$f":"IF(INDEX(periode4,NEVAL,Nenfant)=\"B\",\"X\",\"\")","v":{"$error":"#NAME?"}},{"$f":"IF(INDEX(periode4,NEVAL,Nenfant)=\"A\",\"X\",\"\")","v":{"$error":"#NAME?"}},null,{"$f":"IF(INDEX(periode5,NEVAL,Nenfant)=\"D\",\"X\",\"\")","v":{"$error":"#NAME?"}},{"$f":"IF(INDEX(periode5,NEVAL,Nenfant)=\"C\",\"X\",\"\")","v":{"$error":"#NAME?"}},{"$f":"IF(INDEX(periode5,NEVAL,Nenfant)=\"B\",\"X\",\"\")","v":{"$error":"#NAME?"}},{"$f":"IF(INDEX(periode5,NEVAL,Nenfant)=\"A\",\"X\",\"\")","v":{"$error":"#NAME?"}},null,{"$f":"IF(INDEX(periode6,NEVAL,Nenfant)=\"D\",\"X\",\"\")","v":{"$error":"#NAME?"}},{"$f":"IF(INDEX(periode6,NEVAL,Nenfant)=\"C\",\"X\",\"\")","v":{"$error":"#NAME?"}},{"$f":"IF(INDEX(periode6,NEVAL,Nenfant)=\"B\",\"X\",\"\")","v":{"$error":"#NAME?"}},{"$f":"IF(INDEX(periode6,NEVAL,Nenfant)=\"A\",\"X\",\"\")","v":{"$error":"#NAME?"}}]
[98,{"$nulls":7},{"$f":"IF(INDEX(periode1,NEVAL,Nenfant)=\"D\",\"X\",\"\")","v":{"$error":"#NAME?"}},{"$f":"IF(INDEX(periode1,NEVAL,Nenfant)=\"C\",\"X\",\"\")","v":{"$error":"#NAME?"}},{"$f":"IF(INDEX(periode1,NEVAL,Nenfant)=\"B\",\"X\",\"\")","v":{"$error":"#NAME?"}},{"$f":"IF(INDEX(periode1,NEVAL,Nenfant)=\"A\",\"X\",\"\")","v":{"$error":"#NAME?"}},null,{"$f":"IF(INDEX(periode2,NEVAL,Nenfant)=\"D\",\"X\",\"\")","v":{"$error":"#NAME?"}},{"$f":"IF(INDEX(periode2,NEVAL,Nenfant)=\"C\",\"X\",\"\")","v":{"$error":"#NAME?"}},{"$f":"IF(INDEX(periode2,NEVAL,Nenfant)=\"B\",\"X\",\"\")","v":{"$error":"#NAME?"}},{"$f":"IF(INDEX(periode2,NEVAL,Nenfant)=\"A\",\"X\",\"\")","v":{"$error":"#NAME?"}},null,{"$f":"IF(INDEX(periode3,NEVAL,Nenfant)=\"D\",\"X\",\"\")","v":{"$error":"#NAME?"}},{"$f":"IF(INDEX(periode3,NEVAL,Nenfant)=\"C\",\"X\",\"\")","v":{"$error":"#NAME?"}},{"$f":"IF(INDEX(periode3,NEVAL,Nenfant)=\"B\",\"X\",\"\")","v":{"$error":"#NAME?"}},{"$f":"IF(INDEX(periode3,NEVAL,Nenfant)=\"A\",\"X\",\"\")","v":{"$error":"#NAME?"}},null,{"$f":"IF(INDEX(periode4,NEVAL,Nenfant)=\"D\",\"X\",\"\")","v":{"$error":"#NAME?"}},{"$f":"IF(INDEX(periode4,NEVAL,Nenfant)=\"C\",\"X\",\"\")","v":{"$error":"#NAME?"}},{"$f":"IF(INDEX(periode4,NEVAL,Nenfant)=\"B\",\"X\",\"\")","v":{"$error":"#NAME?"}},{"$f":"IF(INDEX(periode4,NEVAL,Nenfant)=\"A\",\"X\",\"\")","v":{"$error":"#NAME?"}},null,{"$f":"IF(INDEX(periode5,NEVAL,Nenfant)=\"D\",\"X\",\"\")","v":{"$error":"#NAME?"}},{"$f":"IF(INDEX(periode5,NEVAL,Nenfant)=\"C\",\"X\",\"\")","v":{"$error":"#NAME?"}},{"$f":"IF(INDEX(periode5,NEVAL,Nenfant)=\"B\",\"X\",\"\")","v":{"$error":"#NAME?"}},{"$f":"IF(INDEX(periode5,NEVAL,Nenfant)=\"A\",\"X\",\"\")","v":{"$error":"#NAME?"}},null,{"$f":"IF(INDEX(periode6,NEVAL,Nenfant)=\"D\",\"X\",\"\")","v":{"$error":"#NAME?"}},{"$f":"IF(INDEX(periode6,NEVAL,Nenfant)=\"C\",\"X\",\"\")","v":{"$error":"#NAME?"}},{"$f":"IF(INDEX(periode6,NEVAL,Nenfant)=\"B\",\"X\",\"\")","v":{"$error":"#NAME?"}},{"$f":"IF(INDEX(periode6,NEVAL,Nenfant)=\"A\",\"X\",\"\")","v":{"$error":"#NAME?"}}]
[99,{"$nulls":7},{"$f":"COUNTIF($G100:$G102,\"X\")","v":0},{"$f":"COUNTIF($H100:$H102,\"X\")","v":0},{"$f":"COUNTIF($I100:$I102,\"X\")","v":0},{"$f":"COUNTIF($J100:$J102,\"X\")","v":0},null,{"$f":"COUNTIF($G100:$G102,\"X\")","v":0},{"$f":"COUNTIF($H100:$H102,\"X\")","v":0},{"$f":"COUNTIF($I100:$I102,\"X\")","v":0},{"$f":"COUNTIF($J100:$J102,\"X\")","v":0},null,{"$f":"COUNTIF($G100:$G102,\"X\")","v":0},{"$f":"COUNTIF($H100:$H102,\"X\")","v":0},{"$f":"COUNTIF($I100:$I102,\"X\")","v":0},{"$f":"COUNTIF($J100:$J102,\"X\")","v":0},null,{"$f":"COUNTIF($G100:$G102,\"X\")","v":0},{"$f":"COUNTIF($H100:$H102,\"X\")","v":0},{"$f":"COUNTIF($I100:$I102,\"X\")","v":0},{"$f":"COUNTIF(AA100:AA102,\"X\")","v":0},null,{"$f":"COUNTIF($G100:$G102,\"X\")","v":0},{"$f":"COUNTIF($H100:$H102,\"X\")","v":0},{"$f":"COUNTIF($I100:$I102,\"X\")","v":0},{"$f":"COUNTIF($J100:$J102,\"X\")","v":0},null,{"$f":"COUNTIF($G100:$G102,\"X\")","v":0},{"$f":"COUNTIF($H100:$H102,\"X\")","v":0},{"$f":"COUNTIF($I100:$I102,\"X\")","v":0},{"$f":"COUNTIF($J100:$J102,\"X\")","v":0}]
[100,{"$nulls":7},{"$f":"IF(INDEX(periode1,NEVAL,Nenfant)=\"D\",\"X\",\"\")","v":{"$error":"#NAME?"}},{"$f":"IF(INDEX(periode1,NEVAL,Nenfant)=\"C\",\"X\",\"\")","v":{"$error":"#NAME?"}},{"$f":"IF(INDEX(periode1,NEVAL,Nenfant)=\"B\",\"X\",\"\")","v":{"$error":"#NAME?"}},{"$f":"IF(INDEX(periode1,NEVAL,Nenfant)=\"A\",\"X\",\"\")","v":{"$error":"#NAME?"}},null,{"$f":"IF(INDEX(periode2,NEVAL,Nenfant)=\"D\",\"X\",\"\")","v":{"$error":"#NAME?"}},{"$f":"IF(INDEX(periode2,NEVAL,Nenfant)=\"C\",\"X\",\"\")","v":{"$error":"#NAME?"}},{"$f":"IF(INDEX(periode2,NEVAL,Nenfant)=\"B\",\"X\",\"\")","v":{"$error":"#NAME?"}},{"$f":"IF(INDEX(periode2,NEVAL,Nenfant)=\"A\",\"X\",\"\")","v":{"$error":"#NAME?"}},null,{"$f":"IF(INDEX(periode3,NEVAL,Nenfant)=\"D\",\"X\",\"\")","v":{"$error":"#NAME?"}},{"$f":"IF(INDEX(periode3,NEVAL,Nenfant)=\"C\",\"X\",\"\")","v":{"$error":"#NAME?"}},{"$f":"IF(INDEX(periode3,NEVAL,Nenfant)=\"B\",\"X\",\"\")","v":{"$error":"#NAME?"}},{"$f":"IF(INDEX(periode3,NEVAL,Nenfant)=\"A\",\"X\",\"\")","v":{"$error":"#NAME?"}},null,{"$f":"IF(INDEX(periode4,NEVAL,Nenfant)=\"D\",\"X\",\"\")","v":{"$error":"#NAME?"}},{"$f":"IF(INDEX(periode4,NEVAL,Nenfant)=\"C\",\"X\",\"\")","v":{"$error":"#NAME?"}},{"$f":"IF(INDEX(periode4,NEVAL,Nenfant)=\"B\",\"X\",\"\")","v":{"$error":"#NAME?"}},{"$f":"IF(INDEX(periode4,NEVAL,Nenfant)=\"A\",\"X\",\"\")","v":{"$error":"#NAME?"}},null,{"$f":"IF(INDEX(periode5,NEVAL,Nenfant)=\"D\",\"X\",\"\")","v":{"$error":"#NAME?"}},{"$f":"IF(INDEX(periode5,NEVAL,Nenfant)=\"C\",\"X\",\"\")","v":{"$error":"#NAME?"}},{"$f":"IF(INDEX(periode5,NEVAL,Nenfant)=\"B\",\"X\",\"\")","v":{"$error":"#NAME?"}},{"$f":"IF(INDEX(periode5,NEVAL,Nenfant)=\"A\",\"X\",\"\")","v":{"$error":"#NAME?"}},null,{"$f":"IF(INDEX(periode6,NEVAL,Nenfant)=\"D\",\"X\",\"\")","v":{"$error":"#NAME?"}},{"$f":"IF(INDEX(periode6,NEVAL,Nenfant)=\"C\",\"X\",\"\")","v":{"$error":"#NAME?"}},{"$f":"IF(INDEX(periode6,NEVAL,Nenfant)=\"B\",\"X\",\"\")","v":{"$error":"#NAME?"}},{"$f":"IF(INDEX(periode6,NEVAL,Nenfant)=\"A\",\"X\",\"\")","v":{"$error":"#NAME?"}}]
[101,{"$nulls":7},{"$f":"IF(INDEX(periode1,NEVAL,Nenfant)=\"D\",\"X\",\"\")","v":{"$error":"#NAME?"}},{"$f":"IF(INDEX(periode1,NEVAL,Nenfant)=\"C\",\"X\",\"\")","v":{"$error":"#NAME?"}},{"$f":"IF(INDEX(periode1,NEVAL,Nenfant)=\"B\",\"X\",\"\")","v":{"$error":"#NAME?"}},{"$f":"IF(INDEX(periode1,NEVAL,Nenfant)=\"A\",\"X\",\"\")","v":{"$error":"#NAME?"}},null,{"$f":"IF(INDEX(periode2,NEVAL,Nenfant)=\"D\",\"X\",\"\")","v":{"$error":"#NAME?"}},{"$f":"IF(INDEX(periode2,NEVAL,Nenfant)=\"C\",\"X\",\"\")","v":{"$error":"#NAME?"}},{"$f":"IF(INDEX(periode2,NEVAL,Nenfant)=\"B\",\"X\",\"\")","v":{"$error":"#NAME?"}},{"$f":"IF(INDEX(periode2,NEVAL,Nenfant)=\"A\",\"X\",\"\")","v":{"$error":"#NAME?"}},null,{"$f":"IF(INDEX(periode3,NEVAL,Nenfant)=\"D\",\"X\",\"\")","v":{"$error":"#NAME?"}},{"$f":"IF(INDEX(periode3,NEVAL,Nenfant)=\"C\",\"X\",\"\")","v":{"$error":"#NAME?"}},{"$f":"IF(INDEX(periode3,NEVAL,Nenfant)=\"B\",\"X\",\"\")","v":{"$error":"#NAME?"}},{"$f":"IF(INDEX(periode3,NEVAL,Nenfant)=\"A\",\"X\",\"\")","v":{"$error":"#NAME?"}},null,{"$f":"IF(INDEX(periode4,NEVAL,Nenfant)=\"D\",\"X\",\"\")","v":{"$error":"#NAME?"}},{"$f":"IF(INDEX(periode4,NEVAL,Nenfant)=\"C\",\"X\",\"\")","v":{"$error":"#NAME?"}},{"$f":"IF(INDEX(periode4,NEVAL,Nenfant)=\"B\",\"X\",\"\")","v":{"$error":"#NAME?"}},{"$f":"IF(INDEX(periode4,NEVAL,Nenfant)=\"A\",\"X\",\"\")","v":{"$error":"#NAME?"}},null,{"$f":"IF(INDEX(periode5,NEVAL,Nenfant)=\"D\",\"X\",\"\")","v":{"$error":"#NAME?"}},{"$f":"IF(INDEX(periode5,NEVAL,Nenfant)=\"C\",\"X\",\"\")","v":{"$error":"#NAME?"}},{"$f":"IF(INDEX(periode5,NEVAL,Nenfant)=\"B\",\"X\",\"\")","v":{"$error":"#NAME?"}},{"$f":"IF(INDEX(periode5,NEVAL,Nenfant)=\"A\",\"X\",\"\")","v":{"$error":"#NAME?"}},null,{"$f":"IF(INDEX(periode6,NEVAL,Nenfant)=\"D\",\"X\",\"\")","v":{"$error":"#NAME?"}},{"$f":"IF(INDEX(periode6,NEVAL,Nenfant)=\"C\",\"X\",\"\")","v":{"$error":"#NAME?"}},{"$f":"IF(INDEX(periode6,NEVAL,Nenfant)=\"B\",\"X\",\"\")","v":{"$error":"#NAME?"}},{"$f":"IF(INDEX(periode6,NEVAL,Nenfant)=\"A\",\"X\",\"\")","v":{"$error":"#NAME?"}}]
[102,{"$nulls":7},{"$f":"IF(INDEX(periode1,NEVAL,Nenfant)=\"D\",\"X\",\"\")","v":{"$error":"#NAME?"}},{"$f":"IF(INDEX(periode1,NEVAL,Nenfant)=\"C\",\"X\",\"\")","v":{"$error":"#NAME?"}},{"$f":"IF(INDEX(periode1,NEVAL,Nenfant)=\"B\",\"X\",\"\")","v":{"$error":"#NAME?"}},{"$f":"IF(INDEX(periode1,NEVAL,Nenfant)=\"A\",\"X\",\"\")","v":{"$error":"#NAME?"}},null,{"$f":"IF(INDEX(periode2,NEVAL,Nenfant)=\"D\",\"X\",\"\")","v":{"$error":"#NAME?"}},{"$f":"IF(INDEX(periode2,NEVAL,Nenfant)=\"C\",\"X\",\"\")","v":{"$error":"#NAME?"}},{"$f":"IF(INDEX(periode2,NEVAL,Nenfant)=\"B\",\"X\",\"\")","v":{"$error":"#NAME?"}},{"$f":"IF(INDEX(periode2,NEVAL,Nenfant)=\"A\",\"X\",\"\")","v":{"$error":"#NAME?"}},null,{"$f":"IF(INDEX(periode3,NEVAL,Nenfant)=\"D\",\"X\",\"\")","v":{"$error":"#NAME?"}},{"$f":"IF(INDEX(periode3,NEVAL,Nenfant)=\"C\",\"X\",\"\")","v":{"$error":"#NAME?"}},{"$f":"IF(INDEX(periode3,NEVAL,Nenfant)=\"B\",\"X\",\"\")","v":{"$error":"#NAME?"}},{"$f":"IF(INDEX(periode3,NEVAL,Nenfant)=\"A\",\"X\",\"\")","v":{"$error":"#NAME?"}},null,{"$f":"IF(INDEX(periode4,NEVAL,Nenfant)=\"D\",\"X\",\"\")","v":{"$error":"#NAME?"}},{"$f":"IF(INDEX(periode4,NEVAL,Nenfant)=\"C\",\"X\",\"\")","v":{"$error":"#NAME?"}},{"$f":"IF(INDEX(periode4,NEVAL,Nenfant)=\"B\",\"X\",\"\")","v":{"$error":"#NAME?"}},{"$f":"IF(INDEX(periode4,NEVAL,Nenfant)=\"A\",\"X\",\"\")","v":{"$error":"#NAME?"}},null,{"$f":"IF(INDEX(periode5,NEVAL,Nenfant)=\"D\",\"X\",\"\")","v":{"$error":"#NAME?"}},{"$f":"IF(INDEX(periode5,NEVAL,Nenfant)=\"C\",\"X\",\"\")","v":{"$error":"#NAME?"}},{"$f":"IF(INDEX(periode5,NEVAL,Nenfant)=\"B\",\"X\",\"\")","v":{"$error":"#NAME?"}},{"$f":"IF(INDEX(periode5,NEVAL,Nenfant)=\"A\",\"X\",\"\")","v":{"$error":"#NAME?"}},null,{"$f":"IF(INDEX(periode6,NEVAL,Nenfant)=\"D\",\"X\",\"\")","v":{"$error":"#NAME?"}},{"$f":"IF(INDEX(periode6,NEVAL,Nenfant)=\"C\",\"X\",\"\")","v":{"$error":"#NAME?"}},{"$f":"IF(INDEX(periode6,NEVAL,Nenfant)=\"B\",\"X\",\"\")","v":{"$error":"#NAME?"}},{"$f":"IF(INDEX(periode6,NEVAL,Nenfant)=\"A\",\"X\",\"\")","v":{"$error":"#NAME?"}}]
[103,{"$nulls":7},{"$f":"COUNTIF($G104:$G106,\"X\")","v":0},{"$f":"COUNTIF($H104:$H106,\"X\")","v":0},{"$f":"COUNTIF($I104:$I106,\"X\")","v":0},{"$f":"COUNTIF($J104:$J106,\"X\")","v":0},null,{"$f":"COUNTIF($G104:$G106,\"X\")","v":0},{"$f":"COUNTIF($H104:$H106,\"X\")","v":0},{"$f":"COUNTIF($I104:$I106,\"X\")","v":0},{"$f":"COUNTIF($J104:$J106,\"X\")","v":0},null,{"$f":"COUNTIF($G104:$G106,\"X\")","v":0},{"$f":"COUNTIF($H104:$H106,\"X\")","v":0},{"$f":"COUNTIF($I104:$I106,\"X\")","v":0},{"$f":"COUNTIF($J104:$J106,\"X\")","v":0},null,{"$f":"COUNTIF($G104:$G106,\"X\")","v":0},{"$f":"COUNTIF($H104:$H106,\"X\")","v":0},{"$f":"COUNTIF($I104:$I106,\"X\")","v":0},{"$f":"COUNTIF(AA104:AA106,\"X\")","v":0},null,{"$f":"COUNTIF($G104:$G106,\"X\")","v":0},{"$f":"COUNTIF($H104:$H106,\"X\")","v":0},{"$f":"COUNTIF($I104:$I106,\"X\")","v":0},{"$f":"COUNTIF($J104:$J106,\"X\")","v":0},null,{"$f":"COUNTIF($G104:$G106,\"X\")","v":0},{"$f":"COUNTIF($H104:$H106,\"X\")","v":0},{"$f":"COUNTIF($I104:$I106,\"X\")","v":0},{"$f":"COUNTIF($J104:$J106,\"X\")","v":0}]
[104,{"$nulls":7},{"$f":"IF(INDEX(periode1,NEVAL,Nenfant)=\"D\",\"X\",\"\")","v":{"$error":"#NAME?"}},{"$f":"IF(INDEX(periode1,NEVAL,Nenfant)=\"C\",\"X\",\"\")","v":{"$error":"#NAME?"}},{"$f":"IF(INDEX(periode1,NEVAL,Nenfant)=\"B\",\"X\",\"\")","v":{"$error":"#NAME?"}},{"$f":"IF(INDEX(periode1,NEVAL,Nenfant)=\"A\",\"X\",\"\")","v":{"$error":"#NAME?"}},null,{"$f":"IF(INDEX(periode2,NEVAL,Nenfant)=\"D\",\"X\",\"\")","v":{"$error":"#NAME?"}},{"$f":"IF(INDEX(periode2,NEVAL,Nenfant)=\"C\",\"X\",\"\")","v":{"$error":"#NAME?"}},{"$f":"IF(INDEX(periode2,NEVAL,Nenfant)=\"B\",\"X\",\"\")","v":{"$error":"#NAME?"}},{"$f":"IF(INDEX(periode2,NEVAL,Nenfant)=\"A\",\"X\",\"\")","v":{"$error":"#NAME?"}},null,{"$f":"IF(INDEX(periode3,NEVAL,Nenfant)=\"D\",\"X\",\"\")","v":{"$error":"#NAME?"}},{"$f":"IF(INDEX(periode3,NEVAL,Nenfant)=\"C\",\"X\",\"\")","v":{"$error":"#NAME?"}},{"$f":"IF(INDEX(periode3,NEVAL,Nenfant)=\"B\",\"X\",\"\")","v":{"$error":"#NAME?"}},{"$f":"IF(INDEX(periode3,NEVAL,Nenfant)=\"A\",\"X\",\"\")","v":{"$error":"#NAME?"}},null,{"$f":"IF(INDEX(periode4,NEVAL,Nenfant)=\"D\",\"X\",\"\")","v":{"$error":"#NAME?"}},{"$f":"IF(INDEX(periode4,NEVAL,Nenfant)=\"C\",\"X\",\"\")","v":{"$error":"#NAME?"}},{"$f":"IF(INDEX(periode4,NEVAL,Nenfant)=\"B\",\"X\",\"\")","v":{"$error":"#NAME?"}},{"$f":"IF(INDEX(periode4,NEVAL,Nenfant)=\"A\",\"X\",\"\")","v":{"$error":"#NAME?"}},null,{"$f":"IF(INDEX(periode5,NEVAL,Nenfant)=\"D\",\"X\",\"\")","v":{"$error":"#NAME?"}},{"$f":"IF(INDEX(periode5,NEVAL,Nenfant)=\"C\",\"X\",\"\")","v":{"$error":"#NAME?"}},{"$f":"IF(INDEX(periode5,NEVAL,Nenfant)=\"B\",\"X\",\"\")","v":{"$error":"#NAME?"}},{"$f":"IF(INDEX(periode5,NEVAL,Nenfant)=\"A\",\"X\",\"\")","v":{"$error":"#NAME?"}},null,{"$f":"IF(INDEX(periode6,NEVAL,Nenfant)=\"D\",\"X\",\"\")","v":{"$error":"#NAME?"}},{"$f":"IF(INDEX(periode6,NEVAL,Nenfant)=\"C\",\"X\",\"\")","v":{"$error":"#NAME?"}},{"$f":"IF(INDEX(periode6,NEVAL,Nenfant)=\"B\",\"X\",\"\")","v":{"$error":"#NAME?"}},{"$f":"IF(INDEX(periode6,NEVAL,Nenfant)=\"A\",\"X\",\"\")","v":{"$error":"#NAME?"}}]
[105,{"$nulls":7},{"$f":"IF(INDEX(periode1,NEVAL,Nenfant)=\"D\",\"X\",\"\")","v":{"$error":"#NAME?"}},{"$f":"IF(INDEX(periode1,NEVAL,Nenfant)=\"C\",\"X\",\"\")","v":{"$error":"#NAME?"}},{"$f":"IF(INDEX(periode1,NEVAL,Nenfant)=\"B\",\"X\",\"\")","v":{"$error":"#NAME?"}},{"$f":"IF(INDEX(periode1,NEVAL,Nenfant)=\"A\",\"X\",\"\")","v":{"$error":"#NAME?"}},null,{"$f":"IF(INDEX(periode2,NEVAL,Nenfant)=\"D\",\"X\",\"\")","v":{"$error":"#NAME?"}},{"$f":"IF(INDEX(periode2,NEVAL,Nenfant)=\"C\",\"X\",\"\")","v":{"$error":"#NAME?"}},{"$f":"IF(INDEX(periode2,NEVAL,Nenfant)=\"B\",\"X\",\"\")","v":{"$error":"#NAME?"}},{"$f":"IF(INDEX(periode2,NEVAL,Nenfant)=\"A\",\"X\",\"\")","v":{"$error":"#NAME?"}},null,{"$f":"IF(INDEX(periode3,NEVAL,Nenfant)=\"D\",\"X\",\"\")","v":{"$error":"#NAME?"}},{"$f":"IF(INDEX(periode3,NEVAL,Nenfant)=\"C\",\"X\",\"\")","v":{"$error":"#NAME?"}},{"$f":"IF(INDEX(periode3,NEVAL,Nenfant)=\"B\",\"X\",\"\")","v":{"$error":"#NAME?"}},{"$f":"IF(INDEX(periode3,NEVAL,Nenfant)=\"A\",\"X\",\"\")","v":{"$error":"#NAME?"}},null,{"$f":"IF(INDEX(periode4,NEVAL,Nenfant)=\"D\",\"X\",\"\")","v":{"$error":"#NAME?"}},{"$f":"IF(INDEX(periode4,NEVAL,Nenfant)=\"C\",\"X\",\"\")","v":{"$error":"#NAME?"}},{"$f":"IF(INDEX(periode4,NEVAL,Nenfant)=\"B\",\"X\",\"\")","v":{"$error":"#NAME?"}},{"$f":"IF(INDEX(periode4,NEVAL,Nenfant)=\"A\",\"X\",\"\")","v":{"$error":"#NAME?"}},null,{"$f":"IF(INDEX(periode5,NEVAL,Nenfant)=\"D\",\"X\",\"\")","v":{"$error":"#NAME?"}},{"$f":"IF(INDEX(periode5,NEVAL,Nenfant)=\"C\",\"X\",\"\")","v":{"$error":"#NAME?"}},{"$f":"IF(INDEX(periode5,NEVAL,Nenfant)=\"B\",\"X\",\"\")","v":{"$error":"#NAME?"}},{"$f":"IF(INDEX(periode5,NEVAL,Nenfant)=\"A\",\"X\",\"\")","v":{"$error":"#NAME?"}},null,{"$f":"IF(INDEX(periode6,NEVAL,Nenfant)=\"D\",\"X\",\"\")","v":{"$error":"#NAME?"}},{"$f":"IF(INDEX(periode6,NEVAL,Nenfant)=\"C\",\"X\",\"\")","v":{"$error":"#NAME?"}},{"$f":"IF(INDEX(periode6,NEVAL,Nenfant)=\"B\",\"X\",\"\")","v":{"$error":"#NAME?"}},{"$f":"IF(INDEX(periode6,NEVAL,Nenfant)=\"A\",\"X\",\"\")","v":{"$error":"#NAME?"}}]
[106,{"$nulls":7},{"$f":"IF(INDEX(periode1,NEVAL,Nenfant)=\"D\",\"X\",\"\")","v":{"$error":"#NAME?"}},{"$f":"IF(INDEX(periode1,NEVAL,Nenfant)=\"C\",\"X\",\"\")","v":{"$error":"#NAME?"}},{"$f":"IF(INDEX(periode1,NEVAL,Nenfant)=\"B\",\"X\",\"\")","v":{"$error":"#NAME?"}},{"$f":"IF(INDEX(periode1,NEVAL,Nenfant)=\"A\",\"X\",\"\")","v":{"$error":"#NAME?"}},null,{"$f":"IF(INDEX(periode2,NEVAL,Nenfant)=\"D\",\"X\",\"\")","v":{"$error":"#NAME?"}},{"$f":"IF(INDEX(periode2,NEVAL,Nenfant)=\"C\",\"X\",\"\")","v":{"$error":"#NAME?"}},{"$f":"IF(INDEX(periode2,NEVAL,Nenfant)=\"B\",\"X\",\"\")","v":{"$error":"#NAME?"}},{"$f":"IF(INDEX(periode2,NEVAL,Nenfant)=\"A\",\"X\",\"\")","v":{"$error":"#NAME?"}},null,{"$f":"IF(INDEX(periode3,NEVAL,Nenfant)=\"D\",\"X\",\"\")","v":{"$error":"#NAME?"}},{"$f":"IF(INDEX(periode3,NEVAL,Nenfant)=\"C\",\"X\",\"\")","v":{"$error":"#NAME?"}},{"$f":"IF(INDEX(periode3,NEVAL,Nenfant)=\"B\",\"X\",\"\")","v":{"$error":"#NAME?"}},{"$f":"IF(INDEX(periode3,NEVAL,Nenfant)=\"A\",\"X\",\"\")","v":{"$error":"#NAME?"}},null,{"$f":"IF(INDEX(periode4,NEVAL,Nenfant)=\"D\",\"X\",\"\")","v":{"$error":"#NAME?"}},{"$f":"IF(INDEX(periode4,NEVAL,Nenfant)=\"C\",\"X\",\"\")","v":{"$error":"#NAME?"}},{"$f":"IF(INDEX(periode4,NEVAL,Nenfant)=\"B\",\"X\",\"\")","v":{"$error":"#NAME?"}},{"$f":"IF(INDEX(periode4,NEVAL,Nenfant)=\"A\",\"X\",\"\")","v":{"$error":"#NAME?"}},null,{"$f":"IF(INDEX(periode5,NEVAL,Nenfant)=\"D\",\"X\",\"\")","v":{"$error":"#NAME?"}},{"$f":"IF(INDEX(periode5,NEVAL,Nenfant)=\"C\",\"X\",\"\")","v":{"$error":"#NAME?"}},{"$f":"IF(INDEX(periode5,NEVAL,Nenfant)=\"B\",\"X\",\"\")","v":{"$error":"#NAME?"}},{"$f":"IF(INDEX(periode5,NEVAL,Nenfant)=\"A\",\"X\",\"\")","v":{"$error":"#NAME?"}},null,{"$f":"IF(INDEX(periode6,NEVAL,Nenfant)=\"D\",\"X\",\"\")","v":{"$error":"#NAME?"}},{"$f":"IF(INDEX(periode6,NEVAL,Nenfant)=\"C\",\"X\",\"\")","v":{"$error":"#NAME?"}},{"$f":"IF(INDEX(periode6,NEVAL,Nenfant)=\"B\",\"X\",\"\")","v":{"$error":"#NAME?"}},{"$f":"IF(INDEX(periode6,NEVAL,Nenfant)=\"A\",\"X\",\"\")","v":{"$error":"#NAME?"}}]
[107,{"$nulls":7},{"$f":"COUNTIF($G108:$G111,\"X\")","v":0},{"$f":"COUNTIF($H108:$H111,\"X\")","v":0},{"$f":"COUNTIF($I108:$I111,\"X\")","v":0},{"$f":"COUNTIF($J108:$J111,\"X\")","v":0},null,{"$f":"COUNTIF($G108:$G111,\"X\")","v":0},{"$f":"COUNTIF($H108:$H111,\"X\")","v":0},{"$f":"COUNTIF($I108:$I111,\"X\")","v":0},{"$f":"COUNTIF($J108:$J111,\"X\")","v":0},null,{"$f":"COUNTIF($G108:$G111,\"X\")","v":0},{"$f":"COUNTIF($H108:$H111,\"X\")","v":0},{"$f":"COUNTIF($I108:$I111,\"X\")","v":0},{"$f":"COUNTIF($J108:$J111,\"X\")","v":0},null,{"$f":"COUNTIF($G108:$G111,\"X\")","v":0},{"$f":"COUNTIF($H108:$H111,\"X\")","v":0},{"$f":"COUNTIF($I108:$I111,\"X\")","v":0},{"$f":"COUNTIF(AA108:AA111,\"X\")","v":0},null,{"$f":"COUNTIF($G108:$G111,\"X\")","v":0},{"$f":"COUNTIF($H108:$H111,\"X\")","v":0},{"$f":"COUNTIF($I108:$I111,\"X\")","v":0},{"$f":"COUNTIF($J108:$J111,\"X\")","v":0},null,{"$f":"COUNTIF($G108:$G111,\"X\")","v":0},{"$f":"COUNTIF($H108:$H111,\"X\")","v":0},{"$f":"COUNTIF($I108:$I111,\"X\")","v":0},{"$f":"COUNTIF($J108:$J111,\"X\")","v":0}]
[108,{"$nulls":7},{"$f":"IF(INDEX(periode1,NEVAL,Nenfant)=\"D\",\"X\",\"\")","v":{"$error":"#NAME?"}},{"$f":"IF(INDEX(periode1,NEVAL,Nenfant)=\"C\",\"X\",\"\")","v":{"$error":"#NAME?"}},{"$f":"IF(INDEX(periode1,NEVAL,Nenfant)=\"B\",\"X\",\"\")","v":{"$error":"#NAME?"}},{"$f":"IF(INDEX(periode1,NEVAL,Nenfant)=\"A\",\"X\",\"\")","v":{"$error":"#NAME?"}},null,{"$f":"IF(INDEX(periode2,NEVAL,Nenfant)=\"D\",\"X\",\"\")","v":{"$error":"#NAME?"}},{"$f":"IF(INDEX(periode2,NEVAL,Nenfant)=\"C\",\"X\",\"\")","v":{"$error":"#NAME?"}},{"$f":"IF(INDEX(periode2,NEVAL,Nenfant)=\"B\",\"X\",\"\")","v":{"$error":"#NAME?"}},{"$f":"IF(INDEX(periode2,NEVAL,Nenfant)=\"A\",\"X\",\"\")","v":{"$error":"#NAME?"}},null,{"$f":"IF(INDEX(periode3,NEVAL,Nenfant)=\"D\",\"X\",\"\")","v":{"$error":"#NAME?"}},{"$f":"IF(INDEX(periode3,NEVAL,Nenfant)=\"C\",\"X\",\"\")","v":{"$error":"#NAME?"}},{"$f":"IF(INDEX(periode3,NEVAL,Nenfant)=\"B\",\"X\",\"\")","v":{"$error":"#NAME?"}},{"$f":"IF(INDEX(periode3,NEVAL,Nenfant)=\"A\",\"X\",\"\")","v":{"$error":"#NAME?"}},null,{"$f":"IF(INDEX(periode4,NEVAL,Nenfant)=\"D\",\"X\",\"\")","v":{"$error":"#NAME?"}},{"$f":"IF(INDEX(periode4,NEVAL,Nenfant)=\"C\",\"X\",\"\")","v":{"$error":"#NAME?"}},{"$f":"IF(INDEX(periode4,NEVAL,Nenfant)=\"B\",\"X\",\"\")","v":{"$error":"#NAME?"}},{"$f":"IF(INDEX(periode4,NEVAL,Nenfant)=\"A\",\"X\",\"\")","v":{"$error":"#NAME?"}},null,{"$f":"IF(INDEX(periode5,NEVAL,Nenfant)=\"D\",\"X\",\"\")","v":{"$error":"#NAME?"}},{"$f":"IF(INDEX(periode5,NEVAL,Nenfant)=\"C\",\"X\",\"\")","v":{"$error":"#NAME?"}},{"$f":"IF(INDEX(periode5,NEVAL,Nenfant)=\"B\",\"X\",\"\")","v":{"$error":"#NAME?"}},{"$f":"IF(INDEX(periode5,NEVAL,Nenfant)=\"A\",\"X\",\"\")","v":{"$error":"#NAME?"}},null,{"$f":"IF(INDEX(periode6,NEVAL,Nenfant)=\"D\",\"X\",\"\")","v":{"$error":"#NAME?"}},{"$f":"IF(INDEX(periode6,NEVAL,Nenfant)=\"C\",\"X\",\"\")","v":{"$error":"#NAME?"}},{"$f":"IF(INDEX(periode6,NEVAL,Nenfant)=\"B\",\"X\",\"\")","v":{"$error":"#NAME?"}},{"$f":"IF(INDEX(periode6,NEVAL,Nenfant)=\"A\",\"X\",\"\")","v":{"$error":"#NAME?"}}]
[109,{"$nulls":7},{"$f":"IF(INDEX(periode1,NEVAL,Nenfant)=\"D\",\"X\",\"\")","v":{"$error":"#NAME?"}},{"$f":"IF(INDEX(periode1,NEVAL,Nenfant)=\"C\",\"X\",\"\")","v":{"$error":"#NAME?"}},{"$f":"IF(INDEX(periode1,NEVAL,Nenfant)=\"B\",\"X\",\"\")","v":{"$error":"#NAME?"}},{"$f":"IF(INDEX(periode1,NEVAL,Nenfant)=\"A\",\"X\",\"\")","v":{"$error":"#NAME?"}},null,{"$f":"IF(INDEX(periode2,NEVAL,Nenfant)=\"D\",\"X\",\"\")","v":{"$error":"#NAME?"}},{"$f":"IF(INDEX(periode2,NEVAL,Nenfant)=\"C\",\"X\",\"\")","v":{"$error":"#NAME?"}},{"$f":"IF(INDEX(periode2,NEVAL,Nenfant)=\"B\",\"X\",\"\")","v":{"$error":"#NAME?"}},{"$f":"IF(INDEX(periode2,NEVAL,Nenfant)=\"A\",\"X\",\"\")","v":{"$error":"#NAME?"}},null,{"$f":"IF(INDEX(periode3,NEVAL,Nenfant)=\"D\",\"X\",\"\")","v":{"$error":"#NAME?"}},{"$f":"IF(INDEX(periode3,NEVAL,Nenfant)=\"C\",\"X\",\"\")","v":{"$error":"#NAME?"}},{"$f":"IF(INDEX(periode3,NEVAL,Nenfant)=\"B\",\"X\",\"\")","v":{"$error":"#NAME?"}},{"$f":"IF(INDEX(periode3,NEVAL,Nenfant)=\"A\",\"X\",\"\")","v":{"$error":"#NAME?"}},null,{"$f":"IF(INDEX(periode4,NEVAL,Nenfant)=\"D\",\"X\",\"\")","v":{"$error":"#NAME?"}},{"$f":"IF(INDEX(periode4,NEVAL,Nenfant)=\"C\",\"X\",\"\")","v":{"$error":"#NAME?"}},{"$f":"IF(INDEX(periode4,NEVAL,Nenfant)=\"B\",\"X\",\"\")","v":{"$error":"#NAME?"}},{"$f":"IF(INDEX(periode4,NEVAL,Nenfant)=\"A\",\"X\",\"\")","v":{"$error":"#NAME?"}},null,{"$f":"IF(INDEX(periode5,NEVAL,Nenfant)=\"D\",\"X\",\"\")","v":{"$error":"#NAME?"}},{"$f":"IF(INDEX(periode5,NEVAL,Nenfant)=\"C\",\"X\",\"\")","v":{"$error":"#NAME?"}},{"$f":"IF(INDEX(periode5,NEVAL,Nenfant)=\"B\",\"X\",\"\")","v":{"$error":"#NAME?"}},{"$f":"IF(INDEX(periode5,NEVAL,Nenfant)=\"A\",\"X\",\"\")","v":{"$error":"#NAME?"}},null,{"$f":"IF(INDEX(periode6,NEVAL,Nenfant)=\"D\",\"X\",\"\")","v":{"$error":"#NAME?"}},{"$f":"IF(INDEX(periode6,NEVAL,Nenfant)=\"C\",\"X\",\"\")","v":{"$error":"#NAME?"}},{"$f":"IF(INDEX(periode6,NEVAL,Nenfant)=\"B\",\"X\",\"\")","v":{"$error":"#NAME?"}},{"$f":"IF(INDEX(periode6,NEVAL,Nenfant)=\"A\",\"X\",\"\")","v":{"$error":"#NAME?"}}]
[110,{"$nulls":7},{"$f":"IF(INDEX(periode1,NEVAL,Nenfant)=\"D\",\"X\",\"\")","v":{"$error":"#NAME?"}},{"$f":"IF(INDEX(periode1,NEVAL,Nenfant)=\"C\",\"X\",\"\")","v":{"$error":"#NAME?"}},{"$f":"IF(INDEX(periode1,NEVAL,Nenfant)=\"B\",\"X\",\"\")","v":{"$error":"#NAME?"}},{"$f":"IF(INDEX(periode1,NEVAL,Nenfant)=\"A\",\"X\",\"\")","v":{"$error":"#NAME?"}},null,{"$f":"IF(INDEX(periode2,NEVAL,Nenfant)=\"D\",\"X\",\"\")","v":{"$error":"#NAME?"}},{"$f":"IF(INDEX(periode2,NEVAL,Nenfant)=\"C\",\"X\",\"\")","v":{"$error":"#NAME?"}},{"$f":"IF(INDEX(periode2,NEVAL,Nenfant)=\"B\",\"X\",\"\")","v":{"$error":"#NAME?"}},{"$f":"IF(INDEX(periode2,NEVAL,Nenfant)=\"A\",\"X\",\"\")","v":{"$error":"#NAME?"}},null,{"$f":"IF(INDEX(periode3,NEVAL,Nenfant)=\"D\",\"X\",\"\")","v":{"$error":"#NAME?"}},{"$f":"IF(INDEX(periode3,NEVAL,Nenfant)=\"C\",\"X\",\"\")","v":{"$error":"#NAME?"}},{"$f":"IF(INDEX(periode3,NEVAL,Nenfant)=\"B\",\"X\",\"\")","v":{"$error":"#NAME?"}},{"$f":"IF(INDEX(periode3,NEVAL,Nenfant)=\"A\",\"X\",\"\")","v":{"$error":"#NAME?"}},null,{"$f":"IF(INDEX(periode4,NEVAL,Nenfant)=\"D\",\"X\",\"\")","v":{"$error":"#NAME?"}},{"$f":"IF(INDEX(periode4,NEVAL,Nenfant)=\"C\",\"X\",\"\")","v":{"$error":"#NAME?"}},{"$f":"IF(INDEX(periode4,NEVAL,Nenfant)=\"B\",\"X\",\"\")","v":{"$error":"#NAME?"}},{"$f":"IF(INDEX(periode4,NEVAL,Nenfant)=\"A\",\"X\",\"\")","v":{"$error":"#NAME?"}},null,{"$f":"IF(INDEX(periode5,NEVAL,Nenfant)=\"D\",\"X\",\"\")","v":{"$error":"#NAME?"}},{"$f":"IF(INDEX(periode5,NEVAL,Nenfant)=\"C\",\"X\",\"\")","v":{"$error":"#NAME?"}},{"$f":"IF(INDEX(periode5,NEVAL,Nenfant)=\"B\",\"X\",\"\")","v":{"$error":"#NAME?"}},{"$f":"IF(INDEX(periode5,NEVAL,Nenfant)=\"A\",\"X\",\"\")","v":{"$error":"#NAME?"}},null,{"$f":"IF(INDEX(periode6,NEVAL,Nenfant)=\"D\",\"X\",\"\")","v":{"$error":"#NAME?"}},{"$f":"IF(INDEX(periode6,NEVAL,Nenfant)=\"C\",\"X\",\"\")","v":{"$error":"#NAME?"}},{"$f":"IF(INDEX(periode6,NEVAL,Nenfant)=\"B\",\"X\",\"\")","v":{"$error":"#NAME?"}},{"$f":"IF(INDEX(periode6,NEVAL,Nenfant)=\"A\",\"X\",\"\")","v":{"$error":"#NAME?"}}]
[111,{"$nulls":7},{"$f":"IF(INDEX(periode1,NEVAL,Nenfant)=\"D\",\"X\",\"\")","v":{"$error":"#NAME?"}},{"$f":"IF(INDEX(periode1,NEVAL,Nenfant)=\"C\",\"X\",\"\")","v":{"$error":"#NAME?"}},{"$f":"IF(INDEX(periode1,NEVAL,Nenfant)=\"B\",\"X\",\"\")","v":{"$error":"#NAME?"}},{"$f":"IF(INDEX(periode1,NEVAL,Nenfant)=\"A\",\"X\",\"\")","v":{"$error":"#NAME?"}},null,{"$f":"IF(INDEX(periode2,NEVAL,Nenfant)=\"D\",\"X\",\"\")","v":{"$error":"#NAME?"}},{"$f":"IF(INDEX(periode2,NEVAL,Nenfant)=\"C\",\"X\",\"\")","v":{"$error":"#NAME?"}},{"$f":"IF(INDEX(periode2,NEVAL,Nenfant)=\"B\",\"X\",\"\")","v":{"$error":"#NAME?"}},{"$f":"IF(INDEX(periode2,NEVAL,Nenfant)=\"A\",\"X\",\"\")","v":{"$error":"#NAME?"}},null,{"$f":"IF(INDEX(periode3,NEVAL,Nenfant)=\"D\",\"X\",\"\")","v":{"$error":"#NAME?"}},{"$f":"IF(INDEX(periode3,NEVAL,Nenfant)=\"C\",\"X\",\"\")","v":{"$error":"#NAME?"}},{"$f":"IF(INDEX(periode3,NEVAL,Nenfant)=\"B\",\"X\",\"\")","v":{"$error":"#NAME?"}},{"$f":"IF(INDEX(periode3,NEVAL,Nenfant)=\"A\",\"X\",\"\")","v":{"$error":"#NAME?"}},null,{"$f":"IF(INDEX(periode4,NEVAL,Nenfant)=\"D\",\"X\",\"\")","v":{"$error":"#NAME?"}},{"$f":"IF(INDEX(periode4,NEVAL,Nenfant)=\"C\",\"X\",\"\")","v":{"$error":"#NAME?"}},{"$f":"IF(INDEX(periode4,NEVAL,Nenfant)=\"B\",\"X\",\"\")","v":{"$error":"#NAME?"}},{"$f":"IF(INDEX(periode4,NEVAL,Nenfant)=\"A\",\"X\",\"\")","v":{"$error":"#NAME?"}},null,{"$f":"IF(INDEX(periode5,NEVAL,Nenfant)=\"D\",\"X\",\"\")","v":{"$error":"#NAME?"}},{"$f":"IF(INDEX(periode5,NEVAL,Nenfant)=\"C\",\"X\",\"\")","v":{"$error":"#NAME?"}},{"$f":"IF(INDEX(periode5,NEVAL,Nenfant)=\"B\",\"X\",\"\")","v":{"$error":"#NAME?"}},{"$f":"IF(INDEX(periode5,NEVAL,Nenfant)=\"A\",\"X\",\"\")","v":{"$error":"#NAME?"}},null,{"$f":"IF(INDEX(periode6,NEVAL,Nenfant)=\"D\",\"X\",\"\")","v":{"$error":"#NAME?"}},{"$f":"IF(INDEX(periode6,NEVAL,Nenfant)=\"C\",\"X\",\"\")","v":{"$error":"#NAME?"}},{"$f":"IF(INDEX(periode6,NEVAL,Nenfant)=\"B\",\"X\",\"\")","v":{"$error":"#NAME?"}},{"$f":"IF(INDEX(periode6,NEVAL,Nenfant)=\"A\",\"X\",\"\")","v":{"$error":"#NAME?"}}]
[112,{"$nulls":7},{"$f":"COUNTIF($G113:$G114,\"X\")","v":0},{"$f":"COUNTIF($H113:$H114,\"X\")","v":0},{"$f":"COUNTIF($I113:$I114,\"X\")","v":0},{"$f":"COUNTIF($J113:$J114,\"X\")","v":0},null,{"$f":"COUNTIF($G113:$G114,\"X\")","v":0},{"$f":"COUNTIF($H113:$H114,\"X\")","v":0},{"$f":"COUNTIF($I113:$I114,\"X\")","v":0},{"$f":"COUNTIF($J113:$J114,\"X\")","v":0},null,{"$f":"COUNTIF($G113:$G114,\"X\")","v":0},{"$f":"COUNTIF($H113:$H114,\"X\")","v":0},{"$f":"COUNTIF($I113:$I114,\"X\")","v":0},{"$f":"COUNTIF($J113:$J114,\"X\")","v":0},null,{"$f":"COUNTIF($G113:$G114,\"X\")","v":0},{"$f":"COUNTIF($H113:$H114,\"X\")","v":0},{"$f":"COUNTIF($I113:$I114,\"X\")","v":0},{"$f":"COUNTIF(AA113:AA114,\"X\")","v":0},null,{"$f":"COUNTIF($G113:$G114,\"X\")","v":0},{"$f":"COUNTIF($H113:$H114,\"X\")","v":0},{"$f":"COUNTIF($I113:$I114,\"X\")","v":0},{"$f":"COUNTIF($J113:$J114,\"X\")","v":0},null,{"$f":"COUNTIF($G113:$G114,\"X\")","v":0},{"$f":"COUNTIF($H113:$H114,\"X\")","v":0},{"$f":"COUNTIF($I113:$I114,\"X\")","v":0},{"$f":"COUNTIF($J113:$J114,\"X\")","v":0}]
[113,{"$nulls":7},{"$f":"IF(INDEX(periode1,NEVAL,Nenfant)=\"D\",\"X\",\"\")","v":{"$error":"#NAME?"}},{"$f":"IF(INDEX(periode1,NEVAL,Nenfant)=\"C\",\"X\",\"\")","v":{"$error":"#NAME?"}},{"$f":"IF(INDEX(periode1,NEVAL,Nenfant)=\"B\",\"X\",\"\")","v":{"$error":"#NAME?"}},{"$f":"IF(INDEX(periode1,NEVAL,Nenfant)=\"A\",\"X\",\"\")","v":{"$error":"#NAME?"}},null,{"$f":"IF(INDEX(periode2,NEVAL,Nenfant)=\"D\",\"X\",\"\")","v":{"$error":"#NAME?"}},{"$f":"IF(INDEX(periode2,NEVAL,Nenfant)=\"C\",\"X\",\"\")","v":{"$error":"#NAME?"}},{"$f":"IF(INDEX(periode2,NEVAL,Nenfant)=\"B\",\"X\",\"\")","v":{"$error":"#NAME?"}},{"$f":"IF(INDEX(periode2,NEVAL,Nenfant)=\"A\",\"X\",\"\")","v":{"$error":"#NAME?"}},null,{"$f":"IF(INDEX(periode3,NEVAL,Nenfant)=\"D\",\"X\",\"\")","v":{"$error":"#NAME?"}},{"$f":"IF(INDEX(periode3,NEVAL,Nenfant)=\"C\",\"X\",\"\")","v":{"$error":"#NAME?"}},{"$f":"IF(INDEX(periode3,NEVAL,Nenfant)=\"B\",\"X\",\"\")","v":{"$error":"#NAME?"}},{"$f":"IF(INDEX(periode3,NEVAL,Nenfant)=\"A\",\"X\",\"\")","v":{"$error":"#NAME?"}},null,{"$f":"IF(INDEX(periode4,NEVAL,Nenfant)=\"D\",\"X\",\"\")","v":{"$error":"#NAME?"}},{"$f":"IF(INDEX(periode4,NEVAL,Nenfant)=\"C\",\"X\",\"\")","v":{"$error":"#NAME?"}},{"$f":"IF(INDEX(periode4,NEVAL,Nenfant)=\"B\",\"X\",\"\")","v":{"$error":"#NAME?"}},{"$f":"IF(INDEX(periode4,NEVAL,Nenfant)=\"A\",\"X\",\"\")","v":{"$error":"#NAME?"}},null,{"$f":"IF(INDEX(periode5,NEVAL,Nenfant)=\"D\",\"X\",\"\")","v":{"$error":"#NAME?"}},{"$f":"IF(INDEX(periode5,NEVAL,Nenfant)=\"C\",\"X\",\"\")","v":{"$error":"#NAME?"}},{"$f":"IF(INDEX(periode5,NEVAL,Nenfant)=\"B\",\"X\",\"\")","v":{"$error":"#NAME?"}},{"$f":"IF(INDEX(periode5,NEVAL,Nenfant)=\"A\",\"X\",\"\")","v":{"$error":"#NAME?"}},null,{"$f":"IF(INDEX(periode6,NEVAL,Nenfant)=\"D\",\"X\",\"\")","v":{"$error":"#NAME?"}},{"$f":"IF(INDEX(periode6,NEVAL,Nenfant)=\"C\",\"X\",\"\")","v":{"$error":"#NAME?"}},{"$f":"IF(INDEX(periode6,NEVAL,Nenfant)=\"B\",\"X\",\"\")","v":{"$error":"#NAME?"}},{"$f":"IF(INDEX(periode6,NEVAL,Nenfant)=\"A\",\"X\",\"\")","v":{"$error":"#NAME?"}}]
[114,{"$nulls":7},{"$f":"IF(INDEX(periode1,NEVAL,Nenfant)=\"D\",\"X\",\"\")","v":{"$error":"#NAME?"}},{"$error":"#NAME?"},{"$error":"#NAME?"},{"$error":"#NAME?"},null,{"$f":"IF(INDEX(periode2,NEVAL,Nenfant)=\"D\",\"X\",\"\")","v":{"$error":"#NAME?"}},{"$f":"IF(INDEX(periode2,NEVAL,Nenfant)=\"C\",\"X\",\"\")","v":{"$error":"#NAME?"}},{"$f":"IF(INDEX(periode2,NEVAL,Nenfant)=\"B\",\"X\",\"\")","v":{"$error":"#NAME?"}},{"$f":"IF(INDEX(periode2,NEVAL,Nenfant)=\"A\",\"X\",\"\")","v":{"$error":"#NAME?"}},null,{"$f":"IF(INDEX(periode3,NEVAL,Nenfant)=\"D\",\"X\",\"\")","v":{"$error":"#NAME?"}},{"$f":"IF(INDEX(periode3,NEVAL,Nenfant)=\"C\",\"X\",\"\")","v":{"$error":"#NAME?"}},{"$f":"IF(INDEX(periode3,NEVAL,Nenfant)=\"B\",\"X\",\"\")","v":{"$error":"#NAME?"}},{"$f":"IF(INDEX(periode3,NEVAL,Nenfant)=\"A\",\"X\",\"\")","v":{"$error":"#NAME?"}},null,{"$f":"IF(INDEX(periode4,NEVAL,Nenfant)=\"D\",\"X\",\"\")","v":{"$error":"#NAME?"}},{"$f":"IF(INDEX(periode4,NEVAL,Nenfant)=\"C\",\"X\",\"\")","v":{"$error":"#NAME?"}},{"$f":"IF(INDEX(periode4,NEVAL,Nenfant)=\"B\",\"X\",\"\")","v":{"$error":"#NAME?"}},{"$f":"IF(INDEX(periode4,NEVAL,Nenfant)=\"A\",\"X\",\"\")","v":{"$error":"#NAME?"}},null,{"$f":"IF(INDEX(periode5,NEVAL,Nenfant)=\"D\",\"X\",\"\")","v":{"$error":"#NAME?"}},{"$f":"IF(INDEX(periode5,NEVAL,Nenfant)=\"C\",\"X\",\"\")","v":{"$error":"#NAME?"}},{"$f":"IF(INDEX(periode5,NEVAL,Nenfant)=\"B\",\"X\",\"\")","v":{"$error":"#NAME?"}},{"$f":"IF(INDEX(periode5,NEVAL,Nenfant)=\"A\",\"X\",\"\")","v":{"$error":"#NAME?"}},null,{"$f":"IF(INDEX(periode6,NEVAL,Nenfant)=\"D\",\"X\",\"\")","v":{"$error":"#NAME?"}},{"$f":"IF(INDEX(periode6,NEVAL,Nenfant)=\"C\",\"X\",\"\")","v":{"$error":"#NAME?"}},{"$f":"IF(INDEX(periode6,NEVAL,Nenfant)=\"B\",\"X\",\"\")","v":{"$error":"#NAME?"}},{"$f":"IF(INDEX(periode6,NEVAL,Nenfant)=\"A\",\"X\",\"\")","v":{"$error":"#NAME?"}}]
[115,{"$nulls":7},{"$f":"COUNTIF($G116:$G117,\"X\")","v":0},{"$f":"COUNTIF($H116:$H117,\"X\")","v":0},{"$f":"COUNTIF($I116:$I117,\"X\")","v":0},{"$f":"COUNTIF($J116:$J117,\"X\")","v":0},null,{"$f":"COUNTIF($G116:$G117,\"X\")","v":0},{"$f":"COUNTIF($H116:$H117,\"X\")","v":0},{"$f":"COUNTIF($I116:$I117,\"X\")","v":0},{"$f":"COUNTIF($J116:$J117,\"X\")","v":0},null,{"$f":"COUNTIF($G116:$G117,\"X\")","v":0},{"$f":"COUNTIF($H116:$H117,\"X\")","v":0},{"$f":"COUNTIF($I116:$I117,\"X\")","v":0},{"$f":"COUNTIF($J116:$J117,\"X\")","v":0},null,{"$f":"COUNTIF($G116:$G117,\"X\")","v":0},{"$f":"COUNTIF($H116:$H117,\"X\")","v":0},{"$f":"COUNTIF($I116:$I117,\"X\")","v":0},{"$f":"COUNTIF(AA116:AA117,\"X\")","v":0},null,{"$f":"COUNTIF($G116:$G117,\"X\")","v":0},{"$f":"COUNTIF($H116:$H117,\"X\")","v":0},{"$f":"COUNTIF($I116:$I117,\"X\")","v":0},{"$f":"COUNTIF($J116:$J117,\"X\")","v":0},null,{"$f":"COUNTIF($G116:$G117,\"X\")","v":0},{"$f":"COUNTIF($H116:$H117,\"X\")","v":0},{"$f":"COUNTIF($I116:$I117,\"X\")","v":0},{"$f":"COUNTIF($J116:$J117,\"X\")","v":0}]
[116,{"$nulls":7},{"$f":"IF(INDEX(periode1,NEVAL,Nenfant)=\"D\",\"X\",\"\")","v":{"$error":"#NAME?"}},{"$error":"#NAME?"},{"$error":"#NAME?"},{"$error":"#NAME?"},null,{"$f":"IF(INDEX(periode2,NEVAL,Nenfant)=\"D\",\"X\",\"\")","v":{"$error":"#NAME?"}},{"$f":"IF(INDEX(periode2,NEVAL,Nenfant)=\"C\",\"X\",\"\")","v":{"$error":"#NAME?"}},{"$f":"IF(INDEX(periode2,NEVAL,Nenfant)=\"B\",\"X\",\"\")","v":{"$error":"#NAME?"}},{"$f":"IF(INDEX(periode2,NEVAL,Nenfant)=\"A\",\"X\",\"\")","v":{"$error":"#NAME?"}},null,{"$f":"IF(INDEX(periode3,NEVAL,Nenfant)=\"D\",\"X\",\"\")","v":{"$error":"#NAME?"}},{"$f":"IF(INDEX(periode3,NEVAL,Nenfant)=\"C\",\"X\",\"\")","v":{"$error":"#NAME?"}},{"$f":"IF(INDEX(periode3,NEVAL,Nenfant)=\"B\",\"X\",\"\")","v":{"$error":"#NAME?"}},{"$f":"IF(INDEX(periode3,NEVAL,Nenfant)=\"A\",\"X\",\"\")","v":{"$error":"#NAME?"}},null,{"$f":"IF(INDEX(periode4,NEVAL,Nenfant)=\"D\",\"X\",\"\")","v":{"$error":"#NAME?"}},{"$f":"IF(INDEX(periode4,NEVAL,Nenfant)=\"C\",\"X\",\"\")","v":{"$error":"#NAME?"}},{"$f":"IF(INDEX(periode4,NEVAL,Nenfant)=\"B\",\"X\",\"\")","v":{"$error":"#NAME?"}},{"$f":"IF(INDEX(periode4,NEVAL,Nenfant)=\"A\",\"X\",\"\")","v":{"$error":"#NAME?"}},null,{"$f":"IF(INDEX(periode5,NEVAL,Nenfant)=\"D\",\"X\",\"\")","v":{"$error":"#NAME?"}},{"$f":"IF(INDEX(periode5,NEVAL,Nenfant)=\"C\",\"X\",\"\")","v":{"$error":"#NAME?"}},{"$f":"IF(INDEX(periode5,NEVAL,Nenfant)=\"B\",\"X\",\"\")","v":{"$error":"#NAME?"}},{"$f":"IF(INDEX(periode5,NEVAL,Nenfant)=\"A\",\"X\",\"\")","v":{"$error":"#NAME?"}},null,{"$f":"IF(INDEX(periode6,NEVAL,Nenfant)=\"D\",\"X\",\"\")","v":{"$error":"#NAME?"}},{"$f":"IF(INDEX(periode6,NEVAL,Nenfant)=\"C\",\"X\",\"\")","v":{"$error":"#NAME?"}},{"$f":"IF(INDEX(periode6,NEVAL,Nenfant)=\"B\",\"X\",\"\")","v":{"$error":"#NAME?"}},{"$f":"IF(INDEX(periode6,NEVAL,Nenfant)=\"A\",\"X\",\"\")","v":{"$error":"#NAME?"}}]
[117,{"$nulls":7},{"$f":"IF(INDEX(periode1,NEVAL,Nenfant)=\"D\",\"X\",\"\")","v":{"$error":"#NAME?"}},{"$error":"#NAME?"},{"$error":"#NAME?"},{"$error":"#NAME?"},null,{"$f":"IF(INDEX(periode2,NEVAL,Nenfant)=\"D\",\"X\",\"\")","v":{"$error":"#NAME?"}},{"$f":"IF(INDEX(periode2,NEVAL,Nenfant)=\"C\",\"X\",\"\")","v":{"$error":"#NAME?"}},{"$f":"IF(INDEX(periode2,NEVAL,Nenfant)=\"B\",\"X\",\"\")","v":{"$error":"#NAME?"}},{"$f":"IF(INDEX(periode2,NEVAL,Nenfant)=\"A\",\"X\",\"\")","v":{"$error":"#NAME?"}},null,{"$f":"IF(INDEX(periode3,NEVAL,Nenfant)=\"D\",\"X\",\"\")","v":{"$error":"#NAME?"}},{"$f":"IF(INDEX(periode3,NEVAL,Nenfant)=\"C\",\"X\",\"\")","v":{"$error":"#NAME?"}},{"$f":"IF(INDEX(periode3,NEVAL,Nenfant)=\"B\",\"X\",\"\")","v":{"$error":"#NAME?"}},{"$f":"IF(INDEX(periode3,NEVAL,Nenfant)=\"A\",\"X\",\"\")","v":{"$error":"#NAME?"}},null,{"$f":"IF(INDEX(periode4,NEVAL,Nenfant)=\"D\",\"X\",\"\")","v":{"$error":"#NAME?"}},{"$f":"IF(INDEX(periode4,NEVAL,Nenfant)=\"C\",\"X\",\"\")","v":{"$error":"#NAME?"}},{"$f":"IF(INDEX(periode4,NEVAL,Nenfant)=\"B\",\"X\",\"\")","v":{"$error":"#NAME?"}},{"$f":"IF(INDEX(periode4,NEVAL,Nenfant)=\"A\",\"X\",\"\")","v":{"$error":"#NAME?"}},null,{"$f":"IF(INDEX(periode5,NEVAL,Nenfant)=\"D\",\"X\",\"\")","v":{"$error":"#NAME?"}},{"$f":"IF(INDEX(periode5,NEVAL,Nenfant)=\"C\",\"X\",\"\")","v":{"$error":"#NAME?"}},{"$f":"IF(INDEX(periode5,NEVAL,Nenfant)=\"B\",\"X\",\"\")","v":{"$error":"#NAME?"}},{"$f":"IF(INDEX(periode5,NEVAL,Nenfant)=\"A\",\"X\",\"\")","v":{"$error":"#NAME?"}},null,{"$f":"IF(INDEX(periode6,NEVAL,Nenfant)=\"D\",\"X\",\"\")","v":{"$error":"#NAME?"}},{"$f":"IF(INDEX(periode6,NEVAL,Nenfant)=\"C\",\"X\",\"\")","v":{"$error":"#NAME?"}},{"$f":"IF(INDEX(periode6,NEVAL,Nenfant)=\"B\",\"X\",\"\")","v":{"$error":"#NAME?"}},{"$f":"IF(INDEX(periode6,NEVAL,Nenfant)=\"A\",\"X\",\"\")","v":{"$error":"#NAME?"}}]
[118,{"$nulls":7},{"$f":"COUNTIF($G119:$G120,\"X\")","v":0},{"$f":"COUNTIF($H119:$H120,\"X\")","v":0},{"$f":"COUNTIF($I119:$I120,\"X\")","v":0},{"$f":"COUNTIF($J119:$J120,\"X\")","v":0},null,{"$f":"COUNTIF($G119:$G120,\"X\")","v":0},{"$f":"COUNTIF($H119:$H120,\"X\")","v":0},{"$f":"COUNTIF($I119:$I120,\"X\")","v":0},{"$f":"COUNTIF($J119:$J120,\"X\")","v":0},null,{"$f":"COUNTIF($G119:$G120,\"X\")","v":0},{"$f":"COUNTIF($H119:$H120,\"X\")","v":0},{"$f":"COUNTIF($I119:$I120,\"X\")","v":0},{"$f":"COUNTIF($J119:$J120,\"X\")","v":0},null,{"$f":"COUNTIF($G119:$G120,\"X\")","v":0},{"$f":"COUNTIF($H119:$H120,\"X\")","v":0},{"$f":"COUNTIF($I119:$I120,\"X\")","v":0},{"$f":"COUNTIF(AA119:AA120,\"X\")","v":0},null,{"$f":"COUNTIF($G119:$G120,\"X\")","v":0},{"$f":"COUNTIF($H119:$H120,\"X\")","v":0},{"$f":"COUNTIF($I119:$I120,\"X\")","v":0},{"$f":"COUNTIF($J119:$J120,\"X\")","v":0},null,{"$f":"COUNTIF($G119:$G120,\"X\")","v":0},{"$f":"COUNTIF($H119:$H120,\"X\")","v":0},{"$f":"COUNTIF($I119:$I120,\"X\")","v":0},{"$f":"COUNTIF($J119:$J120,\"X\")","v":0}]
[119,{"$nulls":7},{"$f":"IF(INDEX(periode1,NEVAL,Nenfant)=\"D\",\"X\",\"\")","v":{"$error":"#NAME?"}},{"$error":"#NAME?"},{"$error":"#NAME?"},{"$error":"#NAME?"},null,{"$f":"IF(INDEX(periode2,NEVAL,Nenfant)=\"D\",\"X\",\"\")","v":{"$error":"#NAME?"}},{"$f":"IF(INDEX(periode2,NEVAL,Nenfant)=\"C\",\"X\",\"\")","v":{"$error":"#NAME?"}},{"$f":"IF(INDEX(periode2,NEVAL,Nenfant)=\"B\",\"X\",\"\")","v":{"$error":"#NAME?"}},{"$f":"IF(INDEX(periode2,NEVAL,Nenfant)=\"A\",\"X\",\"\")","v":{"$error":"#NAME?"}},null,{"$f":"IF(INDEX(periode3,NEVAL,Nenfant)=\"D\",\"X\",\"\")","v":{"$error":"#NAME?"}},{"$f":"IF(INDEX(periode3,NEVAL,Nenfant)=\"C\",\"X\",\"\")","v":{"$error":"#NAME?"}},{"$f":"IF(INDEX(periode3,NEVAL,Nenfant)=\"B\",\"X\",\"\")","v":{"$error":"#NAME?"}},{"$f":"IF(INDEX(periode3,NEVAL,Nenfant)=\"A\",\"X\",\"\")","v":{"$error":"#NAME?"}},null,{"$f":"IF(INDEX(periode4,NEVAL,Nenfant)=\"D\",\"X\",\"\")","v":{"$error":"#NAME?"}},{"$f":"IF(INDEX(periode4,NEVAL,Nenfant)=\"C\",\"X\",\"\")","v":{"$error":"#NAME?"}},{"$f":"IF(INDEX(periode4,NEVAL,Nenfant)=\"B\",\"X\",\"\")","v":{"$error":"#NAME?"}},{"$f":"IF(INDEX(periode4,NEVAL,Nenfant)=\"A\",\"X\",\"\")","v":{"$error":"#NAME?"}},null,{"$f":"IF(INDEX(periode5,NEVAL,Nenfant)=\"D\",\"X\",\"\")","v":{"$error":"#NAME?"}},{"$f":"IF(INDEX(periode5,NEVAL,Nenfant)=\"C\",\"X\",\"\")","v":{"$error":"#NAME?"}},{"$f":"IF(INDEX(periode5,NEVAL,Nenfant)=\"B\",\"X\",\"\")","v":{"$error":"#NAME?"}},{"$f":"IF(INDEX(periode5,NEVAL,Nenfant)=\"A\",\"X\",\"\")","v":{"$error":"#NAME?"}},null,{"$f":"IF(INDEX(periode6,NEVAL,Nenfant)=\"D\",\"X\",\"\")","v":{"$error":"#NAME?"}},{"$f":"IF(INDEX(periode6,NEVAL,Nenfant)=\"C\",\"X\",\"\")","v":{"$error":"#NAME?"}},{"$f":"IF(INDEX(periode6,NEVAL,Nenfant)=\"B\",\"X\",\"\")","v":{"$error":"#NAME?"}},{"$f":"IF(INDEX(periode6,NEVAL,Nenfant)=\"A\",\"X\",\"\")","v":{"$error":"#NAME?"}}]
[120,{"$nulls":7},{"$f":"IF(INDEX(periode1,NEVAL,Nenfant)=\"D\",\"X\",\"\")","v":{"$error":"#NAME?"}},{"$error":"#NAME?"},{"$error":"#NAME?"},{"$error":"#NAME?"},null,{"$f":"IF(INDEX(periode2,NEVAL,Nenfant)=\"D\",\"X\",\"\")","v":{"$error":"#NAME?"}},{"$f":"IF(INDEX(periode2,NEVAL,Nenfant)=\"C\",\"X\",\"\")","v":{"$error":"#NAME?"}},{"$f":"IF(INDEX(periode2,NEVAL,Nenfant)=\"B\",\"X\",\"\")","v":{"$error":"#NAME?"}},{"$f":"IF(INDEX(periode2,NEVAL,Nenfant)=\"A\",\"X\",\"\")","v":{"$error":"#NAME?"}},null,{"$f":"IF(INDEX(periode3,NEVAL,Nenfant)=\"D\",\"X\",\"\")","v":{"$error":"#NAME?"}},{"$f":"IF(INDEX(periode3,NEVAL,Nenfant)=\"C\",\"X\",\"\")","v":{"$error":"#NAME?"}},{"$f":"IF(INDEX(periode3,NEVAL,Nenfant)=\"B\",\"X\",\"\")","v":{"$error":"#NAME?"}},{"$f":"IF(INDEX(periode3,NEVAL,Nenfant)=\"A\",\"X\",\"\")","v":{"$error":"#NAME?"}},null,{"$f":"IF(INDEX(periode4,NEVAL,Nenfant)=\"D\",\"X\",\"\")","v":{"$error":"#NAME?"}},{"$f":"IF(INDEX(periode4,NEVAL,Nenfant)=\"C\",\"X\",\"\")","v":{"$error":"#NAME?"}},{"$f":"IF(INDEX(periode4,NEVAL,Nenfant)=\"B\",\"X\",\"\")","v":{"$error":"#NAME?"}},{"$f":"IF(INDEX(periode4,NEVAL,Nenfant)=\"A\",\"X\",\"\")","v":{"$error":"#NAME?"}},null,{"$f":"IF(INDEX(periode5,NEVAL,Nenfant)=\"D\",\"X\",\"\")","v":{"$error":"#NAME?"}},{"$f":"IF(INDEX(periode5,NEVAL,Nenfant)=\"C\",\"X\",\"\")","v":{"$error":"#NAME?"}},{"$f":"IF(INDEX(periode5,NEVAL,Nenfant)=\"B\",\"X\",\"\")","v":{"$error":"#NAME?"}},{"$f":"IF(INDEX(periode5,NEVAL,Nenfant)=\"A\",\"X\",\"\")","v":{"$error":"#NAME?"}},null,{"$f":"IF(INDEX(periode6,NEVAL,Nenfant)=\"D\",\"X\",\"\")","v":{"$error":"#NAME?"}},{"$f":"IF(INDEX(periode6,NEVAL,Nenfant)=\"C\",\"X\",\"\")","v":{"$error":"#NAME?"}},{"$f":"IF(INDEX(periode6,NEVAL,Nenfant)=\"B\",\"X\",\"\")","v":{"$error":"#NAME?"}},{"$f":"IF(INDEX(periode6,NEVAL,Nenfant)=\"A\",\"X\",\"\")","v":{"$error":"#NAME?"}}]
[121,{"$nulls":7},{"$f":"COUNTIF($G122:$G123,\"X\")","v":0},{"$f":"COUNTIF($H122:$H123,\"X\")","v":0},{"$f":"COUNTIF($I122:$I123,\"X\")","v":0},{"$f":"COUNTIF($J122:$J123,\"X\")","v":0},null,{"$f":"COUNTIF($G122:$G123,\"X\")","v":0},{"$f":"COUNTIF($H122:$H123,\"X\")","v":0},{"$f":"COUNTIF($I122:$I123,\"X\")","v":0},{"$f":"COUNTIF($J122:$J123,\"X\")","v":0},null,{"$f":"COUNTIF($G122:$G123,\"X\")","v":0},{"$f":"COUNTIF($H122:$H123,\"X\")","v":0},{"$f":"COUNTIF($I122:$I123,\"X\")","v":0},{"$f":"COUNTIF($J122:$J123,\"X\")","v":0},null,{"$f":"COUNTIF($G122:$G123,\"X\")","v":0},{"$f":"COUNTIF($H122:$H123,\"X\")","v":0},{"$f":"COUNTIF($I122:$I123,\"X\")","v":0},{"$f":"COUNTIF(AA122:AA123,\"X\")","v":0},null,{"$f":"COUNTIF($G122:$G123,\"X\")","v":0},{"$f":"COUNTIF($H122:$H123,\"X\")","v":0},{"$f":"COUNTIF($I122:$I123,\"X\")","v":0},{"$f":"COUNTIF($J122:$J123,\"X\")","v":0},null,{"$f":"COUNTIF($G122:$G123,\"X\")","v":0},{"$f":"COUNTIF($H122:$H123,\"X\")","v":0},{"$f":"COUNTIF($I122:$I123,\"X\")","v":0},{"$f":"COUNTIF($J122:$J123,\"X\")","v":0}]
[122,{"$nulls":7},{"$f":"IF(INDEX(periode1,NEVAL,Nenfant)=\"D\",\"X\",\"\")","v":{"$error":"#NAME?"}},{"$error":"#NAME?"},{"$error":"#NAME?"},{"$error":"#NAME?"},null,{"$f":"IF(INDEX(periode2,NEVAL,Nenfant)=\"D\",\"X\",\"\")","v":{"$error":"#NAME?"}},{"$f":"IF(INDEX(periode2,NEVAL,Nenfant)=\"C\",\"X\",\"\")","v":{"$error":"#NAME?"}},{"$f":"IF(INDEX(periode2,NEVAL,Nenfant)=\"B\",\"X\",\"\")","v":{"$error":"#NAME?"}},{"$f":"IF(INDEX(periode2,NEVAL,Nenfant)=\"A\",\"X\",\"\")","v":{"$error":"#NAME?"}},null,{"$f":"IF(INDEX(periode3,NEVAL,Nenfant)=\"D\",\"X\",\"\")","v":{"$error":"#NAME?"}},{"$f":"IF(INDEX(periode3,NEVAL,Nenfant)=\"C\",\"X\",\"\")","v":{"$error":"#NAME?"}},{"$f":"IF(INDEX(periode3,NEVAL,Nenfant)=\"B\",\"X\",\"\")","v":{"$error":"#NAME?"}},{"$f":"IF(INDEX(periode3,NEVAL,Nenfant)=\"A\",\"X\",\"\")","v":{"$error":"#NAME?"}},null,{"$f":"IF(INDEX(periode4,NEVAL,Nenfant)=\"D\",\"X\",\"\")","v":{"$error":"#NAME?"}},{"$f":"IF(INDEX(periode4,NEVAL,Nenfant)=\"C\",\"X\",\"\")","v":{"$error":"#NAME?"}},{"$f":"IF(INDEX(periode4,NEVAL,Nenfant)=\"B\",\"X\",\"\")","v":{"$error":"#NAME?"}},{"$f":"IF(INDEX(periode4,NEVAL,Nenfant)=\"A\",\"X\",\"\")","v":{"$error":"#NAME?"}},null,{"$f":"IF(INDEX(periode5,NEVAL,Nenfant)=\"D\",\"X\",\"\")","v":{"$error":"#NAME?"}},{"$f":"IF(INDEX(periode5,NEVAL,Nenfant)=\"C\",\"X\",\"\")","v":{"$error":"#NAME?"}},{"$f":"IF(INDEX(periode5,NEVAL,Nenfant)=\"B\",\"X\",\"\")","v":{"$error":"#NAME?"}},{"$f":"IF(INDEX(periode5,NEVAL,Nenfant)=\"A\",\"X\",\"\")","v":{"$error":"#NAME?"}},null,{"$f":"IF(INDEX(periode6,NEVAL,Nenfant)=\"D\",\"X\",\"\")","v":{"$error":"#NAME?"}},{"$f":"IF(INDEX(periode6,NEVAL,Nenfant)=\"C\",\"X\",\"\")","v":{"$error":"#NAME?"}},{"$f":"IF(INDEX(periode6,NEVAL,Nenfant)=\"B\",\"X\",\"\")","v":{"$error":"#NAME?"}},{"$f":"IF(INDEX(periode6,NEVAL,Nenfant)=\"A\",\"X\",\"\")","v":{"$error":"#NAME?"}}]
[123,{"$nulls":7},{"$f":"IF(INDEX(periode1,NEVAL,Nenfant)=\"D\",\"X\",\"\")","v":{"$error":"#NAME?"}},{"$error":"#NAME?"},{"$error":"#NAME?"},{"$error":"#NAME?"},null,{"$f":"IF(INDEX(periode2,NEVAL,Nenfant)=\"D\",\"X\",\"\")","v":{"$error":"#NAME?"}},{"$f":"IF(INDEX(periode2,NEVAL,Nenfant)=\"C\",\"X\",\"\")","v":{"$error":"#NAME?"}},{"$f":"IF(INDEX(periode2,NEVAL,Nenfant)=\"B\",\"X\",\"\")","v":{"$error":"#NAME?"}},{"$f":"IF(INDEX(periode2,NEVAL,Nenfant)=\"A\",\"X\",\"\")","v":{"$error":"#NAME?"}},null,{"$f":"IF(INDEX(periode3,NEVAL,Nenfant)=\"D\",\"X\",\"\")","v":{"$error":"#NAME?"}},{"$f":"IF(INDEX(periode3,NEVAL,Nenfant)=\"C\",\"X\",\"\")","v":{"$error":"#NAME?"}},{"$f":"IF(INDEX(periode3,NEVAL,Nenfant)=\"B\",\"X\",\"\")","v":{"$error":"#NAME?"}},{"$f":"IF(INDEX(periode3,NEVAL,Nenfant)=\"A\",\"X\",\"\")","v":{"$error":"#NAME?"}},null,{"$f":"IF(INDEX(periode4,NEVAL,Nenfant)=\"D\",\"X\",\"\")","v":{"$error":"#NAME?"}},{"$f":"IF(INDEX(periode4,NEVAL,Nenfant)=\"C\",\"X\",\"\")","v":{"$error":"#NAME?"}},{"$f":"IF(INDEX(periode4,NEVAL,Nenfant)=\"B\",\"X\",\"\")","v":{"$error":"#NAME?"}},{"$f":"IF(INDEX(periode4,NEVAL,Nenfant)=\"A\",\"X\",\"\")","v":{"$error":"#NAME?"}},null,{"$f":"IF(INDEX(periode5,NEVAL,Nenfant)=\"D\",\"X\",\"\")","v":{"$error":"#NAME?"}},{"$f":"IF(INDEX(periode5,NEVAL,Nenfant)=\"C\",\"X\",\"\")","v":{"$error":"#NAME?"}},{"$f":"IF(INDEX(periode5,NEVAL,Nenfant)=\"B\",\"X\",\"\")","v":{"$error":"#NAME?"}},{"$f":"IF(INDEX(periode5,NEVAL,Nenfant)=\"A\",\"X\",\"\")","v":{"$error":"#NAME?"}},null,{"$f":"IF(INDEX(periode6,NEVAL,Nenfant)=\"D\",\"X\",\"\")","v":{"$error":"#NAME?"}},{"$f":"IF(INDEX(periode6,NEVAL,Nenfant)=\"C\",\"X\",\"\")","v":{"$error":"#NAME?"}},{"$f":"IF(INDEX(periode6,NEVAL,Nenfant)=\"B\",\"X\",\"\")","v":{"$error":"#NAME?"}},{"$f":"IF(INDEX(periode6,NEVAL,Nenfant)=\"A\",\"X\",\"\")","v":{"$error":"#NAME?"}}]
[124,{"$nulls":7},{"$f":"COUNTIF($G125:$G127,\"X\")","v":0},{"$f":"COUNTIF($H125:$H127,\"X\")","v":0},{"$f":"COUNTIF($I125:$I127,\"X\")","v":0},{"$f":"COUNTIF($J125:$J127,\"X\")","v":0},null,{"$f":"COUNTIF($G125:$G127,\"X\")","v":0},{"$f":"COUNTIF($H125:$H127,\"X\")","v":0},{"$f":"COUNTIF($I125:$I127,\"X\")","v":0},{"$f":"COUNTIF($J125:$J127,\"X\")","v":0},null,{"$f":"COUNTIF($G125:$G127,\"X\")","v":0},{"$f":"COUNTIF($H125:$H127,\"X\")","v":0},{"$f":"COUNTIF($I125:$I127,\"X\")","v":0},{"$f":"COUNTIF($J125:$J127,\"X\")","v":0},null,{"$f":"COUNTIF($G125:$G127,\"X\")","v":0},{"$f":"COUNTIF($H125:$H127,\"X\")","v":0},{"$f":"COUNTIF($I125:$I127,\"X\")","v":0},{"$f":"COUNTIF(AA125:AA127,\"X\")","v":0},null,{"$f":"COUNTIF($G125:$G127,\"X\")","v":0},{"$f":"COUNTIF($H125:$H127,\"X\")","v":0},{"$f":"COUNTIF($I125:$I127,\"X\")","v":0},{"$f":"COUNTIF($J125:$J127,\"X\")","v":0},null,{"$f":"COUNTIF($G125:$G127,\"X\")","v":0},{"$f":"COUNTIF($H125:$H127,\"X\")","v":0},{"$f":"COUNTIF($I125:$I127,\"X\")","v":0},{"$f":"COUNTIF($J125:$J127,\"X\")","v":0}]
[125,{"$nulls":7},{"$f":"IF(INDEX(periode1,NEVAL,Nenfant)=\"D\",\"X\",\"\")","v":{"$error":"#NAME?"}},{"$error":"#NAME?"},{"$error":"#NAME?"},{"$error":"#NAME?"},null,{"$f":"IF(INDEX(periode2,NEVAL,Nenfant)=\"D\",\"X\",\"\")","v":{"$error":"#NAME?"}},{"$f":"IF(INDEX(periode2,NEVAL,Nenfant)=\"C\",\"X\",\"\")","v":{"$error":"#NAME?"}},{"$f":"IF(INDEX(periode2,NEVAL,Nenfant)=\"B\",\"X\",\"\")","v":{"$error":"#NAME?"}},{"$f":"IF(INDEX(periode2,NEVAL,Nenfant)=\"A\",\"X\",\"\")","v":{"$error":"#NAME?"}},null,{"$f":"IF(INDEX(periode3,NEVAL,Nenfant)=\"D\",\"X\",\"\")","v":{"$error":"#NAME?"}},{"$f":"IF(INDEX(periode3,NEVAL,Nenfant)=\"C\",\"X\",\"\")","v":{"$error":"#NAME?"}},{"$f":"IF(INDEX(periode3,NEVAL,Nenfant)=\"B\",\"X\",\"\")","v":{"$error":"#NAME?"}},{"$f":"IF(INDEX(periode3,NEVAL,Nenfant)=\"A\",\"X\",\"\")","v":{"$error":"#NAME?"}},null,{"$f":"IF(INDEX(periode4,NEVAL,Nenfant)=\"D\",\"X\",\"\")","v":{"$error":"#NAME?"}},{"$f":"IF(INDEX(periode4,NEVAL,Nenfant)=\"C\",\"X\",\"\")","v":{"$error":"#NAME?"}},{"$f":"IF(INDEX(periode4,NEVAL,Nenfant)=\"B\",\"X\",\"\")","v":{"$error":"#NAME?"}},{"$f":"IF(INDEX(periode4,NEVAL,Nenfant)=\"A\",\"X\",\"\")","v":{"$error":"#NAME?"}},null,{"$f":"IF(INDEX(periode5,NEVAL,Nenfant)=\"D\",\"X\",\"\")","v":{"$error":"#NAME?"}},{"$f":"IF(INDEX(periode5,NEVAL,Nenfant)=\"C\",\"X\",\"\")","v":{"$error":"#NAME?"}},{"$f":"IF(INDEX(periode5,NEVAL,Nenfant)=\"B\",\"X\",\"\")","v":{"$error":"#NAME?"}},{"$f":"IF(INDEX(periode5,NEVAL,Nenfant)=\"A\",\"X\",\"\")","v":{"$error":"#NAME?"}},null,{"$f":"IF(INDEX(periode6,NEVAL,Nenfant)=\"D\",\"X\",\"\")","v":{"$error":"#NAME?"}},{"$f":"IF(INDEX(periode6,NEVAL,Nenfant)=\"C\",\"X\",\"\")","v":{"$error":"#NAME?"}},{"$f":"IF(INDEX(periode6,NEVAL,Nenfant)=\"B\",\"X\",\"\")","v":{"$error":"#NAME?"}},{"$f":"IF(INDEX(periode6,NEVAL,Nenfant)=\"A\",\"X\",\"\")","v":{"$error":"#NAME?"}}]
[126,{"$nulls":7},{"$f":"IF(INDEX(periode1,NEVAL,Nenfant)=\"D\",\"X\",\"\")","v":{"$error":"#NAME?"}},{"$error":"#NAME?"},{"$error":"#NAME?"},{"$error":"#NAME?"},null,{"$f":"IF(INDEX(periode2,NEVAL,Nenfant)=\"D\",\"X\",\"\")","v":{"$error":"#NAME?"}},{"$f":"IF(INDEX(periode2,NEVAL,Nenfant)=\"C\",\"X\",\"\")","v":{"$error":"#NAME?"}},{"$f":"IF(INDEX(periode2,NEVAL,Nenfant)=\"B\",\"X\",\"\")","v":{"$error":"#NAME?"}},{"$f":"IF(INDEX(periode2,NEVAL,Nenfant)=\"A\",\"X\",\"\")","v":{"$error":"#NAME?"}},null,{"$f":"IF(INDEX(periode3,NEVAL,Nenfant)=\"D\",\"X\",\"\")","v":{"$error":"#NAME?"}},{"$f":"IF(INDEX(periode3,NEVAL,Nenfant)=\"C\",\"X\",\"\")","v":{"$error":"#NAME?"}},{"$f":"IF(INDEX(periode3,NEVAL,Nenfant)=\"B\",\"X\",\"\")","v":{"$error":"#NAME?"}},{"$f":"IF(INDEX(periode3,NEVAL,Nenfant)=\"A\",\"X\",\"\")","v":{"$error":"#NAME?"}},null,{"$f":"IF(INDEX(periode4,NEVAL,Nenfant)=\"D\",\"X\",\"\")","v":{"$error":"#NAME?"}},{"$f":"IF(INDEX(periode4,NEVAL,Nenfant)=\"C\",\"X\",\"\")","v":{"$error":"#NAME?"}},{"$f":"IF(INDEX(periode4,NEVAL,Nenfant)=\"B\",\"X\",\"\")","v":{"$error":"#NAME?"}},{"$f":"IF(INDEX(periode4,NEVAL,Nenfant)=\"A\",\"X\",\"\")","v":{"$error":"#NAME?"}},null,{"$f":"IF(INDEX(periode5,NEVAL,Nenfant)=\"D\",\"X\",\"\")","v":{"$error":"#NAME?"}},{"$f":"IF(INDEX(periode5,NEVAL,Nenfant)=\"C\",\"X\",\"\")","v":{"$error":"#NAME?"}},{"$f":"IF(INDEX(periode5,NEVAL,Nenfant)=\"B\",\"X\",\"\")","v":{"$error":"#NAME?"}},{"$f":"IF(INDEX(periode5,NEVAL,Nenfant)=\"A\",\"X\",\"\")","v":{"$error":"#NAME?"}},null,{"$f":"IF(INDEX(periode6,NEVAL,Nenfant)=\"D\",\"X\",\"\")","v":{"$error":"#NAME?"}},{"$f":"IF(INDEX(periode6,NEVAL,Nenfant)=\"C\",\"X\",\"\")","v":{"$error":"#NAME?"}},{"$f":"IF(INDEX(periode6,NEVAL,Nenfant)=\"B\",\"X\",\"\")","v":{"$error":"#NAME?"}},{"$f":"IF(INDEX(periode6,NEVAL,Nenfant)=\"A\",\"X\",\"\")","v":{"$error":"#NAME?"}}]
[127,{"$nulls":7},{"$f":"IF(INDEX(periode1,NEVAL,Nenfant)=\"D\",\"X\",\"\")","v":{"$error":"#NAME?"}},{"$error":"#NAME?"},{"$error":"#NAME?"},{"$error":"#NAME?"},null,{"$f":"IF(INDEX(periode2,NEVAL,Nenfant)=\"D\",\"X\",\"\")","v":{"$error":"#NAME?"}},{"$f":"IF(INDEX(periode2,NEVAL,Nenfant)=\"C\",\"X\",\"\")","v":{"$error":"#NAME?"}},{"$f":"IF(INDEX(periode2,NEVAL,Nenfant)=\"B\",\"X\",\"\")","v":{"$error":"#NAME?"}},{"$f":"IF(INDEX(periode2,NEVAL,Nenfant)=\"A\",\"X\",\"\")","v":{"$error":"#NAME?"}},null,{"$f":"IF(INDEX(periode3,NEVAL,Nenfant)=\"D\",\"X\",\"\")","v":{"$error":"#NAME?"}},{"$f":"IF(INDEX(periode3,NEVAL,Nenfant)=\"C\",\"X\",\"\")","v":{"$error":"#NAME?"}},{"$f":"IF(INDEX(periode3,NEVAL,Nenfant)=\"B\",\"X\",\"\")","v":{"$error":"#NAME?"}},{"$f":"IF(INDEX(periode3,NEVAL,Nenfant)=\"A\",\"X\",\"\")","v":{"$error":"#NAME?"}},null,{"$f":"IF(INDEX(periode4,NEVAL,Nenfant)=\"D\",\"X\",\"\")","v":{"$error":"#NAME?"}},{"$f":"IF(INDEX(periode4,NEVAL,Nenfant)=\"C\",\"X\",\"\")","v":{"$error":"#NAME?"}},{"$f":"IF(INDEX(periode4,NEVAL,Nenfant)=\"B\",\"X\",\"\")","v":{"$error":"#NAME?"}},{"$f":"IF(INDEX(periode4,NEVAL,Nenfant)=\"A\",\"X\",\"\")","v":{"$error":"#NAME?"}},null,{"$f":"IF(INDEX(periode5,NEVAL,Nenfant)=\"D\",\"X\",\"\")","v":{"$error":"#NAME?"}},{"$f":"IF(INDEX(periode5,NEVAL,Nenfant)=\"C\",\"X\",\"\")","v":{"$error":"#NAME?"}},{"$f":"IF(INDEX(periode5,NEVAL,Nenfant)=\"B\",\"X\",\"\")","v":{"$error":"#NAME?"}},{"$f":"IF(INDEX(periode5,NEVAL,Nenfant)=\"A\",\"X\",\"\")","v":{"$error":"#NAME?"}},null,{"$f":"IF(INDEX(periode6,NEVAL,Nenfant)=\"D\",\"X\",\"\")","v":{"$error":"#NAME?"}},{"$f":"IF(INDEX(periode6,NEVAL,Nenfant)=\"C\",\"X\",\"\")","v":{"$error":"#NAME?"}},{"$f":"IF(INDEX(periode6,NEVAL,Nenfant)=\"B\",\"X\",\"\")","v":{"$error":"#NAME?"}},{"$f":"IF(INDEX(periode6,NEVAL,Nenfant)=\"A\",\"X\",\"\")","v":{"$error":"#NAME?"}}]
[128,{"$nulls":7},{"$f":"COUNTIF($G129:$G130,\"X\")","v":0},{"$f":"COUNTIF($H129:$H130,\"X\")","v":0},{"$f":"COUNTIF($I129:$I130,\"X\")","v":0},{"$f":"COUNTIF($J129:$J130,\"X\")","v":0},null,{"$f":"COUNTIF($G129:$G130,\"X\")","v":0},{"$f":"COUNTIF($H129:$H130,\"X\")","v":0},{"$f":"COUNTIF($I129:$I130,\"X\")","v":0},{"$f":"COUNTIF($J129:$J130,\"X\")","v":0},null,{"$f":"COUNTIF($G129:$G130,\"X\")","v":0},{"$f":"COUNTIF($H129:$H130,\"X\")","v":0},{"$f":"COUNTIF($I129:$I130,\"X\")","v":0},{"$f":"COUNTIF($J129:$J130,\"X\")","v":0},null,{"$f":"COUNTIF($G129:$G130,\"X\")","v":0},{"$f":"COUNTIF($H129:$H130,\"X\")","v":0},{"$f":"COUNTIF($I129:$I130,\"X\")","v":0},{"$f":"COUNTIF(AA129:AA130,\"X\")","v":0},null,{"$f":"COUNTIF($G129:$G130,\"X\")","v":0},{"$f":"COUNTIF($H129:$H130,\"X\")","v":0},{"$f":"COUNTIF($I129:$I130,\"X\")","v":0},{"$f":"COUNTIF($J129:$J130,\"X\")","v":0},null,{"$f":"COUNTIF($G129:$G130,\"X\")","v":0},{"$f":"COUNTIF($H129:$H130,\"X\")","v":0},{"$f":"COUNTIF($I129:$I130,\"X\")","v":0},{"$f":"COUNTIF($J129:$J130,\"X\")","v":0}]
[129,{"$nulls":7},{"$f":"IF(INDEX(periode1,NEVAL,Nenfant)=\"D\",\"X\",\"\")","v":{"$error":"#NAME?"}},{"$error":"#NAME?"},{"$error":"#NAME?"},{"$error":"#NAME?"},null,{"$f":"IF(INDEX(periode2,NEVAL,Nenfant)=\"D\",\"X\",\"\")","v":{"$error":"#NAME?"}},{"$f":"IF(INDEX(periode2,NEVAL,Nenfant)=\"C\",\"X\",\"\")","v":{"$error":"#NAME?"}},{"$f":"IF(INDEX(periode2,NEVAL,Nenfant)=\"B\",\"X\",\"\")","v":{"$error":"#NAME?"}},{"$f":"IF(INDEX(periode2,NEVAL,Nenfant)=\"A\",\"X\",\"\")","v":{"$error":"#NAME?"}},null,{"$f":"IF(INDEX(periode3,NEVAL,Nenfant)=\"D\",\"X\",\"\")","v":{"$error":"#NAME?"}},{"$f":"IF(INDEX(periode3,NEVAL,Nenfant)=\"C\",\"X\",\"\")","v":{"$error":"#NAME?"}},{"$f":"IF(INDEX(periode3,NEVAL,Nenfant)=\"B\",\"X\",\"\")","v":{"$error":"#NAME?"}},{"$f":"IF(INDEX(periode3,NEVAL,Nenfant)=\"A\",\"X\",\"\")","v":{"$error":"#NAME?"}},null,{"$f":"IF(INDEX(periode4,NEVAL,Nenfant)=\"D\",\"X\",\"\")","v":{"$error":"#NAME?"}},{"$f":"IF(INDEX(periode4,NEVAL,Nenfant)=\"C\",\"X\",\"\")","v":{"$error":"#NAME?"}},{"$f":"IF(INDEX(periode4,NEVAL,Nenfant)=\"B\",\"X\",\"\")","v":{"$error":"#NAME?"}},{"$f":"IF(INDEX(periode4,NEVAL,Nenfant)=\"A\",\"X\",\"\")","v":{"$error":"#NAME?"}},null,{"$f":"IF(INDEX(periode5,NEVAL,Nenfant)=\"D\",\"X\",\"\")","v":{"$error":"#NAME?"}},{"$f":"IF(INDEX(periode5,NEVAL,Nenfant)=\"C\",\"X\",\"\")","v":{"$error":"#NAME?"}},{"$f":"IF(INDEX(periode5,NEVAL,Nenfant)=\"B\",\"X\",\"\")","v":{"$error":"#NAME?"}},{"$f":"IF(INDEX(periode5,NEVAL,Nenfant)=\"A\",\"X\",\"\")","v":{"$error":"#NAME?"}},null,{"$f":"IF(INDEX(periode6,NEVAL,Nenfant)=\"D\",\"X\",\"\")","v":{"$error":"#NAME?"}},{"$f":"IF(INDEX(periode6,NEVAL,Nenfant)=\"C\",\"X\",\"\")","v":{"$error":"#NAME?"}},{"$f":"IF(INDEX(periode6,NEVAL,Nenfant)=\"B\",\"X\",\"\")","v":{"$error":"#NAME?"}},{"$f":"IF(INDEX(periode6,NEVAL,Nenfant)=\"A\",\"X\",\"\")","v":{"$error":"#NAME?"}}]
[130,{"$nulls":7},{"$f":"IF(INDEX(periode1,NEVAL,Nenfant)=\"D\",\"X\",\"\")","v":{"$error":"#NAME?"}},{"$error":"#NAME?"},{"$error":"#NAME?"},{"$error":"#NAME?"},null,{"$f":"IF(INDEX(periode2,NEVAL,Nenfant)=\"D\",\"X\",\"\")","v":{"$error":"#NAME?"}},{"$f":"IF(INDEX(periode2,NEVAL,Nenfant)=\"C\",\"X\",\"\")","v":{"$error":"#NAME?"}},{"$f":"IF(INDEX(periode2,NEVAL,Nenfant)=\"B\",\"X\",\"\")","v":{"$error":"#NAME?"}},{"$f":"IF(INDEX(periode2,NEVAL,Nenfant)=\"A\",\"X\",\"\")","v":{"$error":"#NAME?"}},null,{"$f":"IF(INDEX(periode3,NEVAL,Nenfant)=\"D\",\"X\",\"\")","v":{"$error":"#NAME?"}},{"$f":"IF(INDEX(periode3,NEVAL,Nenfant)=\"C\",\"X\",\"\")","v":{"$error":"#NAME?"}},{"$f":"IF(INDEX(periode3,NEVAL,Nenfant)=\"B\",\"X\",\"\")","v":{"$error":"#NAME?"}},{"$f":"IF(INDEX(periode3,NEVAL,Nenfant)=\"A\",\"X\",\"\")","v":{"$error":"#NAME?"}},null,{"$f":"IF(INDEX(periode4,NEVAL,Nenfant)=\"D\",\"X\",\"\")","v":{"$error":"#NAME?"}},{"$f":"IF(INDEX(periode4,NEVAL,Nenfant)=\"C\",\"X\",\"\")","v":{"$error":"#NAME?"}},{"$f":"IF(INDEX(periode4,NEVAL,Nenfant)=\"B\",\"X\",\"\")","v":{"$error":"#NAME?"}},{"$f":"IF(INDEX(periode4,NEVAL,Nenfant)=\"A\",\"X\",\"\")","v":{"$error":"#NAME?"}},null,{"$f":"IF(INDEX(periode5,NEVAL,Nenfant)=\"D\",\"X\",\"\")","v":{"$error":"#NAME?"}},{"$f":"IF(INDEX(periode5,NEVAL,Nenfant)=\"C\",\"X\",\"\")","v":{"$error":"#NAME?"}},{"$f":"IF(INDEX(periode5,NEVAL,Nenfant)=\"B\",\"X\",\"\")","v":{"$error":"#NAME?"}},{"$f":"IF(INDEX(periode5,NEVAL,Nenfant)=\"A\",\"X\",\"\")","v":{"$error":"#NAME?"}},null,{"$f":"IF(INDEX(periode6,NEVAL,Nenfant)=\"D\",\"X\",\"\")","v":{"$error":"#NAME?"}},{"$f":"IF(INDEX(periode6,NEVAL,Nenfant)=\"C\",\"X\",\"\")","v":{"$error":"#NAME?"}},{"$f":"IF(INDEX(periode6,NEVAL,Nenfant)=\"B\",\"X\",\"\")","v":{"$error":"#NAME?"}},{"$f":"IF(INDEX(periode6,NEVAL,Nenfant)=\"A\",\"X\",\"\")","v":{"$error":"#NAME?"}}]
[131,{"$nulls":7},{"$f":"COUNTIF($G132:$G134,\"X\")","v":0},{"$f":"COUNTIF($H132:$H134,\"X\")","v":0},{"$f":"COUNTIF($I132:$I134,\"X\")","v":0},{"$f":"COUNTIF($J132:$J134,\"X\")","v":0},null,{"$f":"COUNTIF($G132:$G134,\"X\")","v":0},{"$f":"COUNTIF($H132:$H134,\"X\")","v":0},{"$f":"COUNTIF($I132:$I134,\"X\")","v":0},{"$f":"COUNTIF($J132:$J134,\"X\")","v":0},null,{"$f":"COUNTIF($G132:$G134,\"X\")","v":0},{"$f":"COUNTIF($H132:$H134,\"X\")","v":0},{"$f":"COUNTIF($I132:$I134,\"X\")","v":0},{"$f":"COUNTIF($J132:$J134,\"X\")","v":0},null,{"$f":"COUNTIF($G132:$G134,\"X\")","v":0},{"$f":"COUNTIF($H132:$H134,\"X\")","v":0},{"$f":"COUNTIF($I132:$I134,\"X\")","v":0},{"$f":"COUNTIF(AA132:AA134,\"X\")","v":0},null,{"$f":"COUNTIF($G132:$G134,\"X\")","v":0},{"$f":"COUNTIF($H132:$H134,\"X\")","v":0},{"$f":"COUNTIF($I132:$I134,\"X\")","v":0},{"$f":"COUNTIF($J132:$J134,\"X\")","v":0},null,{"$f":"COUNTIF($G132:$G134,\"X\")","v":0},{"$f":"COUNTIF($H132:$H134,\"X\")","v":0},{"$f":"COUNTIF($I132:$I134,\"X\")","v":0},{"$f":"COUNTIF($J132:$J134,\"X\")","v":0}]
[132,{"$nulls":7},{"$f":"IF(INDEX(periode1,NEVAL,Nenfant)=\"D\",\"X\",\"\")","v":{"$error":"#NAME?"}},{"$error":"#NAME?"},{"$error":"#NAME?"},{"$error":"#NAME?"},null,{"$f":"IF(INDEX(periode2,NEVAL,Nenfant)=\"D\",\"X\",\"\")","v":{"$error":"#NAME?"}},{"$f":"IF(INDEX(periode2,NEVAL,Nenfant)=\"C\",\"X\",\"\")","v":{"$error":"#NAME?"}},{"$f":"IF(INDEX(periode2,NEVAL,Nenfant)=\"B\",\"X\",\"\")","v":{"$error":"#NAME?"}},{"$f":"IF(INDEX(periode2,NEVAL,Nenfant)=\"A\",\"X\",\"\")","v":{"$error":"#NAME?"}},null,{"$f":"IF(INDEX(periode3,NEVAL,Nenfant)=\"D\",\"X\",\"\")","v":{"$error":"#NAME?"}},{"$f":"IF(INDEX(periode3,NEVAL,Nenfant)=\"C\",\"X\",\"\")","v":{"$error":"#NAME?"}},{"$f":"IF(INDEX(periode3,NEVAL,Nenfant)=\"B\",\"X\",\"\")","v":{"$error":"#NAME?"}},{"$f":"IF(INDEX(periode3,NEVAL,Nenfant)=\"A\",\"X\",\"\")","v":{"$error":"#NAME?"}},null,{"$f":"IF(INDEX(periode4,NEVAL,Nenfant)=\"D\",\"X\",\"\")","v":{"$error":"#NAME?"}},{"$f":"IF(INDEX(periode4,NEVAL,Nenfant)=\"C\",\"X\",\"\")","v":{"$error":"#NAME?"}},{"$f":"IF(INDEX(periode4,NEVAL,Nenfant)=\"B\",\"X\",\"\")","v":{"$error":"#NAME?"}},{"$f":"IF(INDEX(periode4,NEVAL,Nenfant)=\"A\",\"X\",\"\")","v":{"$error":"#NAME?"}},null,{"$f":"IF(INDEX(periode5,NEVAL,Nenfant)=\"D\",\"X\",\"\")","v":{"$error":"#NAME?"}},{"$f":"IF(INDEX(periode5,NEVAL,Nenfant)=\"C\",\"X\",\"\")","v":{"$error":"#NAME?"}},{"$f":"IF(INDEX(periode5,NEVAL,Nenfant)=\"B\",\"X\",\"\")","v":{"$error":"#NAME?"}},{"$f":"IF(INDEX(periode5,NEVAL,Nenfant)=\"A\",\"X\",\"\")","v":{"$error":"#NAME?"}},null,{"$f":"IF(INDEX(periode6,NEVAL,Nenfant)=\"D\",\"X\",\"\")","v":{"$error":"#NAME?"}},{"$f":"IF(INDEX(periode6,NEVAL,Nenfant)=\"C\",\"X\",\"\")","v":{"$error":"#NAME?"}},{"$f":"IF(INDEX(periode6,NEVAL,Nenfant)=\"B\",\"X\",\"\")","v":{"$error":"#NAME?"}},{"$f":"IF(INDEX(periode6,NEVAL,Nenfant)=\"A\",\"X\",\"\")","v":{"$error":"#NAME?"}}]
[133,{"$nulls":7},{"$f":"IF(INDEX(periode1,NEVAL,Nenfant)=\"D\",\"X\",\"\")","v":{"$error":"#NAME?"}},{"$error":"#NAME?"},{"$error":"#NAME?"},{"$error":"#NAME?"},null,{"$f":"IF(INDEX(periode2,NEVAL,Nenfant)=\"D\",\"X\",\"\")","v":{"$error":"#NAME?"}},{"$f":"IF(INDEX(periode2,NEVAL,Nenfant)=\"C\",\"X\",\"\")","v":{"$error":"#NAME?"}},{"$f":"IF(INDEX(periode2,NEVAL,Nenfant)=\"B\",\"X\",\"\")","v":{"$error":"#NAME?"}},{"$f":"IF(INDEX(periode2,NEVAL,Nenfant)=\"A\",\"X\",\"\")","v":{"$error":"#NAME?"}},null,{"$f":"IF(INDEX(periode3,NEVAL,Nenfant)=\"D\",\"X\",\"\")","v":{"$error":"#NAME?"}},{"$f":"IF(INDEX(periode3,NEVAL,Nenfant)=\"C\",\"X\",\"\")","v":{"$error":"#NAME?"}},{"$f":"IF(INDEX(periode3,NEVAL,Nenfant)=\"B\",\"X\",\"\")","v":{"$error":"#NAME?"}},{"$f":"IF(INDEX(periode3,NEVAL,Nenfant)=\"A\",\"X\",\"\")","v":{"$error":"#NAME?"}},null,{"$f":"IF(INDEX(periode4,NEVAL,Nenfant)=\"D\",\"X\",\"\")","v":{"$error":"#NAME?"}},{"$f":"IF(INDEX(periode4,NEVAL,Nenfant)=\"C\",\"X\",\"\")","v":{"$error":"#NAME?"}},{"$f":"IF(INDEX(periode4,NEVAL,Nenfant)=\"B\",\"X\",\"\")","v":{"$error":"#NAME?"}},{"$f":"IF(INDEX(periode4,NEVAL,Nenfant)=\"A\",\"X\",\"\")","v":{"$error":"#NAME?"}},null,{"$f":"IF(INDEX(periode5,NEVAL,Nenfant)=\"D\",\"X\",\"\")","v":{"$error":"#NAME?"}},{"$f":"IF(INDEX(periode5,NEVAL,Nenfant)=\"C\",\"X\",\"\")","v":{"$error":"#NAME?"}},{"$f":"IF(INDEX(periode5,NEVAL,Nenfant)=\"B\",\"X\",\"\")","v":{"$error":"#NAME?"}},{"$f":"IF(INDEX(periode5,NEVAL,Nenfant)=\"A\",\"X\",\"\")","v":{"$error":"#NAME?"}},null,{"$f":"IF(INDEX(periode6,NEVAL,Nenfant)=\"D\",\"X\",\"\")","v":{"$error":"#NAME?"}},{"$f":"IF(INDEX(periode6,NEVAL,Nenfant)=\"C\",\"X\",\"\")","v":{"$error":"#NAME?"}},{"$f":"IF(INDEX(periode6,NEVAL,Nenfant)=\"B\",\"X\",\"\")","v":{"$error":"#NAME?"}},{"$f":"IF(INDEX(periode6,NEVAL,Nenfant)=\"A\",\"X\",\"\")","v":{"$error":"#NAME?"}}]
[134,{"$nulls":7},{"$f":"IF(INDEX(periode1,NEVAL,Nenfant)=\"D\",\"X\",\"\")","v":{"$error":"#NAME?"}},{"$error":"#NAME?"},{"$error":"#NAME?"},{"$error":"#NAME?"},null,{"$f":"IF(INDEX(periode2,NEVAL,Nenfant)=\"D\",\"X\",\"\")","v":{"$error":"#NAME?"}},{"$f":"IF(INDEX(periode2,NEVAL,Nenfant)=\"C\",\"X\",\"\")","v":{"$error":"#NAME?"}},{"$f":"IF(INDEX(periode2,NEVAL,Nenfant)=\"B\",\"X\",\"\")","v":{"$error":"#NAME?"}},{"$f":"IF(INDEX(periode2,NEVAL,Nenfant)=\"A\",\"X\",\"\")","v":{"$error":"#NAME?"}},null,{"$f":"IF(INDEX(periode3,NEVAL,Nenfant)=\"D\",\"X\",\"\")","v":{"$error":"#NAME?"}},{"$f":"IF(INDEX(periode3,NEVAL,Nenfant)=\"C\",\"X\",\"\")","v":{"$error":"#NAME?"}},{"$f":"IF(INDEX(periode3,NEVAL,Nenfant)=\"B\",\"X\",\"\")","v":{"$error":"#NAME?"}},{"$f":"IF(INDEX(periode3,NEVAL,Nenfant)=\"A\",\"X\",\"\")","v":{"$error":"#NAME?"}},null,{"$f":"IF(INDEX(periode4,NEVAL,Nenfant)=\"D\",\"X\",\"\")","v":{"$error":"#NAME?"}},{"$f":"IF(INDEX(periode4,NEVAL,Nenfant)=\"C\",\"X\",\"\")","v":{"$error":"#NAME?"}},{"$f":"IF(INDEX(periode4,NEVAL,Nenfant)=\"B\",\"X\",\"\")","v":{"$error":"#NAME?"}},{"$f":"IF(INDEX(periode4,NEVAL,Nenfant)=\"A\",\"X\",\"\")","v":{"$error":"#NAME?"}},null,{"$f":"IF(INDEX(periode5,NEVAL,Nenfant)=\"D\",\"X\",\"\")","v":{"$error":"#NAME?"}},{"$f":"IF(INDEX(periode5,NEVAL,Nenfant)=\"C\",\"X\",\"\")","v":{"$error":"#NAME?"}},{"$f":"IF(INDEX(periode5,NEVAL,Nenfant)=\"B\",\"X\",\"\")","v":{"$error":"#NAME?"}},{"$f":"IF(INDEX(periode5,NEVAL,Nenfant)=\"A\",\"X\",\"\")","v":{"$error":"#NAME?"}},null,{"$f":"IF(INDEX(periode6,NEVAL,Nenfant)=\"D\",\"X\",\"\")","v":{"$error":"#NAME?"}},{"$f":"IF(INDEX(periode6,NEVAL,Nenfant)=\"C\",\"X\",\"\")","v":{"$error":"#NAME?"}},{"$f":"IF(INDEX(periode6,NEVAL,Nenfant)=\"B\",\"X\",\"\")","v":{"$error":"#NAME?"}},{"$f":"IF(INDEX(periode6,NEVAL,Nenfant)=\"A\",\"X\",\"\")","v":{"$error":"#NAME?"}}]
[135,{"$nulls":7},{"$f":"COUNTIF($G136:$G137,\"X\")","v":0},{"$f":"COUNTIF($H136:$H137,\"X\")","v":0},{"$f":"COUNTIF($I136:$I137,\"X\")","v":0},{"$f":"COUNTIF($J136:$J137,\"X\")","v":0},null,{"$f":"COUNTIF($G136:$G137,\"X\")","v":0},{"$f":"COUNTIF($H136:$H137,\"X\")","v":0},{"$f":"COUNTIF($I136:$I137,\"X\")","v":0},{"$f":"COUNTIF($J136:$J137,\"X\")","v":0},null,{"$f":"COUNTIF($G136:$G137,\"X\")","v":0},{"$f":"COUNTIF($H136:$H137,\"X\")","v":0},{"$f":"COUNTIF($I136:$I137,\"X\")","v":0},{"$f":"COUNTIF($J136:$J137,\"X\")","v":0},null,{"$f":"COUNTIF($G136:$G137,\"X\")","v":0},{"$f":"COUNTIF($H136:$H137,\"X\")","v":0},{"$f":"COUNTIF($I136:$I137,\"X\")","v":0},{"$f":"COUNTIF(AA136:AA137,\"X\")","v":0},null,{"$f":"COUNTIF($G136:$G137,\"X\")","v":0},{"$f":"COUNTIF($H136:$H137,\"X\")","v":0},{"$f":"COUNTIF($I136:$I137,\"X\")","v":0},{"$f":"COUNTIF($J136:$J137,\"X\")","v":0},null,{"$f":"COUNTIF($G136:$G137,\"X\")","v":0},{"$f":"COUNTIF($H136:$H137,\"X\")","v":0},{"$f":"COUNTIF($I136:$I137,\"X\")","v":0},{"$f":"COUNTIF($J136:$J137,\"X\")","v":0}]
[136,{"$nulls":7},{"$f":"IF(INDEX(periode1,NEVAL,Nenfant)=\"D\",\"X\",\"\")","v":{"$error":"#NAME?"}},{"$error":"#NAME?"},{"$error":"#NAME?"},{"$error":"#NAME?"},null,{"$f":"IF(INDEX(periode2,NEVAL,Nenfant)=\"D\",\"X\",\"\")","v":{"$error":"#NAME?"}},{"$f":"IF(INDEX(periode2,NEVAL,Nenfant)=\"C\",\"X\",\"\")","v":{"$error":"#NAME?"}},{"$f":"IF(INDEX(periode2,NEVAL,Nenfant)=\"B\",\"X\",\"\")","v":{"$error":"#NAME?"}},{"$f":"IF(INDEX(periode2,NEVAL,Nenfant)=\"A\",\"X\",\"\")","v":{"$error":"#NAME?"}},null,{"$f":"IF(INDEX(periode3,NEVAL,Nenfant)=\"D\",\"X\",\"\")","v":{"$error":"#NAME?"}},{"$f":"IF(INDEX(periode3,NEVAL,Nenfant)=\"C\",\"X\",\"\")","v":{"$error":"#NAME?"}},{"$f":"IF(INDEX(periode3,NEVAL,Nenfant)=\"B\",\"X\",\"\")","v":{"$error":"#NAME?"}},{"$f":"IF(INDEX(periode3,NEVAL,Nenfant)=\"A\",\"X\",\"\")","v":{"$error":"#NAME?"}},null,{"$f":"IF(INDEX(periode4,NEVAL,Nenfant)=\"D\",\"X\",\"\")","v":{"$error":"#NAME?"}},{"$f":"IF(INDEX(periode4,NEVAL,Nenfant)=\"C\",\"X\",\"\")","v":{"$error":"#NAME?"}},{"$f":"IF(INDEX(periode4,NEVAL,Nenfant)=\"B\",\"X\",\"\")","v":{"$error":"#NAME?"}},{"$f":"IF(INDEX(periode4,NEVAL,Nenfant)=\"A\",\"X\",\"\")","v":{"$error":"#NAME?"}},null,{"$f":"IF(INDEX(periode5,NEVAL,Nenfant)=\"D\",\"X\",\"\")","v":{"$error":"#NAME?"}},{"$f":"IF(INDEX(periode5,NEVAL,Nenfant)=\"C\",\"X\",\"\")","v":{"$error":"#NAME?"}},{"$f":"IF(INDEX(periode5,NEVAL,Nenfant)=\"B\",\"X\",\"\")","v":{"$error":"#NAME?"}},{"$f":"IF(INDEX(periode5,NEVAL,Nenfant)=\"A\",\"X\",\"\")","v":{"$error":"#NAME?"}},null,{"$f":"IF(INDEX(periode6,NEVAL,Nenfant)=\"D\",\"X\",\"\")","v":{"$error":"#NAME?"}},{"$f":"IF(INDEX(periode6,NEVAL,Nenfant)=\"C\",\"X\",\"\")","v":{"$error":"#NAME?"}},{"$f":"IF(INDEX(periode6,NEVAL,Nenfant)=\"B\",\"X\",\"\")","v":{"$error":"#NAME?"}},{"$f":"IF(INDEX(periode6,NEVAL,Nenfant)=\"A\",\"X\",\"\")","v":{"$error":"#NAME?"}}]
[137,{"$nulls":7},{"$f":"IF(INDEX(periode1,NEVAL,Nenfant)=\"D\",\"X\",\"\")","v":{"$error":"#NAME?"}},{"$error":"#NAME?"},{"$error":"#NAME?"},{"$error":"#NAME?"},null,{"$f":"IF(INDEX(periode2,NEVAL,Nenfant)=\"D\",\"X\",\"\")","v":{"$error":"#NAME?"}},{"$f":"IF(INDEX(periode2,NEVAL,Nenfant)=\"C\",\"X\",\"\")","v":{"$error":"#NAME?"}},{"$f":"IF(INDEX(periode2,NEVAL,Nenfant)=\"B\",\"X\",\"\")","v":{"$error":"#NAME?"}},{"$f":"IF(INDEX(periode2,NEVAL,Nenfant)=\"A\",\"X\",\"\")","v":{"$error":"#NAME?"}},null,{"$f":"IF(INDEX(periode3,NEVAL,Nenfant)=\"D\",\"X\",\"\")","v":{"$error":"#NAME?"}},{"$f":"IF(INDEX(periode3,NEVAL,Nenfant)=\"C\",\"X\",\"\")","v":{"$error":"#NAME?"}},{"$f":"IF(INDEX(periode3,NEVAL,Nenfant)=\"B\",\"X\",\"\")","v":{"$error":"#NAME?"}},{"$f":"IF(INDEX(periode3,NEVAL,Nenfant)=\"A\",\"X\",\"\")","v":{"$error":"#NAME?"}},null,{"$f":"IF(INDEX(periode4,NEVAL,Nenfant)=\"D\",\"X\",\"\")","v":{"$error":"#NAME?"}},{"$f":"IF(INDEX(periode4,NEVAL,Nenfant)=\"C\",\"X\",\"\")","v":{"$error":"#NAME?"}},{"$f":"IF(INDEX(periode4,NEVAL,Nenfant)=\"B\",\"X\",\"\")","v":{"$error":"#NAME?"}},{"$f":"IF(INDEX(periode4,NEVAL,Nenfant)=\"A\",\"X\",\"\")","v":{"$error":"#NAME?"}},null,{"$f":"IF(INDEX(periode5,NEVAL,Nenfant)=\"D\",\"X\",\"\")","v":{"$error":"#NAME?"}},{"$f":"IF(INDEX(periode5,NEVAL,Nenfant)=\"C\",\"X\",\"\")","v":{"$error":"#NAME?"}},{"$f":"IF(INDEX(periode5,NEVAL,Nenfant)=\"B\",\"X\",\"\")","v":{"$error":"#NAME?"}},{"$f":"IF(INDEX(periode5,NEVAL,Nenfant)=\"A\",\"X\",\"\")","v":{"$error":"#NAME?"}},null,{"$f":"IF(INDEX(periode6,NEVAL,Nenfant)=\"D\",\"X\",\"\")","v":{"$error":"#NAME?"}},{"$f":"IF(INDEX(periode6,NEVAL,Nenfant)=\"C\",\"X\",\"\")","v":{"$error":"#NAME?"}},{"$f":"IF(INDEX(periode6,NEVAL,Nenfant)=\"B\",\"X\",\"\")","v":{"$error":"#NAME?"}},{"$f":"IF(INDEX(periode6,NEVAL,Nenfant)=\"A\",\"X\",\"\")","v":{"$error":"#NAME?"}}]
[138,{"$nulls":7},{"$f":"COUNTIF($G139:$G140,\"X\")","v":0},{"$f":"COUNTIF($H139:$H140,\"X\")","v":0},{"$f":"COUNTIF($I139:$I140,\"X\")","v":0},{"$f":"COUNTIF($J139:$J140,\"X\")","v":0},null,{"$f":"COUNTIF($G139:$G140,\"X\")","v":0},{"$f":"COUNTIF($H139:$H140,\"X\")","v":0},{"$f":"COUNTIF($I139:$I140,\"X\")","v":0},{"$f":"COUNTIF($J139:$J140,\"X\")","v":0},null,{"$f":"COUNTIF($G139:$G140,\"X\")","v":0},{"$f":"COUNTIF($H139:$H140,\"X\")","v":0},{"$f":"COUNTIF($I139:$I140,\"X\")","v":0},{"$f":"COUNTIF($J139:$J140,\"X\")","v":0},null,{"$f":"COUNTIF($G139:$G140,\"X\")","v":0},{"$f":"COUNTIF($H139:$H140,\"X\")","v":0},{"$f":"COUNTIF($I139:$I140,\"X\")","v":0},{"$f":"COUNTIF(AA139:AA140,\"X\")","v":0},null,{"$f":"COUNTIF($G139:$G140,\"X\")","v":0},{"$f":"COUNTIF($H139:$H140,\"X\")","v":0},{"$f":"COUNTIF($I139:$I140,\"X\")","v":0},{"$f":"COUNTIF($J139:$J140,\"X\")","v":0},null,{"$f":"COUNTIF($G139:$G140,\"X\")","v":0},{"$f":"COUNTIF($H139:$H140,\"X\")","v":0},{"$f":"COUNTIF($I139:$I140,\"X\")","v":0},{"$f":"COUNTIF($J139:$J140,\"X\")","v":0}]
[139,{"$nulls":7},{"$f":"IF(INDEX(periode1,NEVAL,Nenfant)=\"D\",\"X\",\"\")","v":{"$error":"#NAME?"}},{"$error":"#NAME?"},{"$error":"#NAME?"},{"$error":"#NAME?"},null,{"$f":"IF(INDEX(periode2,NEVAL,Nenfant)=\"D\",\"X\",\"\")","v":{"$error":"#NAME?"}},{"$f":"IF(INDEX(periode2,NEVAL,Nenfant)=\"C\",\"X\",\"\")","v":{"$error":"#NAME?"}},{"$f":"IF(INDEX(periode2,NEVAL,Nenfant)=\"B\",\"X\",\"\")","v":{"$error":"#NAME?"}},{"$f":"IF(INDEX(periode2,NEVAL,Nenfant)=\"A\",\"X\",\"\")","v":{"$error":"#NAME?"}},null,{"$f":"IF(INDEX(periode3,NEVAL,Nenfant)=\"D\",\"X\",\"\")","v":{"$error":"#NAME?"}},{"$f":"IF(INDEX(periode3,NEVAL,Nenfant)=\"C\",\"X\",\"\")","v":{"$error":"#NAME?"}},{"$f":"IF(INDEX(periode3,NEVAL,Nenfant)=\"B\",\"X\",\"\")","v":{"$error":"#NAME?"}},{"$f":"IF(INDEX(periode3,NEVAL,Nenfant)=\"A\",\"X\",\"\")","v":{"$error":"#NAME?"}},null,{"$f":"IF(INDEX(periode4,NEVAL,Nenfant)=\"D\",\"X\",\"\")","v":{"$error":"#NAME?"}},{"$f":"IF(INDEX(periode4,NEVAL,Nenfant)=\"C\",\"X\",\"\")","v":{"$error":"#NAME?"}},{"$f":"IF(INDEX(periode4,NEVAL,Nenfant)=\"B\",\"X\",\"\")","v":{"$error":"#NAME?"}},{"$f":"IF(INDEX(periode4,NEVAL,Nenfant)=\"A\",\"X\",\"\")","v":{"$error":"#NAME?"}},null,{"$f":"IF(INDEX(periode5,NEVAL,Nenfant)=\"D\",\"X\",\"\")","v":{"$error":"#NAME?"}},{"$f":"IF(INDEX(periode5,NEVAL,Nenfant)=\"C\",\"X\",\"\")","v":{"$error":"#NAME?"}},{"$f":"IF(INDEX(periode5,NEVAL,Nenfant)=\"B\",\"X\",\"\")","v":{"$error":"#NAME?"}},{"$f":"IF(INDEX(periode5,NEVAL,Nenfant)=\"A\",\"X\",\"\")","v":{"$error":"#NAME?"}},null,{"$f":"IF(INDEX(periode6,NEVAL,Nenfant)=\"D\",\"X\",\"\")","v":{"$error":"#NAME?"}},{"$f":"IF(INDEX(periode6,NEVAL,Nenfant)=\"C\",\"X\",\"\")","v":{"$error":"#NAME?"}},{"$f":"IF(INDEX(periode6,NEVAL,Nenfant)=\"B\",\"X\",\"\")","v":{"$error":"#NAME?"}},{"$f":"IF(INDEX(periode6,NEVAL,Nenfant)=\"A\",\"X\",\"\")","v":{"$error":"#NAME?"}}]
[140,{"$nulls":7},{"$f":"IF(INDEX(periode1,NEVAL,Nenfant)=\"D\",\"X\",\"\")","v":{"$error":"#NAME?"}},{"$error":"#NAME?"},{"$error":"#NAME?"},{"$error":"#NAME?"},null,{"$f":"IF(INDEX(periode2,NEVAL,Nenfant)=\"D\",\"X\",\"\")","v":{"$error":"#NAME?"}},{"$f":"IF(INDEX(periode2,NEVAL,Nenfant)=\"C\",\"X\",\"\")","v":{"$error":"#NAME?"}},{"$f":"IF(INDEX(periode2,NEVAL,Nenfant)=\"B\",\"X\",\"\")","v":{"$error":"#NAME?"}},{"$f":"IF(INDEX(periode2,NEVAL,Nenfant)=\"A\",\"X\",\"\")","v":{"$error":"#NAME?"}},null,{"$f":"IF(INDEX(periode3,NEVAL,Nenfant)=\"D\",\"X\",\"\")","v":{"$error":"#NAME?"}},{"$f":"IF(INDEX(periode3,NEVAL,Nenfant)=\"C\",\"X\",\"\")","v":{"$error":"#NAME?"}},{"$f":"IF(INDEX(periode3,NEVAL,Nenfant)=\"B\",\"X\",\"\")","v":{"$error":"#NAME?"}},{"$f":"IF(INDEX(periode3,NEVAL,Nenfant)=\"A\",\"X\",\"\")","v":{"$error":"#NAME?"}},null,{"$f":"IF(INDEX(periode4,NEVAL,Nenfant)=\"D\",\"X\",\"\")","v":{"$error":"#NAME?"}},{"$f":"IF(INDEX(periode4,NEVAL,Nenfant)=\"C\",\"X\",\"\")","v":{"$error":"#NAME?"}},{"$f":"IF(INDEX(periode4,NEVAL,Nenfant)=\"B\",\"X\",\"\")","v":{"$error":"#NAME?"}},{"$f":"IF(INDEX(periode4,NEVAL,Nenfant)=\"A\",\"X\",\"\")","v":{"$error":"#NAME?"}},null,{"$f":"IF(INDEX(periode5,NEVAL,Nenfant)=\"D\",\"X\",\"\")","v":{"$error":"#NAME?"}},{"$f":"IF(INDEX(periode5,NEVAL,Nenfant)=\"C\",\"X\",\"\")","v":{"$error":"#NAME?"}},{"$f":"IF(INDEX(periode5,NEVAL,Nenfant)=\"B\",\"X\",\"\")","v":{"$error":"#NAME?"}},{"$f":"IF(INDEX(periode5,NEVAL,Nenfant)=\"A\",\"X\",\"\")","v":{"$error":"#NAME?"}},null,{"$f":"IF(INDEX(periode6,NEVAL,Nenfant)=\"D\",\"X\",\"\")","v":{"$error":"#NAME?"}},{"$f":"IF(INDEX(periode6,NEVAL,Nenfant)=\"C\",\"X\",\"\")","v":{"$error":"#NAME?"}},{"$f":"IF(INDEX(periode6,NEVAL,Nenfant)=\"B\",\"X\",\"\")","v":{"$error":"#NAME?"}},{"$f":"IF(INDEX(periode6,NEVAL,Nenfant)=\"A\",\"X\",\"\")","v":{"$error":"#NAME?"}}]
[141,{"$nulls":7},{"$f":"COUNTIF($G142:$G147,\"X\")","v":0},{"$f":"COUNTIF($H142:$H147,\"X\")","v":0},{"$f":"COUNTIF($I142:$I147,\"X\")","v":0},{"$f":"COUNTIF($J142:$J147,\"X\")","v":0},null,{"$f":"COUNTIF($G142:$G147,\"X\")","v":0},{"$f":"COUNTIF($H142:$H147,\"X\")","v":0},{"$f":"COUNTIF($I142:$I147,\"X\")","v":0},{"$f":"COUNTIF($J142:$J147,\"X\")","v":0},null,{"$f":"COUNTIF($G142:$G147,\"X\")","v":0},{"$f":"COUNTIF($H142:$H147,\"X\")","v":0},{"$f":"COUNTIF($I142:$I147,\"X\")","v":0},{"$f":"COUNTIF($J142:$J147,\"X\")","v":0},null,{"$f":"COUNTIF($G142:$G147,\"X\")","v":0},{"$f":"COUNTIF($H142:$H147,\"X\")","v":0},{"$f":"COUNTIF($I142:$I147,\"X\")","v":0},{"$f":"COUNTIF(AA142:AA147,\"X\")","v":0},null,{"$f":"COUNTIF($G142:$G147,\"X\")","v":0},{"$f":"COUNTIF($H142:$H147,\"X\")","v":0},{"$f":"COUNTIF($I142:$I147,\"X\")","v":0},{"$f":"COUNTIF($J142:$J147,\"X\")","v":0},null,{"$f":"COUNTIF($G142:$G147,\"X\")","v":0},{"$f":"COUNTIF($H142:$H147,\"X\")","v":0},{"$f":"COUNTIF($I142:$I147,\"X\")","v":0},{"$f":"COUNTIF($J142:$J147,\"X\")","v":0}]
[142,{"$nulls":7},{"$f":"IF(INDEX(periode1,NEVAL,Nenfant)=\"D\",\"X\",\"\")","v":{"$error":"#NAME?"}},{"$error":"#NAME?"},{"$error":"#NAME?"},{"$error":"#NAME?"},null,{"$f":"IF(INDEX(periode2,NEVAL,Nenfant)=\"D\",\"X\",\"\")","v":{"$error":"#NAME?"}},{"$f":"IF(INDEX(periode2,NEVAL,Nenfant)=\"C\",\"X\",\"\")","v":{"$error":"#NAME?"}},{"$f":"IF(INDEX(periode2,NEVAL,Nenfant)=\"B\",\"X\",\"\")","v":{"$error":"#NAME?"}},{"$f":"IF(INDEX(periode2,NEVAL,Nenfant)=\"A\",\"X\",\"\")","v":{"$error":"#NAME?"}},null,{"$f":"IF(INDEX(periode3,NEVAL,Nenfant)=\"D\",\"X\",\"\")","v":{"$error":"#NAME?"}},{"$f":"IF(INDEX(periode3,NEVAL,Nenfant)=\"C\",\"X\",\"\")","v":{"$error":"#NAME?"}},{"$f":"IF(INDEX(periode3,NEVAL,Nenfant)=\"B\",\"X\",\"\")","v":{"$error":"#NAME?"}},{"$f":"IF(INDEX(periode3,NEVAL,Nenfant)=\"A\",\"X\",\"\")","v":{"$error":"#NAME?"}},null,{"$f":"IF(INDEX(periode4,NEVAL,Nenfant)=\"D\",\"X\",\"\")","v":{"$error":"#NAME?"}},{"$f":"IF(INDEX(periode4,NEVAL,Nenfant)=\"C\",\"X\",\"\")","v":{"$error":"#NAME?"}},{"$f":"IF(INDEX(periode4,NEVAL,Nenfant)=\"B\",\"X\",\"\")","v":{"$error":"#NAME?"}},{"$f":"IF(INDEX(periode4,NEVAL,Nenfant)=\"A\",\"X\",\"\")","v":{"$error":"#NAME?"}},null,{"$f":"IF(INDEX(periode5,NEVAL,Nenfant)=\"D\",\"X\",\"\")","v":{"$error":"#NAME?"}},{"$f":"IF(INDEX(periode5,NEVAL,Nenfant)=\"C\",\"X\",\"\")","v":{"$error":"#NAME?"}},{"$f":"IF(INDEX(periode5,NEVAL,Nenfant)=\"B\",\"X\",\"\")","v":{"$error":"#NAME?"}},{"$f":"IF(INDEX(periode5,NEVAL,Nenfant)=\"A\",\"X\",\"\")","v":{"$error":"#NAME?"}},null,{"$f":"IF(INDEX(periode6,NEVAL,Nenfant)=\"D\",\"X\",\"\")","v":{"$error":"#NAME?"}},{"$f":"IF(INDEX(periode6,NEVAL,Nenfant)=\"C\",\"X\",\"\")","v":{"$error":"#NAME?"}},{"$f":"IF(INDEX(periode6,NEVAL,Nenfant)=\"B\",\"X\",\"\")","v":{"$error":"#NAME?"}},{"$f":"IF(INDEX(periode6,NEVAL,Nenfant)=\"A\",\"X\",\"\")","v":{"$error":"#NAME?"}}]
[143,{"$nulls":7},{"$error":"#NAME?"},{"$error":"#NAME?"},{"$error":"#NAME?"},{"$error":"#NAME?"},null,{"$error":"#NAME?"},{"$error":"#NAME?"},{"$error":"#NAME?"},{"$error":"#NAME?"},null,{"$f":"IF(INDEX(periode3,NEVAL,Nenfant)=\"D\",\"X\",\"\")","v":{"$error":"#NAME?"}},{"$f":"IF(INDEX(periode3,NEVAL,Nenfant)=\"C\",\"X\",\"\")","v":{"$error":"#NAME?"}},{"$f":"IF(INDEX(periode3,NEVAL,Nenfant)=\"B\",\"X\",\"\")","v":{"$error":"#NAME?"}},{"$f":"IF(INDEX(periode3,NEVAL,Nenfant)=\"A\",\"X\",\"\")","v":{"$error":"#NAME?"}},null,{"$f":"IF(INDEX(periode4,NEVAL,Nenfant)=\"D\",\"X\",\"\")","v":{"$error":"#NAME?"}},{"$f":"IF(INDEX(periode4,NEVAL,Nenfant)=\"C\",\"X\",\"\")","v":{"$error":"#NAME?"}},{"$f":"IF(INDEX(periode4,NEVAL,Nenfant)=\"B\",\"X\",\"\")","v":{"$error":"#NAME?"}},{"$f":"IF(INDEX(periode4,NEVAL,Nenfant)=\"A\",\"X\",\"\")","v":{"$error":"#NAME?"}},null,{"$f":"IF(INDEX(periode5,NEVAL,Nenfant)=\"D\",\"X\",\"\")","v":{"$error":"#NAME?"}},{"$f":"IF(INDEX(periode5,NEVAL,Nenfant)=\"C\",\"X\",\"\")","v":{"$error":"#NAME?"}},{"$f":"IF(INDEX(periode5,NEVAL,Nenfant)=\"B\",\"X\",\"\")","v":{"$error":"#NAME?"}},{"$f":"IF(INDEX(periode5,NEVAL,Nenfant)=\"A\",\"X\",\"\")","v":{"$error":"#NAME?"}},null,{"$error":"#NAME?"},{"$f":"IF(INDEX(periode6,NEVAL,Nenfant)=\"C\",\"X\",\"\")","v":{"$error":"#NAME?"}},{"$f":"IF(INDEX(periode6,NEVAL,Nenfant)=\"B\",\"X\",\"\")","v":{"$error":"#NAME?"}},{"$f":"IF(INDEX(periode6,NEVAL,Nenfant)=\"A\",\"X\",\"\")","v":{"$error":"#NAME?"}}]
[144,{"$nulls":7},{"$error":"#NAME?"},{"$error":"#NAME?"},{"$error":"#NAME?"},{"$error":"#NAME?"},null,{"$error":"#NAME?"},{"$error":"#NAME?"},{"$error":"#NAME?"},{"$error":"#NAME?"},null,{"$f":"IF(INDEX(periode3,NEVAL,Nenfant)=\"D\",\"X\",\"\")","v":{"$error":"#NAME?"}},{"$f":"IF(INDEX(periode3,NEVAL,Nenfant)=\"C\",\"X\",\"\")","v":{"$error":"#NAME?"}},{"$f":"IF(INDEX(periode3,NEVAL,Nenfant)=\"B\",\"X\",\"\")","v":{"$error":"#NAME?"}},{"$f":"IF(INDEX(periode3,NEVAL,Nenfant)=\"A\",\"X\",\"\")","v":{"$error":"#NAME?"}},null,{"$f":"IF(INDEX(periode4,NEVAL,Nenfant)=\"D\",\"X\",\"\")","v":{"$error":"#NAME?"}},{"$f":"IF(INDEX(periode4,NEVAL,Nenfant)=\"C\",\"X\",\"\")","v":{"$error":"#NAME?"}},{"$f":"IF(INDEX(periode4,NEVAL,Nenfant)=\"B\",\"X\",\"\")","v":{"$error":"#NAME?"}},{"$f":"IF(INDEX(periode4,NEVAL,Nenfant)=\"A\",\"X\",\"\")","v":{"$error":"#NAME?"}},null,{"$f":"IF(INDEX(periode5,NEVAL,Nenfant)=\"D\",\"X\",\"\")","v":{"$error":"#NAME?"}},{"$f":"IF(INDEX(periode5,NEVAL,Nenfant)=\"C\",\"X\",\"\")","v":{"$error":"#NAME?"}},{"$f":"IF(INDEX(periode5,NEVAL,Nenfant)=\"B\",\"X\",\"\")","v":{"$error":"#NAME?"}},{"$f":"IF(INDEX(periode5,NEVAL,Nenfant)=\"A\",\"X\",\"\")","v":{"$error":"#NAME?"}},null,{"$error":"#NAME?"},{"$f":"IF(INDEX(periode6,NEVAL,Nenfant)=\"C\",\"X\",\"\")","v":{"$error":"#NAME?"}},{"$f":"IF(INDEX(periode6,NEVAL,Nenfant)=\"B\",\"X\",\"\")","v":{"$error":"#NAME?"}},{"$f":"IF(INDEX(periode6,NEVAL,Nenfant)=\"A\",\"X\",\"\")","v":{"$error":"#NAME?"}}]
[145,{"$nulls":7},{"$error":"#NAME?"},{"$error":"#NAME?"},{"$error":"#NAME?"},{"$error":"#NAME?"},null,{"$error":"#NAME?"},{"$error":"#NAME?"},{"$error":"#NAME?"},{"$error":"#NAME?"},null,{"$f":"IF(INDEX(periode3,NEVAL,Nenfant)=\"D\",\"X\",\"\")","v":{"$error":"#NAME?"}},{"$f":"IF(INDEX(periode3,NEVAL,Nenfant)=\"C\",\"X\",\"\")","v":{"$error":"#NAME?"}},{"$f":"IF(INDEX(periode3,NEVAL,Nenfant)=\"B\",\"X\",\"\")","v":{"$error":"#NAME?"}},{"$f":"IF(INDEX(periode3,NEVAL,Nenfant)=\"A\",\"X\",\"\")","v":{"$error":"#NAME?"}},null,{"$f":"IF(INDEX(periode4,NEVAL,Nenfant)=\"D\",\"X\",\"\")","v":{"$error":"#NAME?"}},{"$f":"IF(INDEX(periode4,NEVAL,Nenfant)=\"C\",\"X\",\"\")","v":{"$error":"#NAME?"}},{"$f":"IF(INDEX(periode4,NEVAL,Nenfant)=\"B\",\"X\",\"\")","v":{"$error":"#NAME?"}},{"$f":"IF(INDEX(periode4,NEVAL,Nenfant)=\"A\",\"X\",\"\")","v":{"$error":"#NAME?"}},null,{"$f":"IF(INDEX(periode5,NEVAL,Nenfant)=\"D\",\"X\",\"\")","v":{"$error":"#NAME?"}},{"$f":"IF(INDEX(periode5,NEVAL,Nenfant)=\"C\",\"X\",\"\")","v":{"$error":"#NAME?"}},{"$f":"IF(INDEX(periode5,NEVAL,Nenfant)=\"B\",\"X\",\"\")","v":{"$error":"#NAME?"}},{"$f":"IF(INDEX(periode5,NEVAL,Nenfant)=\"A\",\"X\",\"\")","v":{"$error":"#NAME?"}},null,{"$error":"#NAME?"},{"$f":"IF(INDEX(periode6,NEVAL,Nenfant)=\"C\",\"X\",\"\")","v":{"$error":"#NAME?"}},{"$f":"IF(INDEX(periode6,NEVAL,Nenfant)=\"B\",\"X\",\"\")","v":{"$error":"#NAME?"}},{"$f":"IF(INDEX(periode6,NEVAL,Nenfant)=\"A\",\"X\",\"\")","v":{"$error":"#NAME?"}}]
[146,{"$nulls":7},{"$error":"#NAME?"},{"$error":"#NAME?"},{"$error":"#NAME?"},{"$error":"#NAME?"},null,{"$error":"#NAME?"},{"$error":"#NAME?"},{"$error":"#NAME?"},{"$error":"#NAME?"},null,{"$f":"IF(INDEX(periode3,NEVAL,Nenfant)=\"D\",\"X\",\"\")","v":{"$error":"#NAME?"}},{"$f":"IF(INDEX(periode3,NEVAL,Nenfant)=\"C\",\"X\",\"\")","v":{"$error":"#NAME?"}},{"$f":"IF(INDEX(periode3,NEVAL,Nenfant)=\"B\",\"X\",\"\")","v":{"$error":"#NAME?"}},{"$f":"IF(INDEX(periode3,NEVAL,Nenfant)=\"A\",\"X\",\"\")","v":{"$error":"#NAME?"}},null,{"$f":"IF(INDEX(periode4,NEVAL,Nenfant)=\"D\",\"X\",\"\")","v":{"$error":"#NAME?"}},{"$f":"IF(INDEX(periode4,NEVAL,Nenfant)=\"C\",\"X\",\"\")","v":{"$error":"#NAME?"}},{"$f":"IF(INDEX(periode4,NEVAL,Nenfant)=\"B\",\"X\",\"\")","v":{"$error":"#NAME?"}},{"$f":"IF(INDEX(periode4,NEVAL,Nenfant)=\"A\",\"X\",\"\")","v":{"$error":"#NAME?"}},null,{"$f":"IF(INDEX(periode5,NEVAL,Nenfant)=\"D\",\"X\",\"\")","v":{"$error":"#NAME?"}},{"$f":"IF(INDEX(periode5,NEVAL,Nenfant)=\"C\",\"X\",\"\")","v":{"$error":"#NAME?"}},{"$f":"IF(INDEX(periode5,NEVAL,Nenfant)=\"B\",\"X\",\"\")","v":{"$error":"#NAME?"}},{"$f":"IF(INDEX(periode5,NEVAL,Nenfant)=\"A\",\"X\",\"\")","v":{"$error":"#NAME?"}},null,{"$error":"#NAME?"},{"$f":"IF(INDEX(periode6,NEVAL,Nenfant)=\"C\",\"X\",\"\")","v":{"$error":"#NAME?"}},{"$f":"IF(INDEX(periode6,NEVAL,Nenfant)=\"B\",\"X\",\"\")","v":{"$error":"#NAME?"}},{"$f":"IF(INDEX(periode6,NEVAL,Nenfant)=\"A\",\"X\",\"\")","v":{"$error":"#NAME?"}}]
[147,{"$nulls":7},{"$error":"#NAME?"},{"$error":"#NAME?"},{"$error":"#NAME?"},{"$error":"#NAME?"},null,{"$error":"#NAME?"},{"$error":"#NAME?"},{"$error":"#NAME?"},{"$error":"#NAME?"},null,{"$f":"IF(INDEX(periode3,NEVAL,Nenfant)=\"D\",\"X\",\"\")","v":{"$error":"#NAME?"}},{"$f":"IF(INDEX(periode3,NEVAL,Nenfant)=\"C\",\"X\",\"\")","v":{"$error":"#NAME?"}},{"$f":"IF(INDEX(periode3,NEVAL,Nenfant)=\"B\",\"X\",\"\")","v":{"$error":"#NAME?"}},{"$f":"IF(INDEX(periode3,NEVAL,Nenfant)=\"A\",\"X\",\"\")","v":{"$error":"#NAME?"}},null,{"$f":"IF(INDEX(periode4,NEVAL,Nenfant)=\"D\",\"X\",\"\")","v":{"$error":"#NAME?"}},{"$f":"IF(INDEX(periode4,NEVAL,Nenfant)=\"C\",\"X\",\"\")","v":{"$error":"#NAME?"}},{"$f":"IF(INDEX(periode4,NEVAL,Nenfant)=\"B\",\"X\",\"\")","v":{"$error":"#NAME?"}},{"$f":"IF(INDEX(periode4,NEVAL,Nenfant)=\"A\",\"X\",\"\")","v":{"$error":"#NAME?"}},null,{"$f":"IF(INDEX(periode5,NEVAL,Nenfant)=\"D\",\"X\",\"\")","v":{"$error":"#NAME?"}},{"$f":"IF(INDEX(periode5,NEVAL,Nenfant)=\"C\",\"X\",\"\")","v":{"$error":"#NAME?"}},{"$f":"IF(INDEX(periode5,NEVAL,Nenfant)=\"B\",\"X\",\"\")","v":{"$error":"#NAME?"}},{"$f":"IF(INDEX(periode5,NEVAL,Nenfant)=\"A\",\"X\",\"\")","v":{"$error":"#NAME?"}},null,{"$error":"#NAME?"},{"$f":"IF(INDEX(periode6,NEVAL,Nenfant)=\"C\",\"X\",\"\")","v":{"$error":"#NAME?"}},{"$f":"IF(INDEX(periode6,NEVAL,Nenfant)=\"B\",\"X\",\"\")","v":{"$error":"#NAME?"}},{"$f":"IF(INDEX(periode6,NEVAL,Nenfant)=\"A\",\"X\",\"\")","v":{"$error":"#NAME?"}}]
[148]
[149]
[150]
[151]
[152]
[153]
[154]
[155]
[156]
[157]
[158]
[159]
[160]
[161]
[162]
[163]
[164]
[165]
[166]
[167]
[168]
[169]
[170]
[171]
[172]
[173]
[174]
[175]
[176]
[177]
[178]
[179]
[180]
[181]
[182]
[183]
[184]
[185]
[186]
[187]
[188]
[189]
[190]
[191]
[192]
[193]
[194]
[195]
[196]
[197]
[198]
[199]
[200]
[201]
[202]
[203]
[204]
[205]
[206]
[207]
[208]
[209]
[210]
[211]
[212]
[213]
[214]
[215]
[216]
[217]
[218]
[219]
[220]
[221]
[222]
[223]
[224]
[225]
[226]
[227]
[228]
[229]
[230]
[231]
[232]
[233]
[234]
[235]
[236]
[237]
[238]
[239]
[240]
[241]
[242]
[243]
[244]
[245]
[246]
[247]
[248]
[249]
[250]
[251]
[252]
[253]
[254]
[255]
[256]
[257]
[258]
[259]
[260]
[261]
[262]
[263]
[264]
[265]
[266]
[267]
[268]
[269]
[270]
[271]
[272]
[273]
[274]
[275]
[276]
[277]
[278]
[279]
[280]
[281]
[282]
[283]
[284]
[285]
[286]
[287]
[288]
[289]
[290]
[291]
[292]
[293]
[294]
[295]
[296]
[297]
[298]
[299]
[300]
[301]
[302]
[303]
[304]
[305]
[306]
[307]
[308]
[309]
[310]
[311]
[312]
[313]
[314]
[315]
[316]
[317]
[318]
[319]
[320]
[321]
[322]
[323]
[324]
[325]
[326]
[327]
[328]
[329]
[330]
[331]
[332]
[333]
[334]
[335]
[336]
[337]
[338]
[339]
[340]
[341]
[342]
[343]
[344]
[345]
[346]
[347]
[348]
[349]
[350]
[351]
[352]
[353]
[354]
[355]
[356]
[357]
[358]
[359]
[360]
[361]
[362]
[363]
[364]
[365]
[366]
[367]
[368]
[369]
[370]
[371]
[372]
[373]
[374]
[375]
[376]
[377]
[378]
[379]
[380]
[381]
[382]
[383]
[384]
[385]
[386]
[387]
[388]
[389]
[390]
[391]
[392]
[393]
[394]
[395]
[396]
[397]
[398]
[399]
[400]
[401]
[402]
[403]
[404]
[405]
[406]
[407]
[408]
[409]
[410]
[411]
[412]
[413]
[414]
[415]
[416]
[417]
[418]
[419]
[420]
[421]
[422]
[423]
[424]
[425]
[426]
[427]
[428]
[429]
[430]
[431]
[432]
[433]
[434]
[435]
[436]
[437]
[438]
[439]
[440]
[441]
[442]
[443]
[444]
[445]
[446]
[447]
[448]
[449]
[450]
[451]
[452]
[453]
[454]
[455]
[456]
[457]
[458]
[459]
[460]
[461]
[462]
[463]
[464]
[465]
[466]
[467]
[468]
[469]
[470]
[471]
[472]
[473]
[474]
[475]
[476]
[477]
[478]
[479]
[480]
[481]
[482]
[483]
[484]
[485]
[486]
[487]
[488]
[489]
[490]
[491]
[492]
[493]
[494]
[495]
[496]
[497]
[498]
[499]
[500]
[501]
[502]
[503]
[504]
[505]
[506]
[507]
[508]
[509]
[510]
[511]
[512]
[513]
[514]
[515]
[516]
[517]
[518]
[519]
[520]
[521]
[522]
[523]
[524]
[525]
[526]
[527]
[528]
[529]
[530]
[531]
[532]
[533]
[534]
[535]
[536]
[537]
[538]
[539]
[540]
[541]
[542]
[543]
[544]
[545]
[546]
[547]
[548]
[549]
[550]
[551]
[552]
[553]
[554]
[555]
[556]
[557]
[558]
[559]
[560]
[561]
[562]
[563]
[564]
[565]
[566]
[567]
[568]
[569]
[570]
[571]
[572]
[573]
[574]
[575]
[576]
[577]
[578]
[579]
[580]
[581]
[582]
[583]
[584]
[585]
[586]
[587]
[588]
[589]
[590]
[591]
[592]
[593]
[594]
[595]
[596]
[597]
[598]
[599]
[600]
[601]
[602]
[603]
[604]
[605]
[606]
[607]
[608]
[609]
[610]
[611]
[612]
[613]
[614]
[615]
[616]
[617]
[618]
[619]
[620]
[621]
[622]
[623]
[624]
[625]
[626]
[627]
[628]
[629]
[630]
[631]
[632]
[633]
[634]
[635]
[636]
[637]
[638]
[639]
[640]
[641]
[642]
[643]
[644]
[645]
[646]
[647]
[648]
[649]
[650]
[651]
[652]
[653]
[654]
[655]
[656]
[657]
[658]
[659]
[660]
[661]
[662]
[663]
[664]
[665]
[666]
[667]
[668]
[669]
[670]
[671]
[672]
[673]
[674]
[675]
[676]
[677]
[678]
[679]
[680]
[681]
[682]
[683]
[684]
[685]
[686]
[687]
[688]
[689]
[690]
[691]
[692]
[693]
[694]
[695]
[696]
[697]
[698]
[699]
[700]
[701]
[702]
[703]
[704]
[705]
[706]
[707]
[708]
[709]
[710]
[711]
[712]
[713]
[714]
[715]
[716]
[717]
[718]
[719]
[720]
[721]
[722]
[723]
[724]
[725]
[726]
[727]
[728]
[729]
[730]
[731]
[732]
[733]
[734]
[735]
[736]
[737]
[738]
[739]
[740]
[741]
[742]
[743]
[744]
[745]
[746]
[747]
[748]
[749]
[750]
[751]
[752]
[753]
[754]
[755]
[756]
[757]
[758]
[759]
[760]
[761]
[762]
[763]
[764]
[765]
[766]
[767]
[768]
[769]
[770]
[771]
[772]
[773]
[774]
[775]
[776]
[777]
[778]
[779]
[780]
[781]
[782]
[783]
[784]
[785]
[786]
[787]
[788]
[789]
[790]
[791]
[792]
[793]
[794]
[795]
[796]
[797]
[798]
[799]
[800]

{"sheet":"Appréciations","index":6,"n_rows":36,"n_cols":16,"rows_kept":36}
[]
[{"$nulls":4},"PERIODE 1","Jours d'absences","PERIODE 2 \n","Jours d'absences","PERIODE 3","Jours d'absences","PERIODE 4\n","Jours d'absences","PERIODE 5\n","Jours d'absences","Décision du conseil des maîtres concernant les passages","Jours d'absences l'année"]
[]
[null,{"$f":"Renseignements!C16","v":"Marc"},{"$f":"Renseignements!D16","v":"Aurèle"},null,"appreciation P1",3,"appréciation P2",4,"appréciation P3",5,"appréciation P4",6,"appréciation P5",7,"Passe en CM2",{"$f":"N4+L4+J4+H4+F4","v":25}]
[null,{"$f":"Renseignements!C17","v":"Jérôme"},{"$f":"Renseignements!D17","v":"Lenoir"},null,"appréciation lenoir P1",null,"appréciation lenoir P2",null,"appréciation lenoir P3",null,"appréciation lenoir P4",null,"appréciation lenoir P5",null,null,{"$f":"N5+L5+J5+H5+F5","v":0}]
[null,{"$f":"Renseignements!C18","v":"Fabien"},{"$f":"Renseignements!D18","v":"Léglise"},{"$nulls":12},0]
[null,{"$f":"Renseignements!C19","v":"Aicha"},{"$f":"Renseignements!D19","v":"Samarahoui"},{"$nulls":12},0]
[null,{"$f":"Renseignements!C20","v":"Karim"},{"$f":"Renseignements!D20","v":"Maha"},{"$nulls":12},0]
[null,{"$f":"Renseignements!C21","v":0},{"$f":"Renseignements!D21","v":0},{"$nulls":12},0]
[null,{"$f":"Renseignements!C22","v":0},{"$f":"Renseignements!D22","v":0},{"$nulls":12},0]
[null,{"$f":"Renseignements!C23","v":0},{"$f":"Renseignements!D23","v":0},{"$nulls":12},0]
[null,{"$f":"Renseignements!C24","v":0},{"$f":"Renseignements!D24","v":0},{"$nulls":12},0]
[null,{"$f":"Renseignements!C25","v":0},{"$f":"Renseignements!D25","v":0},{"$nulls":12},0]
[null,{"$f":"Renseignements!C26","v":0},{"$f":"Renseignements!D26","v":0},{"$nulls":12},0]
[null,{"$f":"Renseignements!C27","v":0},{"$f":"Renseignements!D27","v":0},{"$nulls":12},0]
[null,{"$f":"Renseignements!C28","v":0},{"$f":"Renseignements!D28","v":0},{"$nulls":12},0]
[null,{"$f":"Renseignements!C29","v":0},{"$f":"Renseignements!D29","v":0},{"$nulls":12},0]
[null,{"$f":"Renseignements!C30","v":0},{"$f":"Renseignements!D30","v":0},{"$nulls":12},0]
[null,{"$f":"Renseignements!C31","v":0},{"$f":"Renseignements!D31","v":0},{"$nulls":12},0]
[null,{"$f":"Renseignements!C32","v":0},{"$f":"Renseignements!D32","v":0},{"$nulls":12},0]
[null,{"$f":"Renseignements!C33","v":0},{"$f":"Renseignements!D33","v":0},{"$nulls":12},0]
[null,{"$f":"Renseignements!C34","v":0},{"$f":"Renseignements!D34","v":0},{"$nulls":12},0]
[null,{"$f":"Renseignements!C35","v":0},{"$f":"Renseignements!D35","v":0},{"$nulls":12},0]
[null,{"$f":"Renseignements!C36","v":0},{"$f":"Renseignements!D36","v":0},{"$nulls":12},0]
[null,{"$f":"Renseignements!C37","v":0},{"$f":"Renseignements!D37","v":0},{"$nulls":12},0]
[null,{"$f":"Renseignements!C38","v":0},{"$f":"Renseignements!D38","v":0},{"$nulls":12},0]
[null,{"$f":"Renseignements!C39","v":0},{"$f":"Renseignements!D39","v":0},{"$nulls":12},0]
[null,{"$f":"Renseignements!C40","v":0},{"$f":"Renseignements!D40","v":0},{"$nulls":12},0]
[null,{"$f":"Renseignements!C41","v":0},{"$f":"Renseignements!D41","v":0},{"$nulls":12},0]
[null,{"$f":"Renseignements!C42","v":0},{"$f":"Renseignements!D42","v":0},{"$nulls":12},0]
[null,{"$f":"Renseignements!C43","v":0},{"$f":"Renseignements!D43","v":0},{"$nulls":12},0]
[null,{"$f":"Renseignements!C44","v":0},{"$f":"Renseignements!D44","v":0},{"$nulls":12},0]
[null,{"$f":"Renseignements!C45","v":0},{"$f":"Renseignements!D45","v":0},{"$nulls":12},0]
[null,{"$f":"Renseignements!C46","v":0},{"$f":"Renseignements!D46","v":0},{"$nulls":12},0]
[null,{"$f":"Renseignements!C47","v":0},{"$f":"Renseignements!D47","v":0},{"$nulls":12},0]
[null,{"$f":"Renseignements!C48","v":0},{"$f":"Renseignements!D48","v":0},{"$nulls":12},0]

{"sheet":"Synt","index":7,"n_rows":138,"n_cols":36,"rows_kept":138,"hidden":true,"merged":[[4,1,27,1],[28,1,54,1],[55,1,75,1],[76,1,83,1],[84,1,101,1],[102,1,113,1],[114,1,130,1],[131,1,137,1]]}
[]
[]
[]
[]
[4,"FRANCAIS","LANGAGE ORAL",{"$f":"SUM(D6:D9)/$A5","v":1},{"$f":"SUM(E6:E9)/$A5","v":0.5},0,0,0,0,0,0,0,0,0,0,0,0,0,0,0,0,0,0,0,0,0,0,0,0,0,0,0,0,0,0,0]
[null,null,"Écouter pour comprendre des messages oraux ou des textes lus par un adulte.",1,0.5]
[null,null,"Dire pour être entendu et compris.",1,0.5]
[null,null,"Participer à des échanges dans des situations diversifiées.",1,0.5]
[null,null,"Adopter une distance critique par rapport au langage produit.",1,0.5]
[6,null,"LECTURE ET COMPREHENSION DE l'ECRIT",{"$f":"SUM(D11:D15)/$A10","v":0},{"$f":"SUM(E11:E15)/$A10","v":0},0,0,0,0,0,0,0,0,0,0,0,0,0,0,0,0,0,0,0,0,0,0,0,0,0,0,0,0,0,0,0]
[null,null,"Identifier des mots de manière de plus en plus aisée. "]
[null,null,"Comprendre un texte."]
[null,null,"Pratiquer différentes formes de lecture."]
[null,null,"Lire à voix haute."]
[null,null,"Contrôler sa compréhension."]
[3,null,"ECRITURE",{"$f":"SUM(D17:D19)/$A16","v":0},{"$f":"SUM(E17:E19)/$A16","v":0},0,0,0,0,0,0,0,0,0,0,0,0,0,0,0,0,0,0,0,0,0,0,0,0,0,0,0,0,0,0,0]
[null,null,"Copier de manière experte."]
[null,null,"Rédiger un texte d'une demi page."]
[null,null,"Réviser et améliorer l’écrit qu’on a produit. "]
[8,null,"ETUDE DE LA LANGUE",{"$f":"SUM(D21:D28)/$A20","v":0},{"$f":"SUM(E21:E28)/$A20","v":0},0,0,0,0,0,0,0,0,0,0,0,0,0,0,0,0,0,0,0,0,0,0,0,0,0,0,0,0,0,0,0]
[null,null,"Maitriser les relations entre l’oral et l’écrit."]
[null,null,"Mémoriser et se remémorer l’orthographe de mots fréquents et de mots irréguliers dont le sens est connu."]
[null,null,"Identifier les principaux constituants d’une phrase simple en relation avec sa cohérence sémantique."]
[null,null,"Orthographier les formes verbales les plus fréquentes."]
[null,null,"Raisonner pour résoudre des problèmes orthographiques."]
[null,null,"Comprendre comment se forment les verbes et orthographier les formes verbales les plus fréquentes "]
[null,null,"Identifier des relations entre les mots, entre les mots et leur contexte d’utilisation ; s’en servir pour mieux comprendre."]
[null,null,"Étendre ses connaissances lexicales, mémoriser et réutiliser des mots nouvellement appris."]
[4,"MATHEMATIQUES","NOMBRES ET CALCUL",{"$f":"SUM(D30:D33)/$A29","v":0},{"$f":"SUM(E30:E33)/$A29","v":0},0,0,0,0,0,0,0,0,0,0,0,0,0,0,0,0,0,0,0,0,0,0,0,0,0,0,0,0,0,0,0]
[null,null,"Comprendre et utiliser des nombres entiers pour dénombrer, ordonner, repérer, comparer."]
[null,null,"Nommer, lire, écrire, représenter des nombres entiers."]
[null,null,"Calculer avec des nombres entiers, mentalement ou à la main, de manière exacte ou approchée."]
[null,null,"Contrôler la vraisemblance de ses résultats."]
[3,null,"GRANDEURS ET MESURES",{"$f":"SUM(D35:D37)/$A34","v":0},{"$f":"SUM(E35:E37)/$A34","v":0},0,0,0,0,0,0,0,0,0,0,0,0,0,0,0,0,0,0,0,0,0,0,0,0,0,0,0,0,0,0,0]
[null,null,"Comparer, estimer, mesurer des longueurs, des masses, des contenances, des durées."]
[null,null,"Utiliser le lexique, les unités, les instruments de mesures spécifiques de ces grandeurs."]
[null,null,"Résoudre des problèmes impliquant des longueurs, des masses, des contenances, des durées, des prix."]
[3,null,"ESPACE ET GEOMETRIE",{"$f":"SUM(D39:D41)/$A38","v":0},{"$f":"SUM(E39:E41)/$A38","v":0},0,0,0,0,0,0,0,0,0,0,0,0,0,0,0,0,0,0,0,0,0,0,0,0,0,0,0,0,0,0,0]
[null,null,"Appréhender différents systèmes de représentations (dessins, schémas, arbres de calcul, etc.)."]
[null,null,"Utiliser des nombres pour représenter des quantités ou des grandeurs. "]
[null,null,"Utiliser diverses représentations de solides et de situations spatiales."]
[2,null,"CHERCHER",{"$f":"SUM(D43:D44)/$A42","v":0},{"$f":"SUM(E43:E44)/$A42","v":0},0,0,0,0,0,0,0,0,0,0,0,0,0,0,0,0,0,0,0,0,0,0,0,0,0,0,0,0,0,0,0]
[null,null,"S’engager dans une démarche de résolution de problèmes."]
[null,null,"Tester, essayer plusieurs pistes proposées par soi-même, les autres élèves ou le professeur."]
[3,null,"MODELISER",{"$f":"SUM(D46:D48)/$A45","v":0},{"$f":"SUM(E46:E48)/$A45","v":0},0,0,0,0,0,0,0,0,0,0,0,0,0,0,0,0,0,0,0,0,0,0,0,0,0,0,0,0,0,0,0]
[null,null,"Utiliser des outils mathématiques pour résoudre des problèmes concrets, notamment des problèmes portant sur des grandeurs et leurs mesures."]
[null,null,"Réaliser que certains problèmes relèvent de situations additives, d’autres de situations multiplicatives, de partages ou de groupements."]
[null,null,"Reconnaitre des formes dans des objets réels et les reproduire géométriquement."]
[4,null,"RAISONNER",{"$f":"SUM(D50:D53)/$A49","v":0},{"$f":"SUM(E50:E53)/$A49","v":0},0,0,0,0,0,0,0,0,0,0,0,0,0,0,0,0,0,0,0,0,0,0,0,0,0,0,0,0,0,0,0]
[null,null,"Anticiper le résultat d’une manipulation, d’un calcul, ou d’une mesure."]
[null,null,"Raisonner sur des figures pour les reproduire avec des instruments."]
[null,null,"Tenir compte d’éléments divers (arguments d’autrui, résultats d’une expérience, sources internes ou externes à la classe, etc.) pour modifier son jugement."]
[null,null,"Prendre progressivement conscience de la nécessité et de l’intérêt de justifier ce que l’on affirme."]
[1,null,"COMMUNIQUER",{"$f":"SUM(D55:D55)/$A54","v":0},{"$f":"SUM(E55:E55)/$A54","v":0},0,0,0,0,0,0,0,0,0,0,0,0,0,0,0,0,0,0,0,0,0,0,0,0,0,0,0,0,0,0,0]
[null,null,"Expliciter des démarches, argumenter des raisonnements."]
[1,null,"PRATIQUE LA DEMARCHE SCIENTIFIQUE",{"$f":"SUM(D57)/$A58","v":0},{"$f":"SUM(E57)/$A58","v":0},0,0,0,0,0,0,0,0,0,0,0,0,0,0,0,0,0,0,0,0,0,0,0,0,0,0,0,0,0,0,0]
[null,null,"Pratiquer, avec l’aide des professeurs,une démarche d’investigation : questionnement, observation, expérience, description, raisonnement, conclusion."]
[2,null,"IMAGINER , REALISER",{"$f":"SUM(D59:D60)/$A58","v":0},{"$f":"SUM(E59:E60)/$A58","v":0},0,0,0,0,0,0,0,0,0,0,0,0,0,0,0,0,0,0,0,0,0,0,0,0,0,0,0,0,0,0,0]
[null,null,"Observer des objets simples et des situations d’activités de la vie quotidienne."]
[null,null,"Imaginer et réaliser des objets simples et de petits montages."]
[2,null,"S'APPROPRIER DES OUTILS ET DES METHODES",{"$f":"SUM(D62:D63)/$A61","v":0},{"$f":"SUM(E62:E63)/$A61","v":0},0,0,0,0,0,0,0,0,0,0,0,0,0,0,0,0,0,0,0,0,0,0,0,0,0,0,0,0,0,0,0]
[null,null,"Choisir ou utiliser le matériel adapté pour oberver, mesurer expérimenter"]
[null,null,"Mobiliser les outils numériques"]
[4,null,"PRATIQUER DES LANGAGES",{"$f":"SUM(D65:D65)/$A64","v":0},{"$f":"SUM(E65:E65)/$A64","v":0},0,0,0,0,0,0,0,0,0,0,0,0,0,0,0,0,0,0,0,0,0,0,0,0,0,0,0,0,0,0,0]
[null,null,"Communiquer en français, à l’oral et à l’écrit,."]
[null,null,"Lire et comprendre des textes documentaires illustrés."]
[null,null,"Extraire d’un texte ou d’une ressource documentaire une information qui répond à un besoin, une question."]
[null,null,"Restituer les résultats des observations sous forme orale ou d’écrits variés (notes, listes, dessins, voire tableaux)."]
[2,null,"ADOPTER UN COMPORTEMENT ETHIQUE ET RESPONSABLE",{"$f":"SUM(D70:D71)/$A69","v":0},{"$f":"SUM(E70:E71)/$A69","v":0},0,0,0,0,0,0,0,0,0,0,0,0,0,0,0,0,0,0,0,0,0,0,0,0,0,0,0,0,0,0,0]
[null,null,"Développer un comportement responsable vis-à-vis de l’environnement et de la santé."]
[null,null,"Mettre en pratique les premières notions d’éco gestion de l’environnement par des actions simples, gestion de déchets, du papier, économies d’eau et d’énergie (éclairage, chauffage...)."]
[4,null,"SE SITUER DANS L'ESPACE ET DANS LE TEMPS",{"$f":"SUM(D73:D76)/$A72","v":0},{"$f":"SUM(E73:E76)/$A72","v":0},0,0,0,0,0,0,0,0,0,0,0,0,0,0,0,0,0,0,0,0,0,0,0,0,0,0,0,0,0,0,0]
[null,null,"Se repérer, s’orienter et se situer dans un espace géographique."]
[null,null,"Utiliser et produire des représentations de l’espace."]
[null,null,"Ordonner des évènements."]
[null,null," Mémoriser quelques repères chronologiques."]
[1,"LVE","COMPRENDRE L'ORAL",{"$f":"SUM(D78)/$A77","v":0},{"$f":"SUM(E78)/$A77","v":0},0,0,0,0,0,0,0,0,0,0,0,0,0,0,0,0,0,0,0,0,0,0,0,0,0,0,0,0,0,0,0]
[null,null,"Écouter et comprendre des messages oraux simples relevant de la vie quotidienne, des textes simples lus par le professeur."]
[1,null,"S'EXPRIMER ORALEMENT EN CONTINU",{"$f":"SUM(D80)/$A79","v":0},{"$f":"SUM(E80)/$A79","v":0},0,0,0,0,0,0,0,0,0,0,0,0,0,0,0,0,0,0,0,0,0,0,0,0,0,0,0,0,0,0,0]
[null,null,"En s’appuyant sur un modèle, réciter, se décrire, lire ou raconter."]
[1,null,"PRENDRE PAR A UNE CONVERSATION",{"$f":"SUM(D82)/$A81","v":0},{"$f":"SUM(E82)/$A81","v":0},0,0,0,0,0,0,0,0,0,0,0,0,0,0,0,0,0,0,0,0,0,0,0,0,0,0,0,0,0,0,0]
[null,null,"Participer à des échanges simples pour être entendu et compris.."]
[1,null,"ASPECTS CULTURELS",{"$f":"SUM(D84)/$A83","v":0},{"$f":"SUM(E84)/$A83","v":0},0,0,0,0,0,0,0,0,0,0,0,0,0,0,0,0,0,0,0,0,0,0,0,0,0,0,0,0,0,0,0]
[null,null,"Identifier quelques grands repères culturels de l’environnement quotidien des élèves du même âge dans les pays ou régions étudiés."]
[4,"ARTS PLASTIQUES","EXPERIMENTER, PRODUIRE, CRÉER",{"$f":"SUM(D86:D89)/$A85","v":0},{"$f":"SUM(E86:E89)/$A85","v":0},0,0,0,0,0,0,0,0,0,0,0,0,0,0,0,0,0,0,0,0,0,0,0,0,0,0,0,0,0,0,0]
[null,null,"S’approprier par les sens les éléments du langage plastique : matière, support, couleur… "]
[null,null,"Observer les effets produits par ses gestes, par les outils utilisés."]
[null,null,"Tirer parti de trouvailles fortuites, saisir les effets du hasard."]
[null,null,"Représenter le monde environnant ou donner forme à son imaginaire en explorant la diversité des domaines (dessin, collage, modelage, sculpture, photographie …)."]
[3,null,"METTRE EN OEUVRE UN PROJET ARTISTIQUE",{"$f":"SUM(D91:D93)/$A90","v":0},{"$f":"SUM(E91:E93)/$A90","v":0},0,0,0,0,0,0,0,0,0,0,0,0,0,0,0,0,0,0,0,0,0,0,0,0,0,0,0,0,0,0,0]
[null,null,"Respecter l’espace, les outils et les matériaux partagés."]
[null,null,"Mener à terme une production individuelle dans le cadre d’un projet accompagné par le professeur."]
[null,null,"Montrer sans réticence ses productions et regarder celles des autres."]
[3,null,"S'EXPRIMER, ANALYSER SA PRATIQUE",{"$f":"SUM(D95:D97)/$A94","v":0},{"$f":"SUM(E95:E97)/$A94","v":0},0,0,0,0,0,0,0,0,0,0,0,0,0,0,0,0,0,0,0,0,0,0,0,0,0,0,0,0,0,0,0]
[null,null,"Prendre la parole devant un groupe pour partager ses trouvailles, s’intéresser à celles découvertes dans des œuvres d’art."]
[null,null,"Formuler ses émotions, entendre et respecter celles des autres."]
[null,null,"Repérer les éléments du langage plastique dans une production : couleurs, formes, matières, support… "]
[4,null,"SE REPERER DANS LES DOMAINES LIES AUX ARTS PLASTIQUES",{"$f":"SUM(D99:D102)/$A98","v":0},{"$f":"SUM(E99:E102)/$A98","v":0},0,0,0,0,0,0,0,0,0,0,0,0,0,0,0,0,0,0,0,0,0,0,0,0,0,0,0,0,0,0,0]
[null,null,"Effectuer des choix parmi les images rencontrées, établir un premier lien entre son univers visuel et la culture artistique."]
[null,null,"Exprimer ses émotions lors de la rencontre avec des œuvres d’art, manifester son intérêt pour la rencontre directe avec des œuvres. "]
[null,null,"S’approprier quelques œuvres de domaines et d’époques variés appartenant au patrimoine national et mondial."]
[null,null,"S’ouvrir à la diversité des pratiques et des cultures artistiques."]
[2,"EDUCATION MUSICALE","CHANTER",{"$f":"SUM(D104:D105)/$A103","v":0},{"$f":"SUM(E104:E105)/$A103","v":0},0,0,0,0,0,0,0,0,0,0,0,0,0,0,0,0,0,0,0,0,0,0,0,0,0,0,0,0,0,0,0]
[null,null,"Chanter une mélodie simple avec une intonation juste, chanter une comptine ou un chant par imitation."]
[null,null,"Interpréter un chant avec expressivité."]
[2,null,"ECOUTER, COMPARER",{"$f":"SUM(D107:D107)/$A106","v":0},{"$f":"SUM(E107:E107)/$A106","v":0},0,0,0,0,0,0,0,0,0,0,0,0,0,0,0,0,0,0,0,0,0,0,0,0,0,0,0,0,0,0,0]
[null,null,"Décrire et comparer des éléments sonores. "]
[null,null,"Comparer des musiques et identifier des ressemblances et des différences."]
[2,null,"EXPLORER, IMAGINER",{"$f":"SUM(D110:D111)/$A109","v":0},{"$f":"SUM(E110:E111)/$A109","v":0},0,0,0,0,0,0,0,0,0,0,0,0,0,0,0,0,0,0,0,0,0,0,0,0,0,0,0,0,0,0,0]
[null,null,"Imaginer des représentations graphiques ou corporelles de la musique."]
[null,null,"Inventer une organisation simple à partir de différents éléments sonores. "]
[2,null,"ECHANGER, PARTAGER",{"$f":"SUM(D113:D114)/$A112","v":0},0,0,0,0,0,0,0,0,0,0,0,0,0,0,0,0,0,0,0,0,0,0,0,0,0,0,0,0,0,0,0,0]
[null,null,"Exprimer ses émotions, ses sentiments et ses préférences."]
[null,null,"Écouter et respecter l’avis des autres et l’expression de leur sensibilité."]
[3,"EPS","DEVELOPPER SA MOTRICITE, LE LANGAGE DU CORPS ",{"$f":"SUM(D116:D118)/$A115","v":0},{"$f":"SUM(E116:E118)/$A115","v":0},0,0,0,0,0,0,0,0,0,0,0,0,0,0,0,0,0,0,0,0,0,0,0,0,0,0,0,0,0,0,0]
[null,null,"Prendre conscience des différentes ressources à mobiliser pour agir avec son corps. "]
[null,null,"Adapter sa motricité à des environnements variés."]
[null,null,"S’exprimer par son corps et accepter de se montrer à autrui."]
[2,null,"S’APPROPRIER LES MÉTHODES ET OUTILS POUR APPRENDRE",{"$f":"SUM(D120:D121)/$A119","v":0},{"$f":"SUM(E120:E121)/$A119","v":0},0,0,0,0,0,0,0,0,0,0,0,0,0,0,0,0,0,0,0,0,0,0,0,0,0,0,0,0,0,0,0]
[null,null,"Apprendre par essai-erreur en utilisant les effets de son action."]
[null,null,"Apprendre à planifier son action avant de la réaliser."]
[3,null,"PARTAGER DES RÈGLES, ASSUMER DES RÔLES ",{"$f":"SUM(D123:D125)/$A122","v":0},{"$f":"SUM(E123:E125)/$A122","v":0},0,0,0,0,0,0,0,0,0,0,0,0,0,0,0,0,0,0,0,0,0,0,0,0,0,0,0,0,0,0,0]
[null,null,"Assumer les rôles spécifiques aux différentes APSA (joueur, coach, arbitre, juge, médiateur, organisateur…). "]
[null,null,"Élaborer, respecter et faire respecter règles et règlements."]
[null,null,"Accepter et prendre en considération toutes les différences interindividuelles au sein d’un groupe."]
[2,null,"ENTRETENIR SA SANTÉ ",{"$f":"SUM(D127:D128)/$A126","v":0},{"$f":"SUM(E127:E128)/$A126","v":0},0,0,0,0,0,0,0,0,0,0,0,0,0,0,0,0,0,0,0,0,0,0,0,0,0,0,0,0,0,0,0]
[null,null,"Découvrir les principes d’une bonne hygiène de vie, à des fins de santé et de bien être."]
[null,null,"Ne pas se mettre en danger par un engagement physique dont l’intensité excède ses qualités physiques."]
[2,null,"S’APPROPRIER UNE CULTURE PHYSIQUE SPORTIVE ET ARTISTIQUE ",{"$f":"SUM(D130:D131)/$A129","v":0},{"$f":"SUM(E130:E131)/$A129","v":0},0,0,0,0,0,0,0,0,0,0,0,0,0,0,0,0,0,0,0,0,0,0,0,0,0,0,0,0,0,0,0]
[null,null,"Découvrir la variété des activités et des spectacles sportifs."]
[null,null,"Exprimer des intentions et des émotions par son corps dans un projet artistique individuel ou collectif."]
[6,"EMC","ENSEIGNEMENT CIVIQUE ET MORAL",{"$f":"SUM(D133:D138)/$A132","v":0},{"$f":"SUM(E133:E138)/$A132","v":0},0,0,0,0,0,0,0,0,0,0,0,0,0,0,0,0,0,0,0,0,0,0,0,0,0,0,0,0,0,0,0]
[null,null," Identifier et partager des émotions, des sentiments dans des situations et à propos d'objets diversifiés."]
[null,null,"Se situer et s'exprimer en respectant les codes de la communication orale, les règles de l'échange et le statut de l'interlocuteur."]
[null,null,"Prendre soin de soi et des autres."]
[null,null,"Accepter les différences. "]
[null,null,"Identifier les symboles de la République présents dans l'école. "]
[null,null,"Apprendre à coopérer. "]

{"sheet":"Socle","index":8,"n_rows":26,"n_cols":73,"rows_kept":26,"merged":[[5,33,9,38],[7,3,7,30],[7,40,12,40],[7,41,12,41],[7,42,12,42],[7,43,12,43],[7,44,12,44],[7,45,12,45],[7,46,12,46],[7,47,12,47],[7,48,12,48],[7,49,12,49],[7,50,12,50],[7,51,12,51],[7,52,12,52],[7,53,12,53],[7,54,12,54],[7,55,12,55],[7,56,12,56],[7,57,12,57],[7,58,12,58],[7,59,12,59],[7,60,12,60],[7,61,12,61],[7,62,12,62],[7,63,12,63],[7,64,12,64],[7,65,12,65],[7,66,12,66],[7,67,12,67],[7,68,12,68],[7,69,12,69],[7,70,12,70],[7,71,12,71],[7,72,12,72],[22,3,22,30]]}
[{"$nulls":40},1,{"$f":"AO1+1","v":2},{"$f":"AP1+1","v":3},4,5,6,7,8,9,10,11,12,13,14,15,16,17,18,19,20,21,22,23,24,25,26,27,28,29,30,31,32,33]
[{"$nulls":6},{"$f":"Période!AU1","v":"A"},{"$f":"Période!AU2","v":"B"},{"$f":"Période!AU3","v":"C"},null,{"v":1,"d":"1 "},null,{"v":5,"d":"5 "},{"v":3,"d":"3 "},{"$f":"INDEX(NOMS,nomenfant,1)","v":"Karim  Maha"},{"$nulls":4},{"v":5,"d":"5 "},null,{"v":2,"d":"2 "},null,{"v":1,"d":"1 "}]
[]
[]
[{"$nulls":40},1,{"$f":"AO5+1","v":2},{"$f":"AP5+1","v":3},4,5,6,7,8,9,10,11,12,13,14,15,16,17,18,19,20,21,22,23,24,25,26,27,28,29,30,31,32,33]
[{"$nulls":3},{"$f":"CONCATENATE(\"Ecole  \"&ecole)","v":"Ecole  Léonard de Vinci"},{"$nulls":29}," VALIDER LE SOCLE\n\nQuand vous cliquez sur le bouton ci dessus, les compétences du socle sont calculées, ou mise à jour sur les résultats de l'année. \n\n"]
[{"$nulls":3},{"$f":"CONCATENATE(\"Année scolaire: \"&annee)","v":"Année scolaire: 2016   2017"}]
[{"$nulls":3},"Attestation de maîtrise des connaissances et compétences et de culture\nCYCLE 2",{"$nulls":36},{"$f":"IF(ISBLANK(INDEX(nom,lignenom,1)),\"\",(INDEX(nom,lignenom,1))&\" \" &(INDEX(prénom,lignenom,1)))","v":"Aurèle Prénom"},"Lenoir Marc","Léglise Jérôme","Samarahoui Fabien","Maha Aicha","","","","","","","","","","","","","","","","","","","","","","","","","","","",""]
[]
[{"$nulls":3},{"$f":"O2","v":"Karim  Maha"}]
[]
[{"$nulls":4},1,2,3,4,5,6,7,8,9,10,11,12,13,14,15,16,17,18,19]
[{"$nulls":27},"D","C","B","A"]
[{"$nulls":3},"Langue française à l'oral et à l'écrit",{"$f":"IF(INDEX(synt,5,nomenfant)=\"\",\"\",INDEX(synt,5,nomenfant))","v":{"v":0,"d":"0.00"}},{"$f":"IF(INDEX(synt,10,nomenfant)=\"\",\"\",INDEX(synt,10,nomenfant))","v":{"v":0,"d":"0.00"}},{"$f":"IF(INDEX(synt,16,nomenfant)=\"\",\"\",INDEX(synt,16,nomenfant))","v":{"v":0,"d":"0.00"}},{"$f":"IF(INDEX(synt,20,nomenfant)=\"\",\"\",INDEX(synt,20,nomenfant))","v":{"v":0,"d":"0.00"}},{"$f":"IF(INDEX(synt,77,nomenfant)=\"\",\"\",INDEX(synt,77,nomenfant))","v":{"v":0,"d":"0.00"}},{"$f":"IF(INDEX(synt,79,nomenfant)=\"\",\"\",INDEX(synt,79,nomenfant))","v":{"v":0,"d":"0.00"}},{"$f":"IF(INDEX(synt,81,nomenfant)=\"\",\"\",INDEX(synt,81,nomenfant))","v":{"v":0,"d":"0.00"}},{"$f":"IF(INDEX(synt,83,nomenfant)=\"\",\"\",INDEX(synt,83,nomenfant))","v":{"v":0,"d":"0.00"}},{"$f":"IF(INDEX(synt,85,nomenfant)=\"\",\"\",INDEX(synt,85,nomenfant))","v":{"v":0,"d":"0.00"}},{"$f":"IF(INDEX(synt,94,nomenfant)=\"\",\"\",INDEX(synt,94,nomenfant))","v":{"v":0,"d":"0.00"}},{"$f":"IF(INDEX(synt,98,nomenfant)=\"\",\"\",INDEX(synt,98,nomenfant))","v":{"v":0,"d":"0.00"}},{"$f":"IF(INDEX(synt,103,nomenfant)=\"\",\"\",INDEX(synt,103,nomenfant))","v":{"v":0,"d":"0.00"}},{"$f":"IF(INDEX(synt,106,nomenfant)=\"\",\"\",INDEX(synt,106,nomenfant))","v":{"v":0,"d":"0.00"}},{"$f":"IF(INDEX(synt,109,nomenfant)=\"\",\"\",INDEX(synt,109,nomenfant))","v":{"v":0,"d":"0.00"}},{"$f":"IF(INDEX(synt,112,nomenfant)=\"\",\"\",INDEX(synt,112,nomenfant))","v":{"v":0,"d":"0.00"}},{"$f":"IF(INDEX(synt,115,nomenfant)=\"\",\"\",INDEX(synt,115,nomenfant))","v":{"v":0,"d":"0.00"}},{"$f":"IF(INDEX(synt,54,nomenfant)=\"\",\"\",INDEX(synt,54,nomenfant))","v":{"v":0,"d":"0.00"}},{"$f":"IF(INDEX(synt,38,nomenfant)=\"\",\"\",INDEX(synt,38,nomenfant))","v":{"v":0,"d":"0.00"}},{"$f":"IF(INDEX(synt,45,nomenfant)=\"\",\"\",INDEX(synt,45,nomenfant))","v":{"v":0,"d":"0.00"}},null,{"v":19,"d":"19 "},{"$f":"SUM(E14:W14)/Y14","v":{"v":0,"d":"0.00"}},null,{"$f":"IF(Z14<0.3,\"x\",\"\")","v":"x"},{"$f":"IF(AND($Z14>0.3, $Z14 <0.5),\"x\",\"\")","v":""},{"$f":"IF(AND($Z14>0.5, $Z14 <0.8),\"x\",\"\")","v":""},{"$f":"IF($Z14>0.8,\"x\",\"\")","v":""},null,1,{"$nulls":7},{"v":0.05263157894736842,"d":"5.26%"},{"v":0.02631578947368421,"d":"2.63%"},{"v":0,"d":"0.00%"},{"v":0,"d":"0.00%"},{"v":0,"d":"0.00%"}]
[{"$nulls":3},"Langage mathématiques, scientifique et informatiques",{"$f":"IF(INDEX(synt,42,nomenfant)=\"\",\"\",INDEX(synt,42,nomenfant))","v":{"v":0,"d":"0.00"}},{"$f":"IF(INDEX(synt,45,nomenfant)=\"\",\"\",INDEX(synt,45,nomenfant))","v":{"v":0,"d":"0.00"}},{"$f":"IF(INDEX(synt,38,nomenfant)=\"\",\"\",INDEX(synt,38,nomenfant))","v":{"v":0,"d":"0.00"}},{"$f":"IF(INDEX(synt,49,nomenfant)=\"\",\"\",INDEX(synt,49,nomenfant))","v":{"v":0,"d":"0.00"}},{"$f":"IF(INDEX(synt,29,nomenfant)=\"\",\"\",INDEX(synt,29,nomenfant))","v":{"v":0,"d":"0.00"}},{"$f":"IF(INDEX(synt,54,nomenfant)=\"\",\"\",INDEX(synt,54,nomenfant))","v":{"v":0,"d":"0.00"}},{"$nulls":14},{"v":6,"d":"6 "},{"$f":"SUM(E15:W15)/Y15","v":{"v":0,"d":"0.00"}},null,{"$f":"IF(Z15<0.3,\"x\",\"\")","v":"x"},{"$f":"IF(AND($Z15>0.3, $Z15 <0.5),\"x\",\"\")","v":""},{"$f":"IF(AND($Z15>0.5, $Z15 <0.8),\"x\",\"\")","v":""},{"$f":"IF($Z15>0.8,\"x\",\"\")","v":""},null,1,{"$nulls":7},{"v":0,"d":"0.00%"},{"v":0,"d":"0.00%"},{"v":0,"d":"0.00%"},{"v":0,"d":"0.00%"},{"v":0,"d":"0.00%"}]
[{"$nulls":3},"Représentation du monde et activité humaine ",{"$f":"IF(INDEX(synt,83,nomenfant)=\"\",\"\",INDEX(synt,83,nomenfant))","v":{"v":0,"d":"0.00"}},{"$f":"IF(INDEX(synt,85,nomenfant)=\"\",\"\",INDEX(synt,85,nomenfant))","v":{"v":0,"d":"0.00"}},{"$f":"IF(INDEX(synt,90,nomenfant)=\"\",\"\",INDEX(synt,90,nomenfant))","v":{"v":0,"d":"0.00"}},{"$f":"IF(INDEX(synt,49,nomenfant)=\"\",\"\",INDEX(synt,49,nomenfant))","v":{"v":0,"d":"0.00"}},{"$f":"IF(INDEX(synt,103,nomenfant)=\"\",\"\",INDEX(synt,103,nomenfant))","v":{"v":0,"d":"0.00"}},{"$f":"IF(INDEX(synt,106,nomenfant)=\"\",\"\",INDEX(synt,106,nomenfant))","v":{"v":0,"d":"0.00"}},{"$f":"IF(INDEX(synt,109,nomenfant)=\"\",\"\",INDEX(synt,109,nomenfant))","v":{"v":0,"d":"0.00"}},{"$f":"IF(INDEX(synt,112,nomenfant)=\"\",\"\",INDEX(synt,112,nomenfant))","v":{"v":0,"d":"0.00"}},{"$f":"IF(INDEX(synt,129,nomenfant)=\"\",\"\",INDEX(synt,129,nomenfant))","v":{"v":0,"d":"0.00"}},{"$f":"IF(INDEX(synt,58,nomenfant)=\"\",\"\",INDEX(synt,58,nomenfant))","v":{"v":0,"d":"0.00"}},{"$f":"IF(INDEX(synt,69,nomenfant)=\"\",\"\",INDEX(synt,69,nomenfant))","v":{"v":0,"d":"0.00"}},{"$f":"IF(INDEX(synt,72,nomenfant)=\"\",\"\",INDEX(synt,72,nomenfant))","v":{"v":0,"d":"0.00"}},{"$f":"IF(INDEX(synt,38,nomenfant)=\"\",\"\",INDEX(synt,38,nomenfant))","v":{"v":0,"d":"0.00"}},{"$nulls":7},{"v":13,"d":"13 "},{"v":0,"d":"0.00"},null,"x","","","",null,1,{"$nulls":7},{"v":0,"d":"0.00%"},{"v":0,"d":"0.00%"},{"v":0,"d":"0.00%"},{"v":0,"d":"0.00%"},{"v":0,"d":"0.00%"}]
[{"$nulls":3},"Langue étrangère et régionale",{"$f":"IF(INDEX(synt,77,nomenfant)=\"\",\"\",INDEX(synt,77,nomenfant))","v":{"v":0,"d":"0.00"}},{"$f":"IF(INDEX(synt,79,nomenfant)=\"\",\"\",INDEX(synt,79,nomenfant))","v":{"v":0,"d":"0.00"}},{"$f":"IF(INDEX(synt,81,nomenfant)=\"\",\"\",INDEX(synt,81,nomenfant))","v":{"v":0,"d":"0.00"}},{"$f":"IF(INDEX(synt,83,nomenfant)=\"\",\"\",INDEX(synt,83,nomenfant))","v":{"v":0,"d":"0.00"}},{"$nulls":16},{"v":4,"d":"4 "},{"v":0,"d":"0.00"},null,"x","","","",null,3,{"$nulls":7},{"v":0,"d":"0.00%"},{"v":0,"d":"0.00%"},{"v":0,"d":"0.00%"},{"v":0,"d":"0.00%"},{"v":0,"d":"0.00%"}]
[{"$nulls":3},"Les systèmes naturels et les systèmes techniques ",{"$f":"IF(INDEX(synt,85,nomenfant)=\"\",\"\",INDEX(synt,85,nomenfant))","v":{"v":0,"d":"0.00"}},{"$f":"IF(INDEX(synt,103,nomenfant)=\"\",\"\",INDEX(synt,103,nomenfant))","v":{"v":0,"d":"0.00"}},{"$f":"IF(INDEX(synt,106,nomenfant)=\"\",\"\",INDEX(synt,106,nomenfant))","v":{"v":0,"d":"0.00"}},{"$f":"IF(INDEX(synt,122,nomenfant)=\"\",\"\",INDEX(synt,122,nomenfant))","v":{"v":0,"d":"0.00"}},{"$f":"IF(INDEX(synt,126,nomenfant)=\"\",\"\",INDEX(synt,126,nomenfant))","v":{"v":0,"d":"0.00"}},{"$f":"IF(INDEX(synt,56,nomenfant)=\"\",\"\",INDEX(synt,56,nomenfant))","v":{"v":0,"d":"0.00"}},{"$f":"IF(INDEX(synt,29,nomenfant)=\"\",\"\",INDEX(synt,29,nomenfant))","v":{"v":0,"d":"0.00"}},{"$f":"IF(INDEX(synt,49,nomenfant)=\"\",\"\",INDEX(synt,49,nomenfant))","v":{"v":0,"d":"0.00"}},{"$f":"IF(INDEX(synt,45,nomenfant)=\"\",\"\",INDEX(synt,45,nomenfant))","v":{"v":0,"d":"0.00"}},{"$f":"IF(INDEX(synt,42,nomenfant)=\"\",\"\",INDEX(synt,42,nomenfant))","v":{"v":0,"d":"0.00"}},{"$nulls":10},{"v":10,"d":"10 "},{"v":0,"d":"0.00"},null,"x","","","",null,3,{"$nulls":7},{"v":0,"d":"0.00%"},{"v":0,"d":"0.00%"},{"v":0,"d":"0.00%"},{"v":0,"d":"0.00%"},{"v":0,"d":"0.00%"}]
[{"$nulls":3},"Langage des arts et du corps ",{"$f":"IF(INDEX(synt,85,nomenfant)=\"\",\"\",INDEX(synt,85,nomenfant))","v":{"v":0,"d":"0.00"}},{"$f":"IF(INDEX(synt,90,nomenfant)=\"\",\"\",INDEX(synt,90,nomenfant))","v":{"v":0,"d":"0.00"}},{"$f":"IF(INDEX(synt,94,nomenfant)=\"\",\"\",INDEX(synt,94,nomenfant))","v":{"v":0,"d":"0.00"}},{"$f":"IF(INDEX(synt,98,nomenfant)=\"\",\"\",INDEX(synt,98,nomenfant))","v":{"v":0,"d":"0.00"}},{"$f":"IF(INDEX(synt,103,nomenfant)=\"\",\"\",INDEX(synt,103,nomenfant))","v":{"v":0,"d":"0.00"}},{"$f":"IF(INDEX(synt,106,nomenfant)=\"\",\"\",INDEX(synt,106,nomenfant))","v":{"v":0,"d":"0.00"}},{"v":0,"d":"0.00"},{"v":1,"d":"1.00"},{"$nulls":12},{"v":8,"d":"8 "},{"v":0.125,"d":"0.13"},null,"x","","","",{"$nulls":9},{"v":0.125,"d":"12.50%"},{"v":0.125,"d":"12.50%"},{"v":0.125,"d":"12.50%"},{"v":0.125,"d":"12.50%"},{"v":0.125,"d":"12.50%"}]
[{"$nulls":3},"Formation de la personne et du citoyen ",{"$f":"IF(INDEX(synt,5,nomenfant)=\"\",\"\",INDEX(synt,5,nomenfant))","v":{"v":0,"d":"0.00"}},{"$f":"IF(INDEX(synt,10,nomenfant)=\"\",\"\",INDEX(synt,10,nomenfant))","v":{"v":0,"d":"0.00"}},{"$f":"IF(INDEX(synt,81,nomenfant)=\"\",\"\",INDEX(synt,81,nomenfant))","v":{"v":0,"d":"0.00"}},{"$f":"IF(INDEX(synt,83,nomenfant)=\"\",\"\",INDEX(synt,83,nomenfant))","v":{"v":0,"d":"0.00"}},{"$f":"IF(INDEX(synt,90,nomenfant)=\"\",\"\",INDEX(synt,90,nomenfant))","v":{"v":0,"d":"0.00"}},{"$f":"IF(INDEX(synt,94,nomenfant)=\"\",\"\",INDEX(synt,94,nomenfant))","v":{"v":0,"d":"0.00"}},{"$f":"IF(INDEX(synt,98,nomenfant)=\"\",\"\",INDEX(synt,98,nomenfant))","v":{"v":0,"d":"0.00"}},{"$f":"IF(INDEX(synt,109,nomenfant)=\"\",\"\",INDEX(synt,109,nomenfant))","v":{"v":0,"d":"0.00"}},{"$f":"IF(INDEX(synt,112,nomenfant)=\"\",\"\",INDEX(synt,112,nomenfant))","v":{"v":0,"d":"0.00"}},{"$f":"IF(INDEX(synt,122,nomenfant)=\"\",\"\",INDEX(synt,122,nomenfant))","v":{"v":0,"d":"0.00"}},{"$f":"IF(INDEX(synt,69,nomenfant)=\"\",\"\",INDEX(synt,69,nomenfant))","v":{"v":0,"d":"0.00"}},{"$f":"IF(INDEX(synt,54,nomenfant)=\"\",\"\",INDEX(synt,54,nomenfant))","v":{"v":0,"d":"0.00"}},{"$f":"IF(INDEX(synt,49,nomenfant)=\"\",\"\",INDEX(synt,49,nomenfant))","v":{"v":0,"d":"0.00"}},{"$nulls":7},{"v":13,"d":"13 "},{"v":0,"d":"0.00"},null,"x","","","",null,3,{"$nulls":7},{"v":0.07692307692307693,"d":"7.69%"},{"v":0.038461538461538464,"d":"3.85%"},{"v":0,"d":"0.00%"},{"v":0,"d":"0.00%"},{"v":0,"d":"0.00%"}]
[{"$nulls":3},"Méthodes et outils pour apprendre ",{"$f":"IF(INDEX(synt,5,nomenfant)=\"\",\"\",INDEX(synt,5,nomenfant))","v":{"v":0,"d":"0.00"}},{"$f":"IF(INDEX(synt,20,nomenfant)=\"\",\"\",INDEX(synt,20,nomenfant))","v":{"v":0,"d":"0.00"}},{"$f":"IF(INDEX(synt,77,nomenfant)=\"\",\"\",INDEX(synt,77,nomenfant))","v":{"v":0,"d":"0.00"}},{"$f":"IF(INDEX(synt,79,nomenfant)=\"\",\"\",INDEX(synt,79,nomenfant))","v":{"v":0,"d":"0.00"}},{"$f":"IF(INDEX(synt,81,nomenfant)=\"\",\"\",INDEX(synt,81,nomenfant))","v":{"v":0,"d":"0.00"}},{"$f":"IF(INDEX(synt,83,nomenfant)=\"\",\"\",INDEX(synt,83,nomenfant))","v":{"v":0,"d":"0.00"}},{"$f":"IF(INDEX(synt,85,nomenfant)=\"\",\"\",INDEX(synt,85,nomenfant))","v":{"v":0,"d":"0.00"}},{"$f":"IF(INDEX(synt,90,nomenfant)=\"\",\"\",INDEX(synt,90,nomenfant))","v":{"v":0,"d":"0.00"}},{"$f":"IF(INDEX(synt,119,nomenfant)=\"\",\"\",INDEX(synt,119,nomenfant))","v":{"v":0,"d":"0.00"}},{"$f":"IF(INDEX(synt,61,nomenfant)=\"\",\"\",INDEX(synt,61,nomenfant))","v":{"v":0,"d":"0.00"}},{"$f":"IF(INDEX(synt,49,nomenfant)=\"\",\"\",INDEX(synt,49,nomenfant))","v":{"v":0,"d":"0.00"}},{"$f":"IF(INDEX(synt,45,nomenfant)=\"\",\"\",INDEX(synt,45,nomenfant))","v":{"v":0,"d":"0.00"}},{"$f":"IF(INDEX(synt,42,nomenfant)=\"\",\"\",INDEX(synt,42,nomenfant))","v":{"v":0,"d":"0.00"}},{"$nulls":7},{"v":13,"d":"13 "},{"v":0,"d":"0.00"},null,"x","","","",null,3,{"$nulls":7},{"v":0.07692307692307693,"d":"7.69%"},{"v":0.038461538461538464,"d":"3.85%"},{"v":0,"d":"0.00%"},{"v":0,"d":"0.00%"},{"v":0,"d":"0.00%"}]
[]
[{"$nulls":3},"A :  Très bonne maîtrise\nB: Maîtrise satisfaisante\nC:            Maîtrise fragile\nD:  Maîtrise insuffisante"]
[]
[{"$nulls":3},"Signature:",{"$nulls":28},3]
[{"$nulls":32},3]

{"sheet":"Bulletin","index":9,"n_rows":236,"n_cols":12,"rows_kept":236,"merged":[[7,3,7,4],[8,3,8,4],[9,3,9,4],[9,6,12,6],[9,7,12,7],[9,8,12,8],[9,9,12,9],[10,3,10,5],[11,2,12,2],[11,3,11,5],[13,2,36,2],[37,2,63,2],[64,2,84,2],[64,13,84,13],[85,2,92,2],[85,13,92,13],[93,2,110,2],[93,13,110,13],[111,2,122,2],[111,13,122,13],[123,2,139,2],[123,13,139,13],[140,2,146,2],[140,13,146,13],[149,3,149,4],[151,3,151,4],[153,3,153,4],[153,6,153,9],[154,3,154,4],[154,6,154,9],[155,3,155,4],[156,3,156,4]]}
[{"$nulls":10},2,2]
[]
[]
[]
[]
[{"$nulls":3},{"$f":"CONCATENATE(\"Classe \"&classe)","v":"Classe CE1"},{"$f":"CONCATENATE(\"Circonscription  \"&IEN)","v":"Circonscription  Firenza "}]
[{"$nulls":3},{"$f":"CONCATENATE(\"Ecole \"&ecole&\" \"  &\"- \" &adresse &\" -   \" &ville)","v":"Ecole Léonard de Vinci -  -   Sienna"},{"$f":"CONCATENATE(\"Enseignant : \"&enseignant)","v":"Enseignant : M. DURANT"}]
[{"$nulls":3},{"$f":"IF(INDEX(NOMS,Nenfant,1)=\"\",0,INDEX(NOMS,Nenfant,1))","v":"Jérôme  Lenoir"}]
[{"$nulls":3},{"$f":"IF(J9=\"\",\"\",\"né(e)  le  \" & TEXT(J9,\"jj/mm/aaa\"))","v":"né(e)  le  04/07/1998"},{"$nulls":5},{"$f":"IF(INDEX(date,Nenfant,1)=\"\",0,INDEX(date,Nenfant,1))","v":35980}]
[{"$nulls":3},"SUIVI DES ACQUIS SCOLAIRES  PERIODE 1 ",null,null,"Non atteint","Partiellement atteint","Atteint","Dépassé"]
[]
[{"$nulls":3},{"$f":"CONCATENATE(\"Année scolaire: \"&annee)","v":"Année scolaire: 2016   2017"}]
[{"$nulls":3},"COMPETENCES EVALUEES","DETAIL DE LA COMPETENCE"]
[5,null,"FRANCAIS","LANGAGE ORAL",null,null,{"$f":"COUNTIF(G15:G18,\"X\")","v":0},{"$f":"COUNTIF(H15:H18,\"X\")","v":0},{"$f":"COUNTIF(I15:I18,\"X\")","v":0},{"$f":"COUNTIF(J15:J18,\"X\")","v":0},{"$f":"IF(COUNTIF(G14:J14,\">0\"),\"X\",\"\")","v":""}]
[6,null,null,"Écouter pour comprendre des messages oraux ou des textes lus par un adulte.",null,null,{"$f":"IF(INDEX(periode1,NEVAL,Nenfant)=\"D\",\"X\",\"\")","v":{"$error":"#NAME?"}},{"$f":"IF(INDEX(periode1,NEVAL,Nenfant)=\"C\",\"X\",\"\")","v":{"$error":"#NAME?"}},{"$f":"IF(INDEX(periode1,NEVAL,Nenfant)=\"B\",\"X\",\"\")","v":{"$error":"#NAME?"}},{"$f":"IF(INDEX(periode1,NEVAL,Nenfant)=\"A\",\"X\",\"\")","v":{"$error":"#NAME?"}},{"$f":"IF(COUNTIF(G15:J15,\"X\"),\"X\",\"\")","v":""}]
[7,null,null,"Dire pour être entendu et compris.",null,null,{"$f":"IF(INDEX(periode1,NEVAL,Nenfant)=\"D\",\"X\",\"\")","v":{"$error":"#NAME?"}},{"$f":"IF(INDEX(periode1,NEVAL,Nenfant)=\"C\",\"X\",\"\")","v":{"$error":"#NAME?"}},{"$f":"IF(INDEX(periode1,NEVAL,Nenfant)=\"B\",\"X\",\"\")","v":{"$error":"#NAME?"}},{"$f":"IF(INDEX(periode1,NEVAL,Nenfant)=\"A\",\"X\",\"\")","v":{"$error":"#NAME?"}},""]
[8,null,null,"Participer à des échanges dans des situations diversifiées.",null,null,{"$f":"IF(INDEX(periode1,NEVAL,Nenfant)=\"D\",\"X\",\"\")","v":{"$error":"#NAME?"}},{"$f":"IF(INDEX(periode1,NEVAL,Nenfant)=\"C\",\"X\",\"\")","v":{"$error":"#NAME?"}},{"$f":"IF(INDEX(periode1,NEVAL,Nenfant)=\"B\",\"X\",\"\")","v":{"$error":"#NAME?"}},{"$f":"IF(INDEX(periode1,NEVAL,Nenfant)=\"A\",\"X\",\"\")","v":{"$error":"#NAME?"}},""]
[9,null,null,"Adopter une distance critique par rapport au langage produit.",null,null,{"$f":"IF(INDEX(periode1,NEVAL,Nenfant)=\"D\",\"X\",\"\")","v":{"$error":"#NAME?"}},{"$f":"IF(INDEX(periode1,NEVAL,Nenfant)=\"C\",\"X\",\"\")","v":{"$error":"#NAME?"}},{"$f":"IF(INDEX(periode1,NEVAL,Nenfant)=\"B\",\"X\",\"\")","v":{"$error":"#NAME?"}},{"$f":"IF(INDEX(periode1,NEVAL,Nenfant)=\"A\",\"X\",\"\")","v":{"$error":"#NAME?"}},""]
[10,null,null,"LECTURE ET COMPREHENSION DE l'ECRIT",null,null,{"$f":"COUNTIF(G20:G24,\"X\")","v":0},{"$f":"COUNTIF(H20:H24,\"X\")","v":0},{"$f":"COUNTIF(I20:I24,\"X\")","v":0},{"$f":"COUNTIF(J20:J24,\"X\")","v":0},{"$f":"IF(COUNTIF(G19:J19,\">0\"),\"X\",\"\")","v":""}]
[11,null,null,"Identifier des mots de manière de plus en plus aisée. ",null,null,{"$f":"IF(INDEX(periode1,NEVAL,Nenfant)=\"D\",\"X\",\"\")","v":{"$error":"#NAME?"}},{"$f":"IF(INDEX(periode1,NEVAL,Nenfant)=\"C\",\"X\",\"\")","v":{"$error":"#NAME?"}},{"$f":"IF(INDEX(periode1,NEVAL,Nenfant)=\"B\",\"X\",\"\")","v":{"$error":"#NAME?"}},{"$f":"IF(INDEX(periode1,NEVAL,Nenfant)=\"A\",\"X\",\"\")","v":{"$error":"#NAME?"}},""]
[12,null,null,"Comprendre un texte.",null,null,{"$f":"IF(INDEX(periode1,NEVAL,Nenfant)=\"D\",\"X\",\"\")","v":{"$error":"#NAME?"}},{"$f":"IF(INDEX(periode1,NEVAL,Nenfant)=\"C\",\"X\",\"\")","v":{"$error":"#NAME?"}},{"$f":"IF(INDEX(periode1,NEVAL,Nenfant)=\"B\",\"X\",\"\")","v":{"$error":"#NAME?"}},{"$f":"IF(INDEX(periode1,NEVAL,Nenfant)=\"A\",\"X\",\"\")","v":{"$error":"#NAME?"}},""]
[13,null,null,"Pratiquer différentes formes de lecture.",null,null,{"$f":"IF(INDEX(periode1,NEVAL,Nenfant)=\"D\",\"X\",\"\")","v":{"$error":"#NAME?"}},{"$f":"IF(INDEX(periode1,NEVAL,Nenfant)=\"C\",\"X\",\"\")","v":{"$error":"#NAME?"}},{"$f":"IF(INDEX(periode1,NEVAL,Nenfant)=\"B\",\"X\",\"\")","v":{"$error":"#NAME?"}},{"$f":"IF(INDEX(periode1,NEVAL,Nenfant)=\"A\",\"X\",\"\")","v":{"$error":"#NAME?"}},""]
[14,null,null,"Lire à voix haute.",null,null,{"$f":"IF(INDEX(periode1,NEVAL,Nenfant)=\"D\",\"X\",\"\")","v":{"$error":"#NAME?"}},{"$f":"IF(INDEX(periode1,NEVAL,Nenfant)=\"C\",\"X\",\"\")","v":{"$error":"#NAME?"}},{"$f":"IF(INDEX(periode1,NEVAL,Nenfant)=\"B\",\"X\",\"\")","v":{"$error":"#NAME?"}},{"$f":"IF(INDEX(periode1,NEVAL,Nenfant)=\"A\",\"X\",\"\")","v":{"$error":"#NAME?"}},""]
[15,null,null,"Contrôler sa compréhension.",null,null,{"$f":"IF(INDEX(periode1,NEVAL,Nenfant)=\"D\",\"X\",\"\")","v":{"$error":"#NAME?"}},{"$f":"IF(INDEX(periode1,NEVAL,Nenfant)=\"C\",\"X\",\"\")","v":{"$error":"#NAME?"}},{"$f":"IF(INDEX(periode1,NEVAL,Nenfant)=\"B\",\"X\",\"\")","v":{"$error":"#NAME?"}},{"$f":"IF(INDEX(periode1,NEVAL,Nenfant)=\"A\",\"X\",\"\")","v":{"$error":"#NAME?"}},""]
[16,null,null,"ECRITURE",null,null,{"$f":"COUNTIF(G26:G28,\"X\")","v":0},{"$f":"COUNTIF(H26:H28,\"X\")","v":0},{"$f":"COUNTIF(I26:I28,\"X\")","v":0},{"$f":"COUNTIF(J26:J28,\"X\")","v":0},{"$f":"IF(COUNTIF(G25:J25,\">0\"),\"X\",\"\")","v":""}]
[17,null,null,"Copier de manière experte.",null,null,{"$f":"IF(INDEX(periode1,NEVAL,Nenfant)=\"D\",\"X\",\"\")","v":{"$error":"#NAME?"}},{"$f":"IF(INDEX(periode1,NEVAL,Nenfant)=\"C\",\"X\",\"\")","v":{"$error":"#NAME?"}},{"$f":"IF(INDEX(periode1,NEVAL,Nenfant)=\"B\",\"X\",\"\")","v":{"$error":"#NAME?"}},{"$f":"IF(INDEX(periode1,NEVAL,Nenfant)=\"A\",\"X\",\"\")","v":{"$error":"#NAME?"}},""]
[18,null,null,"Rédiger un texte d'une demi page.",null,null,{"$f":"IF(INDEX(periode1,NEVAL,Nenfant)=\"D\",\"X\",\"\")","v":{"$error":"#NAME?"}},{"$f":"IF(INDEX(periode1,NEVAL,Nenfant)=\"C\",\"X\",\"\")","v":{"$error":"#NAME?"}},{"$f":"IF(INDEX(periode1,NEVAL,Nenfant)=\"B\",\"X\",\"\")","v":{"$error":"#NAME?"}},{"$f":"IF(INDEX(periode1,NEVAL,Nenfant)=\"A\",\"X\",\"\")","v":{"$error":"#NAME?"}},""]
[19,null,null,"Réviser et améliorer l’écrit qu’on a produit. ",null,null,{"$f":"IF(INDEX(periode1,NEVAL,Nenfant)=\"D\",\"X\",\"\")","v":{"$error":"#NAME?"}},{"$f":"IF(INDEX(periode1,NEVAL,Nenfant)=\"C\",\"X\",\"\")","v":{"$error":"#NAME?"}},{"$f":"IF(INDEX(periode1,NEVAL,Nenfant)=\"B\",\"X\",\"\")","v":{"$error":"#NAME?"}},{"$f":"IF(INDEX(periode1,NEVAL,Nenfant)=\"A\",\"X\",\"\")","v":{"$error":"#NAME?"}},""]
[20,null,null,"ETUDE DE LA LANGUE",null,null,{"$f":"COUNTIF(G30:G37,\"X\")","v":0},{"$f":"COUNTIF(H30:H37,\"X\")","v":0},{"$f":"COUNTIF(I30:I37,\"X\")","v":0},{"$f":"COUNTIF(J30:J37,\"X\")","v":0},{"$f":"IF(COUNTIF(G29:J29,\">0\"),\"X\",\"\")","v":""}]
[21,null,null,"Maitriser les relations entre l’oral et l’écrit.",null,null,{"$f":"IF(INDEX(periode1,NEVAL,Nenfant)=\"D\",\"X\",\"\")","v":{"$error":"#NAME?"}},{"$f":"IF(INDEX(periode1,NEVAL,Nenfant)=\"C\",\"X\",\"\")","v":{"$error":"#NAME?"}},{"$f":"IF(INDEX(periode1,NEVAL,Nenfant)=\"B\",\"X\",\"\")","v":{"$error":"#NAME?"}},{"$f":"IF(INDEX(periode1,NEVAL,Nenfant)=\"A\",\"X\",\"\")","v":{"$error":"#NAME?"}},""]
[22,null,null,"Mémoriser et se remémorer l’orthographe de mots fréquents et de mots irréguliers dont le sens est connu.",null,null,{"$error":"#NAME?"},{"$error":"#NAME?"},{"$error":"#NAME?"},{"$error":"#NAME?"},""]
[23,null,null,"Identifier les principaux constituants d’une phrase simple en relation avec sa cohérence sémantique.",null,null,{"$error":"#NAME?"},{"$error":"#NAME?"},{"$error":"#NAME?"},{"$error":"#NAME?"},""]
[24,null,null,"Orthographier les formes verbales les plus fréquentes.",null,null,{"$error":"#NAME?"},{"$error":"#NAME?"},{"$error":"#NAME?"},{"$error":"#NAME?"},""]
[25,null,null,"Raisonner pour résoudre des problèmes orthographiques.",null,null,{"$error":"#NAME?"},{"$error":"#NAME?"},{"$error":"#NAME?"},{"$error":"#NAME?"},""]
[26,null,null,"Comprendre comment se forment les verbes et orthographier les formes verbales les plus fréquentes ",null,null,{"$error":"#NAME?"},{"$error":"#NAME?"},{"$error":"#NAME?"},{"$error":"#NAME?"},""]
[27,null,null,"Identifier des relations entre les mots, entre les mots et leur contexte d’utilisation ; s’en servir pour mieux comprendre.",null,null,{"$error":"#NAME?"},{"$error":"#NAME?"},{"$error":"#NAME?"},{"$error":"#NAME?"},""]
[28,null,null,"Étendre ses connaissances lexicales, mémoriser et réutiliser des mots nouvellement appris.",null,null,{"$error":"#NAME?"},{"$error":"#NAME?"},{"$error":"#NAME?"},{"$error":"#NAME?"},""]
[29,null,"MATHEMATIQUES","NOMBRES ET CALCUL",null,null,{"$f":"COUNTIF(G39:G42,\"X\")","v":0},{"$f":"COUNTIF(H39:H42,\"X\")","v":0},{"$f":"COUNTIF(I39:I42,\"X\")","v":0},{"$f":"COUNTIF(J39:J42,\"X\")","v":0},{"$f":"IF(COUNTIF(G38:J38,\">0\"),\"X\",\"\")","v":""}]
[30,null,null,"Comprendre et utiliser des nombres entiers pour dénombrer, ordonner, repérer, comparer.",null,null,{"$f":"IF(INDEX(periode1,NEVAL,Nenfant)=\"D\",\"X\",\"\")","v":{"$error":"#NAME?"}},{"$f":"IF(INDEX(periode1,NEVAL,Nenfant)=\"C\",\"X\",\"\")","v":{"$error":"#NAME?"}},{"$f":"IF(INDEX(periode1,NEVAL,Nenfant)=\"B\",\"X\",\"\")","v":{"$error":"#NAME?"}},{"$f":"IF(INDEX(periode1,NEVAL,Nenfant)=\"A\",\"X\",\"\")","v":{"$error":"#NAME?"}},""]
[31,null,null,"Nommer, lire, écrire, représenter des nombres entiers.",null,null,{"$f":"IF(INDEX(periode1,NEVAL,Nenfant)=\"D\",\"X\",\"\")","v":{"$error":"#NAME?"}},{"$f":"IF(INDEX(periode1,NEVAL,Nenfant)=\"C\",\"X\",\"\")","v":{"$error":"#NAME?"}},{"$f":"IF(INDEX(periode1,NEVAL,Nenfant)=\"B\",\"X\",\"\")","v":{"$error":"#NAME?"}},{"$f":"IF(INDEX(periode1,NEVAL,Nenfant)=\"A\",\"X\",\"\")","v":{"$error":"#NAME?"}},""]
[32,null,null,"Calculer avec des nombres entiers, mentalement ou à la main, de manière exacte ou approchée.",null,null,{"$f":"IF(INDEX(periode1,NEVAL,Nenfant)=\"D\",\"X\",\"\")","v":{"$error":"#NAME?"}},{"$f":"IF(INDEX(periode1,NEVAL,Nenfant)=\"C\",\"X\",\"\")","v":{"$error":"#NAME?"}},{"$f":"IF(INDEX(periode1,NEVAL,Nenfant)=\"B\",\"X\",\"\")","v":{"$error":"#NAME?"}},{"$f":"IF(INDEX(periode1,NEVAL,Nenfant)=\"A\",\"X\",\"\")","v":{"$error":"#NAME?"}},""]
[33,null,null,"Contrôler la vraisemblance de ses résultats.",null,null,{"$f":"IF(INDEX(periode1,NEVAL,Nenfant)=\"D\",\"X\",\"\")","v":{"$error":"#NAME?"}},{"$f":"IF(INDEX(periode1,NEVAL,Nenfant)=\"C\",\"X\",\"\")","v":{"$error":"#NAME?"}},{"$f":"IF(INDEX(periode1,NEVAL,Nenfant)=\"B\",\"X\",\"\")","v":{"$error":"#NAME?"}},{"$f":"IF(INDEX(periode1,NEVAL,Nenfant)=\"A\",\"X\",\"\")","v":{"$error":"#NAME?"}},""]
[34,null,null,"GRANDEURS ET MESURES",null,null,{"$f":"COUNTIF(G44:G46,\"X\")","v":0},{"$f":"COUNTIF(H44:H46,\"X\")","v":0},{"$f":"COUNTIF(I44:I46,\"X\")","v":0},{"$f":"COUNTIF(J44:J46,\"X\")","v":0},{"$f":"IF(COUNTIF(G43:J43,\">0\"),\"X\",\"\")","v":""}]
[35,null,null,"Comparer, estimer, mesurer des longueurs, des masses, des contenances, des durées.",null,null,{"$f":"IF(INDEX(periode1,NEVAL,Nenfant)=\"D\",\"X\",\"\")","v":{"$error":"#NAME?"}},{"$f":"IF(INDEX(periode1,NEVAL,Nenfant)=\"C\",\"X\",\"\")","v":{"$error":"#NAME?"}},{"$f":"IF(INDEX(periode1,NEVAL,Nenfant)=\"B\",\"X\",\"\")","v":{"$error":"#NAME?"}},{"$f":"IF(INDEX(periode1,NEVAL,Nenfant)=\"A\",\"X\",\"\")","v":{"$error":"#NAME?"}},""]
[36,null,null,"Utiliser le lexique, les unités, les instruments de mesures spécifiques de ces grandeurs.",null,null,{"$f":"IF(INDEX(periode1,NEVAL,Nenfant)=\"D\",\"X\",\"\")","v":{"$error":"#NAME?"}},{"$f":"IF(INDEX(periode1,NEVAL,Nenfant)=\"C\",\"X\",\"\")","v":{"$error":"#NAME?"}},{"$f":"IF(INDEX(periode1,NEVAL,Nenfant)=\"B\",\"X\",\"\")","v":{"$error":"#NAME?"}},{"$f":"IF(INDEX(periode1,NEVAL,Nenfant)=\"A\",\"X\",\"\")","v":{"$error":"#NAME?"}},""]
[37,null,null,"Résoudre des problèmes impliquant des longueurs, des masses, des contenances, des durées, des prix.",null,null,{"$f":"IF(INDEX(periode1,NEVAL,Nenfant)=\"D\",\"X\",\"\")","v":{"$error":"#NAME?"}},{"$f":"IF(INDEX(periode1,NEVAL,Nenfant)=\"C\",\"X\",\"\")","v":{"$error":"#NAME?"}},{"$f":"IF(INDEX(periode1,NEVAL,Nenfant)=\"B\",\"X\",\"\")","v":{"$error":"#NAME?"}},{"$f":"IF(INDEX(periode1,NEVAL,Nenfant)=\"A\",\"X\",\"\")","v":{"$error":"#NAME?"}},""]
[38,null,null,"ESPACE ET GEOMETRIE",null,null,{"$f":"COUNTIF(G48:G50,\"X\")","v":0},{"$f":"COUNTIF(H48:H50,\"X\")","v":0},{"$f":"COUNTIF(I48:I50,\"X\")","v":0},{"$f":"COUNTIF(J48:J50,\"X\")","v":0},{"$f":"IF(COUNTIF(G47:J47,\">0\"),\"X\",\"\")","v":""}]
[39,null,null,"Appréhender différents systèmes de représentations (dessins, schémas, arbres de calcul, etc.).",null,null,{"$f":"IF(INDEX(periode1,NEVAL,Nenfant)=\"D\",\"X\",\"\")","v":{"$error":"#NAME?"}},{"$f":"IF(INDEX(periode1,NEVAL,Nenfant)=\"C\",\"X\",\"\")","v":{"$error":"#NAME?"}},{"$f":"IF(INDEX(periode1,NEVAL,Nenfant)=\"B\",\"X\",\"\")","v":{"$error":"#NAME?"}},{"$f":"IF(INDEX(periode1,NEVAL,Nenfant)=\"A\",\"X\",\"\")","v":{"$error":"#NAME?"}},""]
[40,null,null,"Utiliser des nombres pour représenter des quantités ou des grandeurs. ",null,null,{"$f":"IF(INDEX(periode1,NEVAL,Nenfant)=\"D\",\"X\",\"\")","v":{"$error":"#NAME?"}},{"$f":"IF(INDEX(periode1,NEVAL,Nenfant)=\"C\",\"X\",\"\")","v":{"$error":"#NAME?"}},{"$f":"IF(INDEX(periode1,NEVAL,Nenfant)=\"B\",\"X\",\"\")","v":{"$error":"#NAME?"}},{"$f":"IF(INDEX(periode1,NEVAL,Nenfant)=\"A\",\"X\",\"\")","v":{"$error":"#NAME?"}},""]
[41,null,null,"Utiliser diverses représentations de solides et de situations spatiales.",null,null,{"$f":"IF(INDEX(periode1,NEVAL,Nenfant)=\"D\",\"X\",\"\")","v":{"$error":"#NAME?"}},{"$f":"IF(INDEX(periode1,NEVAL,Nenfant)=\"C\",\"X\",\"\")","v":{"$error":"#NAME?"}},{"$f":"IF(INDEX(periode1,NEVAL,Nenfant)=\"B\",\"X\",\"\")","v":{"$error":"#NAME?"}},{"$f":"IF(INDEX(periode1,NEVAL,Nenfant)=\"A\",\"X\",\"\")","v":{"$error":"#NAME?"}},""]
[42,null,null,"CHERCHER",null,null,{"$f":"COUNTIF(G52:G53,\"X\")","v":0},{"$f":"COUNTIF(H52:H53,\"X\")","v":0},{"$f":"COUNTIF(I52:I53,\"X\")","v":0},{"$f":"COUNTIF(J52:J53,\"X\")","v":0},{"$f":"IF(COUNTIF(G51:J51,\">0\"),\"X\",\"\")","v":""}]
[43,null,null,"S’engager dans une démarche de résolution de problèmes.",null,null,{"$f":"IF(INDEX(periode1,NEVAL,Nenfant)=\"D\",\"X\",\"\")","v":{"$error":"#NAME?"}},{"$f":"IF(INDEX(periode1,NEVAL,Nenfant)=\"C\",\"X\",\"\")","v":{"$error":"#NAME?"}},{"$f":"IF(INDEX(periode1,NEVAL,Nenfant)=\"B\",\"X\",\"\")","v":{"$error":"#NAME?"}},{"$f":"IF(INDEX(periode1,NEVAL,Nenfant)=\"A\",\"X\",\"\")","v":{"$error":"#NAME?"}},""]
[44,null,null,"Tester, essayer plusieurs pistes proposées par soi-même, les autres élèves ou le professeur.",null,null,{"$f":"IF(INDEX(periode1,NEVAL,Nenfant)=\"D\",\"X\",\"\")","v":{"$error":"#NAME?"}},{"$f":"IF(INDEX(periode1,NEVAL,Nenfant)=\"C\",\"X\",\"\")","v":{"$error":"#NAME?"}},{"$f":"IF(INDEX(periode1,NEVAL,Nenfant)=\"B\",\"X\",\"\")","v":{"$error":"#NAME?"}},{"$f":"IF(INDEX(periode1,NEVAL,Nenfant)=\"A\",\"X\",\"\")","v":{"$error":"#NAME?"}},""]
[45,null,null,"MODELISER",null,null,{"$f":"COUNTIF(G55:G57,\"X\")","v":0},{"$f":"COUNTIF(H55:H57,\"X\")","v":0},{"$f":"COUNTIF(I55:I57,\"X\")","v":0},{"$f":"COUNTIF(J55:J57,\"X\")","v":0},{"$f":"IF(COUNTIF(G54:J54,\">0\"),\"X\",\"\")","v":""}]
[46,null,null,"Utiliser des outils mathématiques pour résoudre des problèmes concrets, notamment des problèmes portant sur des grandeurs et leurs mesures.",null,null,{"$f":"IF(INDEX(periode1,NEVAL,Nenfant)=\"D\",\"X\",\"\")","v":{"$error":"#NAME?"}},{"$f":"IF(INDEX(periode1,NEVAL,Nenfant)=\"C\",\"X\",\"\")","v":{"$error":"#NAME?"}},{"$f":"IF(INDEX(periode1,NEVAL,Nenfant)=\"B\",\"X\",\"\")","v":{"$error":"#NAME?"}},{"$f":"IF(INDEX(periode1,NEVAL,Nenfant)=\"A\",\"X\",\"\")","v":{"$error":"#NAME?"}},""]
[47,null,null,"Réaliser que certains problèmes relèvent de situations additives, d’autres de situations multiplicatives, de partages ou de groupements.",null,null,{"$f":"IF(INDEX(periode1,NEVAL,Nenfant)=\"D\",\"X\",\"\")","v":{"$error":"#NAME?"}},{"$f":"IF(INDEX(periode1,NEVAL,Nenfant)=\"C\",\"X\",\"\")","v":{"$error":"#NAME?"}},{"$f":"IF(INDEX(periode1,NEVAL,Nenfant)=\"B\",\"X\",\"\")","v":{"$error":"#NAME?"}},{"$f":"IF(INDEX(periode1,NEVAL,Nenfant)=\"A\",\"X\",\"\")","v":{"$error":"#NAME?"}},""]
[48,null,null,"Reconnaitre des formes dans des objets réels et les reproduire géométriquement.",null,null,{"$f":"IF(INDEX(periode1,NEVAL,Nenfant)=\"D\",\"X\",\"\")","v":{"$error":"#NAME?"}},{"$f":"IF(INDEX(periode1,NEVAL,Nenfant)=\"C\",\"X\",\"\")","v":{"$error":"#NAME?"}},{"$f":"IF(INDEX(periode1,NEVAL,Nenfant)=\"B\",\"X\",\"\")","v":{"$error":"#NAME?"}},{"$f":"IF(INDEX(periode1,NEVAL,Nenfant)=\"A\",\"X\",\"\")","v":{"$error":"#NAME?"}},""]
[49,null,null,"RAISONNER",null,null,{"$f":"COUNTIF(G59:G62,\"X\")","v":0},{"$f":"COUNTIF(H59:H62,\"X\")","v":0},{"$f":"COUNTIF(I59:I62,\"X\")","v":0},{"$f":"COUNTIF(J59:J62,\"X\")","v":0},{"$f":"IF(COUNTIF(G58:J58,\">0\"),\"X\",\"\")","v":""}]
[50,null,null,"Anticiper le résultat d’une manipulation, d’un calcul, ou d’une mesure.",null,null,{"$f":"IF(INDEX(periode1,NEVAL,Nenfant)=\"D\",\"X\",\"\")","v":{"$error":"#NAME?"}},{"$f":"IF(INDEX(periode1,NEVAL,Nenfant)=\"C\",\"X\",\"\")","v":{"$error":"#NAME?"}},{"$f":"IF(INDEX(periode1,NEVAL,Nenfant)=\"B\",\"X\",\"\")","v":{"$error":"#NAME?"}},{"$f":"IF(INDEX(periode1,NEVAL,Nenfant)=\"A\",\"X\",\"\")","v":{"$error":"#NAME?"}},""]
[51,null,null,"Raisonner sur des figures pour les reproduire avec des instruments.",null,null,{"$f":"IF(INDEX(periode1,NEVAL,Nenfant)=\"D\",\"X\",\"\")","v":{"$error":"#NAME?"}},{"$f":"IF(INDEX(periode1,NEVAL,Nenfant)=\"C\",\"X\",\"\")","v":{"$error":"#NAME?"}},{"$f":"IF(INDEX(periode1,NEVAL,Nenfant)=\"B\",\"X\",\"\")","v":{"$error":"#NAME?"}},{"$f":"IF(INDEX(periode1,NEVAL,Nenfant)=\"A\",\"X\",\"\")","v":{"$error":"#NAME?"}},""]
[52,null,null,"Tenir compte d’éléments divers (arguments d’autrui, résultats d’une expérience, sources internes ou externes à la classe, etc.) pour modifier son jugement.",null,null,{"$f":"IF(INDEX(periode1,NEVAL,Nenfant)=\"D\",\"X\",\"\")","v":{"$error":"#NAME?"}},{"$f":"IF(INDEX(periode1,NEVAL,Nenfant)=\"C\",\"X\",\"\")","v":{"$error":"#NAME?"}},{"$f":"IF(INDEX(periode1,NEVAL,Nenfant)=\"B\",\"X\",\"\")","v":{"$error":"#NAME?"}},{"$f":"IF(INDEX(periode1,NEVAL,Nenfant)=\"A\",\"X\",\"\")","v":{"$error":"#NAME?"}},""]
[53,null,null,"Prendre progressivement conscience de la nécessité et de l’intérêt de justifier ce que l’on affirme.",null,null,{"$f":"IF(INDEX(periode1,NEVAL,Nenfant)=\"D\",\"X\",\"\")","v":{"$error":"#NAME?"}},{"$f":"IF(INDEX(periode1,NEVAL,Nenfant)=\"C\",\"X\",\"\")","v":{"$error":"#NAME?"}},{"$f":"IF(INDEX(periode1,NEVAL,Nenfant)=\"B\",\"X\",\"\")","v":{"$error":"#NAME?"}},{"$f":"IF(INDEX(periode1,NEVAL,Nenfant)=\"A\",\"X\",\"\")","v":{"$error":"#NAME?"}},""]
[54,null,null,"COMMUNIQUER",null,null,{"$f":"COUNTIF(G64,\"X\")","v":0},{"$f":"COUNTIF(H64,\"X\")","v":0},{"$f":"COUNTIF(I64,\"X\")","v":0},{"$f":"COUNTIF(J64,\"X\")","v":0},{"$f":"IF(COUNTIF(G63:J63,\">0\"),\"X\",\"\")","v":""}]
[55,null,null,"Expliciter des démarches, argumenter des raisonnements.",null,null,{"$f":"IF(INDEX(periode1,NEVAL,Nenfant)=\"D\",\"X\",\"\")","v":{"$error":"#NAME?"}},{"$f":"IF(INDEX(periode1,NEVAL,Nenfant)=\"C\",\"X\",\"\")","v":{"$error":"#NAME?"}},{"$f":"IF(INDEX(periode1,NEVAL,Nenfant)=\"B\",\"X\",\"\")","v":{"$error":"#NAME?"}},{"$f":"IF(INDEX(periode1,NEVAL,Nenfant)=\"A\",\"X\",\"\")","v":{"$error":"#NAME?"}},""]
[56,null,"QUESTIONNER LE MONDE","PRATIQUE LA DEMARCHE SCIENTIFIQUE",null,null,{"$f":"COUNTIF(G66,\"X\")","v":0},{"$f":"COUNTIF(H66,\"X\")","v":0},{"$f":"COUNTIF(I66,\"X\")","v":0},{"$f":"COUNTIF(J66,\"X\")","v":0},{"$f":"IF(COUNTIF(G65:J65,\">0\"),\"X\",\"\")","v":""}]
[57,null,null,"Pratiquer, avec l’aide des professeurs,une démarche d’investigation : questionnement, observation, expérience, description, raisonnement, conclusion.",null,null,{"$f":"IF(INDEX(periode1,NEVAL,Nenfant)=\"D\",\"X\",\"\")","v":{"$error":"#NAME?"}},{"$f":"IF(INDEX(periode1,NEVAL,Nenfant)=\"C\",\"X\",\"\")","v":{"$error":"#NAME?"}},{"$f":"IF(INDEX(periode1,NEVAL,Nenfant)=\"B\",\"X\",\"\")","v":{"$error":"#NAME?"}},{"$f":"IF(INDEX(periode1,NEVAL,Nenfant)=\"A\",\"X\",\"\")","v":{"$error":"#NAME?"}},""]
[58,null,null,"IMAGINER , REALISER",null,null,{"$f":"COUNTIF(G68:G69,\"X\")","v":0},{"$f":"COUNTIF(H68:H69,\"X\")","v":0},{"$f":"COUNTIF(I68:I69,\"X\")","v":0},{"$f":"COUNTIF(J68:J69,\"X\")","v":0},{"$f":"IF(COUNTIF(G67:J67,\">0\"),\"X\",\"\")","v":""}]
[59,null,null,"Observer des objets simples et des situations d’activités de la vie quotidienne.",null,null,{"$error":"#NAME?"},{"$error":"#NAME?"},{"$error":"#NAME?"},{"$error":"#NAME?"},""]
[60,null,null,"Imaginer et réaliser des objets simples et de petits montages.",null,null,{"$error":"#NAME?"},{"$error":"#NAME?"},{"$error":"#NAME?"},{"$error":"#NAME?"},""]
[61,null,null,"S'APPROPRIER DES OUTILS ET DES METHODES",null,null,{"$f":"COUNTIF(G71:G72,\"X\")","v":0},{"$f":"COUNTIF(H71:H72,\"X\")","v":0},{"$f":"COUNTIF(I71:I72,\"X\")","v":0},{"$f":"COUNTIF(J71:J72,\"X\")","v":0},{"$f":"IF(COUNTIF(G70:J70,\">0\"),\"X\",\"\")","v":""}]
[62,null,null,"Choisir ou utiliser le matériel adapté proposé pour mener une observation, effectuer une mesure, réaliser une expérience. ",null,null,{"$error":"#NAME?"},{"$error":"#NAME?"},{"$error":"#NAME?"},{"$error":"#NAME?"},""]
[63,null,null,"Manipuler avec soin.",null,null,{"$error":"#NAME?"},{"$error":"#NAME?"},{"$error":"#NAME?"},{"$error":"#NAME?"},""]
[64,null,null,"PRATIQUER DES LANGAGES",null,null,{"$f":"COUNTIF(G74:G77,\"X\")","v":0},{"$f":"COUNTIF(H74:H77,\"X\")","v":0},{"$f":"COUNTIF(I74:I77,\"X\")","v":0},{"$f":"COUNTIF(J74:J77,\"X\")","v":0},{"$f":"IF(COUNTIF(G73:J73,\">0\"),\"X\",\"\")","v":""}]
[65,null,null,"Communiquer en français, à l’oral et à l’écrit,.",null,null,{"$f":"IF(INDEX(periode1,NEVAL,Nenfant)=\"D\",\"X\",\"\")","v":{"$error":"#NAME?"}},{"$f":"IF(INDEX(periode1,NEVAL,Nenfant)=\"C\",\"X\",\"\")","v":{"$error":"#NAME?"}},{"$f":"IF(INDEX(periode1,NEVAL,Nenfant)=\"B\",\"X\",\"\")","v":{"$error":"#NAME?"}},{"$f":"IF(INDEX(periode1,NEVAL,Nenfant)=\"A\",\"X\",\"\")","v":{"$error":"#NAME?"}},""]
[66,null,null,"Lire et comprendre des textes documentaires illustrés.",null,null,{"$f":"IF(INDEX(periode1,NEVAL,Nenfant)=\"D\",\"X\",\"\")","v":{"$error":"#NAME?"}},{"$f":"IF(INDEX(periode1,NEVAL,Nenfant)=\"C\",\"X\",\"\")","v":{"$error":"#NAME?"}},{"$f":"IF(INDEX(periode1,NEVAL,Nenfant)=\"B\",\"X\",\"\")","v":{"$error":"#NAME?"}},{"$f":"IF(INDEX(periode1,NEVAL,Nenfant)=\"A\",\"X\",\"\")","v":{"$error":"#NAME?"}},""]
[67,null,null,"Extraire d’un texte ou d’une ressource documentaire une information qui répond à un besoin, une question.",null,null,{"$f":"IF(INDEX(periode1,NEVAL,Nenfant)=\"D\",\"X\",\"\")","v":{"$error":"#NAME?"}},{"$f":"IF(INDEX(periode1,NEVAL,Nenfant)=\"C\",\"X\",\"\")","v":{"$error":"#NAME?"}},{"$f":"IF(INDEX(periode1,NEVAL,Nenfant)=\"B\",\"X\",\"\")","v":{"$error":"#NAME?"}},{"$f":"IF(INDEX(periode1,NEVAL,Nenfant)=\"A\",\"X\",\"\")","v":{"$error":"#NAME?"}},""]
[68,null,null,"Restituer les résultats des observations sous forme orale ou d’écrits variés (notes, listes, dessins, voire tableaux).",null,null,{"$f":"IF(INDEX(periode1,NEVAL,Nenfant)=\"D\",\"X\",\"\")","v":{"$error":"#NAME?"}},{"$f":"IF(INDEX(periode1,NEVAL,Nenfant)=\"C\",\"X\",\"\")","v":{"$error":"#NAME?"}},{"$f":"IF(INDEX(periode1,NEVAL,Nenfant)=\"B\",\"X\",\"\")","v":{"$error":"#NAME?"}},{"$f":"IF(INDEX(periode1,NEVAL,Nenfant)=\"A\",\"X\",\"\")","v":{"$error":"#NAME?"}},""]
[69,null,null,"ADOPTER UN COMPORTEMENT ETHIQUE ET RESPONSABLE",null,null,{"$f":"COUNTIF(G79:G80,\"X\")","v":0},{"$f":"COUNTIF(H79:H80,\"X\")","v":0},{"$f":"COUNTIF(I79:I80,\"X\")","v":0},{"$f":"COUNTIF(J79:J80,\"X\")","v":0},{"$f":"IF(COUNTIF(G78:J78,\">0\"),\"X\",\"\")","v":""}]
[70,null,null,"Développer un comportement responsable vis-à-vis de l’environnement et de la santé.",null,null,{"$f":"IF(INDEX(periode1,NEVAL,Nenfant)=\"D\",\"X\",\"\")","v":{"$error":"#NAME?"}},{"$f":"IF(INDEX(periode1,NEVAL,Nenfant)=\"C\",\"X\",\"\")","v":{"$error":"#NAME?"}},{"$f":"IF(INDEX(periode1,NEVAL,Nenfant)=\"B\",\"X\",\"\")","v":{"$error":"#NAME?"}},{"$f":"IF(INDEX(periode1,NEVAL,Nenfant)=\"A\",\"X\",\"\")","v":{"$error":"#NAME?"}},{"$f":"IF(COUNTIF(G79:J79,\"X\"),\"X\",\"\")","v":""}]
[71,null,null,"Mettre en pratique les premières notions d’éco gestion de l’environnement par des actions simples, gestion de déchets, du papier, économies d’eau et d’énergie (éclairage, chauffage...).",null,null,{"$f":"IF(INDEX(periode1,NEVAL,Nenfant)=\"D\",\"X\",\"\")","v":{"$error":"#NAME?"}},{"$f":"IF(INDEX(periode1,NEVAL,Nenfant)=\"C\",\"X\",\"\")","v":{"$error":"#NAME?"}},{"$f":"IF(INDEX(periode1,NEVAL,Nenfant)=\"B\",\"X\",\"\")","v":{"$error":"#NAME?"}},{"$f":"IF(INDEX(periode1,NEVAL,Nenfant)=\"A\",\"X\",\"\")","v":{"$error":"#NAME?"}},""]
[72,null,null,"SE SITUER DANS L'ESPACE ET DANS LE TEMPS",null,null,{"$f":"COUNTIF(G82:G85,\"X\")","v":0},{"$f":"COUNTIF(H82:H85,\"X\")","v":0},{"$f":"COUNTIF(I82:I85,\"X\")","v":0},{"$f":"COUNTIF(J82:J85,\"X\")","v":0},{"$f":"IF(COUNTIF(G81:J81,\">0\"),\"X\",\"\")","v":""}]
[73,null,null,"Se repérer, s’orienter et se situer dans un espace géographique.",null,null,{"$f":"IF(INDEX(periode1,NEVAL,Nenfant)=\"D\",\"X\",\"\")","v":{"$error":"#NAME?"}},{"$f":"IF(INDEX(periode1,NEVAL,Nenfant)=\"C\",\"X\",\"\")","v":{"$error":"#NAME?"}},{"$f":"IF(INDEX(periode1,NEVAL,Nenfant)=\"B\",\"X\",\"\")","v":{"$error":"#NAME?"}},{"$f":"IF(INDEX(periode1,NEVAL,Nenfant)=\"A\",\"X\",\"\")","v":{"$error":"#NAME?"}},""]
[74,null,null,"Utiliser et produire des représentations de l’espace.",null,null,{"$f":"IF(INDEX(periode1,NEVAL,Nenfant)=\"D\",\"X\",\"\")","v":{"$error":"#NAME?"}},{"$f":"IF(INDEX(periode1,NEVAL,Nenfant)=\"C\",\"X\",\"\")","v":{"$error":"#NAME?"}},{"$f":"IF(INDEX(periode1,NEVAL,Nenfant)=\"B\",\"X\",\"\")","v":{"$error":"#NAME?"}},{"$f":"IF(INDEX(periode1,NEVAL,Nenfant)=\"A\",\"X\",\"\")","v":{"$error":"#NAME?"}},""]
[75,null,null,"Ordonner des évènements.",null,null,{"$f":"IF(INDEX(periode1,NEVAL,Nenfant)=\"D\",\"X\",\"\")","v":{"$error":"#NAME?"}},{"$f":"IF(INDEX(periode1,NEVAL,Nenfant)=\"C\",\"X\",\"\")","v":{"$error":"#NAME?"}},{"$f":"IF(INDEX(periode1,NEVAL,Nenfant)=\"B\",\"X\",\"\")","v":{"$error":"#NAME?"}},{"$f":"IF(INDEX(periode1,NEVAL,Nenfant)=\"A\",\"X\",\"\")","v":{"$error":"#NAME?"}},""]
[76,null,null," Mémoriser quelques repères chronologiques.",null,null,{"$f":"IF(INDEX(periode1,NEVAL,Nenfant)=\"D\",\"X\",\"\")","v":{"$error":"#NAME?"}},{"$f":"IF(INDEX(periode1,NEVAL,Nenfant)=\"C\",\"X\",\"\")","v":{"$error":"#NAME?"}},{"$f":"IF(INDEX(periode1,NEVAL,Nenfant)=\"B\",\"X\",\"\")","v":{"$error":"#NAME?"}},{"$f":"IF(INDEX(periode1,NEVAL,Nenfant)=\"A\",\"X\",\"\")","v":{"$error":"#NAME?"}},""]
[77,null,"LVE","COMPRENDRE L'ORAL",null,null,{"$f":"COUNTIF(G87:G93,\"X\")","v":0},{"$f":"COUNTIF(H87:H93,\"X\")","v":0},{"$f":"COUNTIF(I87:I93,\"X\")","v":0},{"$f":"COUNTIF(J87:J93,\"X\")","v":0},{"$f":"IF(COUNTIF(G86:J86,\">0\"),\"X\",\"\")","v":""}]
[78,null,null,"Écouter et comprendre des messages oraux simples relevant de la vie quotidienne, des textes simples lus par le professeur.",null,null,{"$f":"IF(INDEX(periode1,NEVAL,Nenfant)=\"D\",\"X\",\"\")","v":{"$error":"#NAME?"}},{"$f":"IF(INDEX(periode1,NEVAL,Nenfant)=\"C\",\"X\",\"\")","v":{"$error":"#NAME?"}},{"$f":"IF(INDEX(periode1,NEVAL,Nenfant)=\"B\",\"X\",\"\")","v":{"$error":"#NAME?"}},{"$f":"IF(INDEX(periode1,NEVAL,Nenfant)=\"A\",\"X\",\"\")","v":{"$error":"#NAME?"}},""]
[79,null,null,"S'EXPRIMER ORALEMENT EN CONTINU",null,null,{"$f":"COUNTIF(G89:G95,\"X\")","v":0},{"$f":"COUNTIF(H89:H95,\"X\")","v":0},{"$f":"COUNTIF(I89:I95,\"X\")","v":0},{"$f":"COUNTIF(J89:J95,\"X\")","v":0},{"$f":"IF(COUNTIF(G88:J88,\">0\"),\"X\",\"\")","v":""}]
[80,null,null,"En s’appuyant sur un modèle, réciter, se décrire, lire ou raconter.",null,null,{"$f":"IF(INDEX(periode1,NEVAL,Nenfant)=\"D\",\"X\",\"\")","v":{"$error":"#NAME?"}},{"$f":"IF(INDEX(periode1,NEVAL,Nenfant)=\"C\",\"X\",\"\")","v":{"$error":"#NAME?"}},{"$f":"IF(INDEX(periode1,NEVAL,Nenfant)=\"B\",\"X\",\"\")","v":{"$error":"#NAME?"}},{"$f":"IF(INDEX(periode1,NEVAL,Nenfant)=\"A\",\"X\",\"\")","v":{"$error":"#NAME?"}},""]
[81,null,null,"PRENDRE PAR A UNE CONVERSATION",null,null,{"$f":"COUNTIF(G91:G97,\"X\")","v":0},{"$f":"COUNTIF(H91:H97,\"X\")","v":0},{"$f":"COUNTIF(I91:I97,\"X\")","v":0},{"$f":"COUNTIF(J91:J97,\"X\")","v":0},{"$f":"IF(COUNTIF(G90:J90,\">0\"),\"X\",\"\")","v":""}]
[82,null,null,"Participer à des échanges simples pour être entendu et compris..",null,null,{"$f":"IF(INDEX(periode1,NEVAL,Nenfant)=\"D\",\"X\",\"\")","v":{"$error":"#NAME?"}},{"$f":"IF(INDEX(periode1,NEVAL,Nenfant)=\"C\",\"X\",\"\")","v":{"$error":"#NAME?"}},{"$f":"IF(INDEX(periode1,NEVAL,Nenfant)=\"B\",\"X\",\"\")","v":{"$error":"#NAME?"}},{"$f":"IF(INDEX(periode1,NEVAL,Nenfant)=\"A\",\"X\",\"\")","v":{"$error":"#NAME?"}},""]
[83,null,null,"ASPECTS CULTURELS",null,null,{"$f":"COUNTIF(G93:G98,\"X\")","v":0},{"$f":"COUNTIF(H93:H98,\"X\")","v":0},{"$f":"COUNTIF(I93:I98,\"X\")","v":0},{"$f":"COUNTIF(J93:J98,\"X\")","v":0},{"$f":"IF(COUNTIF(G92:J92,\">0\"),\"X\",\"\")","v":""}]
[84,null,null,"Identifier quelques grands repères culturels de l’environnement quotidien des élèves du même âge dans les pays ou régions étudiés.",null,null,{"$f":"IF(INDEX(periode1,NEVAL,Nenfant)=\"D\",\"X\",\"\")","v":{"$error":"#NAME?"}},{"$f":"IF(INDEX(periode1,NEVAL,Nenfant)=\"C\",\"X\",\"\")","v":{"$error":"#NAME?"}},{"$f":"IF(INDEX(periode1,NEVAL,Nenfant)=\"B\",\"X\",\"\")","v":{"$error":"#NAME?"}},{"$f":"IF(INDEX(periode1,NEVAL,Nenfant)=\"A\",\"X\",\"\")","v":{"$error":"#NAME?"}},""]
[85,null,"EDUCATION ARTISTIQUE","EXPERIMENTER, PRODUIRE, CRÉER",null,null,{"$f":"COUNTIF(G95:G98,\"X\")","v":0},{"$f":"COUNTIF(H95:H98,\"X\")","v":0},{"$f":"COUNTIF(I95:I98,\"X\")","v":0},{"$f":"COUNTIF(J95:J98,\"X\")","v":0},{"$f":"IF(COUNTIF(G94:J94,\">0\"),\"X\",\"\")","v":""}]
[86,null,null,"S’approprier par les sens les éléments du langage plastique : matière, support, couleur… ",null,null,{"$f":"IF(INDEX(periode1,NEVAL,Nenfant)=\"D\",\"X\",\"\")","v":{"$error":"#NAME?"}},{"$f":"IF(INDEX(periode1,NEVAL,Nenfant)=\"C\",\"X\",\"\")","v":{"$error":"#NAME?"}},{"$f":"IF(INDEX(periode1,NEVAL,Nenfant)=\"B\",\"X\",\"\")","v":{"$error":"#NAME?"}},{"$f":"IF(INDEX(periode1,NEVAL,Nenfant)=\"A\",\"X\",\"\")","v":{"$error":"#NAME?"}},""]
[87,null,null,"Observer les effets produits par ses gestes, par les outils utilisés.",null,null,{"$f":"IF(INDEX(periode1,NEVAL,Nenfant)=\"D\",\"X\",\"\")","v":{"$error":"#NAME?"}},{"$f":"IF(INDEX(periode1,NEVAL,Nenfant)=\"C\",\"X\",\"\")","v":{"$error":"#NAME?"}},{"$f":"IF(INDEX(periode1,NEVAL,Nenfant)=\"B\",\"X\",\"\")","v":{"$error":"#NAME?"}},{"$f":"IF(INDEX(periode1,NEVAL,Nenfant)=\"A\",\"X\",\"\")","v":{"$error":"#NAME?"}},""]
[88,null,null,"Tirer parti de trouvailles fortuites, saisir les effets du hasard.",null,null,{"$f":"IF(INDEX(periode1,NEVAL,Nenfant)=\"D\",\"X\",\"\")","v":{"$error":"#NAME?"}},{"$f":"IF(INDEX(periode1,NEVAL,Nenfant)=\"C\",\"X\",\"\")","v":{"$error":"#NAME?"}},{"$f":"IF(INDEX(periode1,NEVAL,Nenfant)=\"B\",\"X\",\"\")","v":{"$error":"#NAME?"}},{"$f":"IF(INDEX(periode1,NEVAL,Nenfant)=\"A\",\"X\",\"\")","v":{"$error":"#NAME?"}},""]
[89,null,null,"Représenter le monde environnant ou donner forme à son imaginaire en explorant la diversité des domaines (dessin, collage, modelage, sculpture, photographie …).",null,null,{"$f":"IF(INDEX(periode1,NEVAL,Nenfant)=\"D\",\"X\",\"\")","v":{"$error":"#NAME?"}},{"$f":"IF(INDEX(periode1,NEVAL,Nenfant)=\"C\",\"X\",\"\")","v":{"$error":"#NAME?"}},{"$f":"IF(INDEX(periode1,NEVAL,Nenfant)=\"B\",\"X\",\"\")","v":{"$error":"#NAME?"}},{"$f":"IF(INDEX(periode1,NEVAL,Nenfant)=\"A\",\"X\",\"\")","v":{"$error":"#NAME?"}},""]
[90,null,null,"METTRE EN OEUVRE UN PROJET ARTISTIQUE",null,null,{"$f":"COUNTIF(G100:G102,\"X\")","v":0},{"$f":"COUNTIF(H100:H102,\"X\")","v":0},{"$f":"COUNTIF(I100:I102,\"X\")","v":0},{"$f":"COUNTIF(J100:J102,\"X\")","v":0},{"$f":"IF(COUNTIF(G99:J99,\">0\"),\"X\",\"\")","v":""}]
[91,null,null,"Respecter l’espace, les outils et les matériaux partagés.",null,null,{"$f":"IF(INDEX(periode1,NEVAL,Nenfant)=\"D\",\"X\",\"\")","v":{"$error":"#NAME?"}},{"$f":"IF(INDEX(periode1,NEVAL,Nenfant)=\"C\",\"X\",\"\")","v":{"$error":"#NAME?"}},{"$f":"IF(INDEX(periode1,NEVAL,Nenfant)=\"B\",\"X\",\"\")","v":{"$error":"#NAME?"}},{"$f":"IF(INDEX(periode1,NEVAL,Nenfant)=\"A\",\"X\",\"\")","v":{"$error":"#NAME?"}},""]
[92,null,null,"Mener à terme une production individuelle dans le cadre d’un projet accompagné par le professeur.",null,null,{"$f":"IF(INDEX(periode1,NEVAL,Nenfant)=\"D\",\"X\",\"\")","v":{"$error":"#NAME?"}},{"$f":"IF(INDEX(periode1,NEVAL,Nenfant)=\"C\",\"X\",\"\")","v":{"$error":"#NAME?"}},{"$f":"IF(INDEX(periode1,NEVAL,Nenfant)=\"B\",\"X\",\"\")","v":{"$error":"#NAME?"}},{"$f":"IF(INDEX(periode1,NEVAL,Nenfant)=\"A\",\"X\",\"\")","v":{"$error":"#NAME?"}},""]
[93,null,null,"Montrer sans réticence ses productions et regarder celles des autres.",null,null,{"$f":"IF(INDEX(periode1,NEVAL,Nenfant)=\"D\",\"X\",\"\")","v":{"$error":"#NAME?"}},{"$f":"IF(INDEX(periode1,NEVAL,Nenfant)=\"C\",\"X\",\"\")","v":{"$error":"#NAME?"}},{"$f":"IF(INDEX(periode1,NEVAL,Nenfant)=\"B\",\"X\",\"\")","v":{"$error":"#NAME?"}},{"$f":"IF(INDEX(periode1,NEVAL,Nenfant)=\"A\",\"X\",\"\")","v":{"$error":"#NAME?"}},""]
[94,null,null,"S'EXPRIMER, ANALYSER SA PRATIQUE",null,null,{"$f":"COUNTIF(G104:G106,\"X\")","v":0},{"$f":"COUNTIF(H104:H106,\"X\")","v":0},{"$f":"COUNTIF(I104:I106,\"X\")","v":0},{"$f":"COUNTIF(J104:J106,\"X\")","v":0},{"$f":"IF(COUNTIF(G103:J103,\">0\"),\"X\",\"\")","v":""}]
[95,null,null,"Prendre la parole devant un groupe pour partager ses trouvailles, s’intéresser à celles découvertes dans des œuvres d’art.",null,null,{"$f":"IF(INDEX(periode1,NEVAL,Nenfant)=\"D\",\"X\",\"\")","v":{"$error":"#NAME?"}},{"$f":"IF(INDEX(periode1,NEVAL,Nenfant)=\"C\",\"X\",\"\")","v":{"$error":"#NAME?"}},{"$f":"IF(INDEX(periode1,NEVAL,Nenfant)=\"B\",\"X\",\"\")","v":{"$error":"#NAME?"}},{"$f":"IF(INDEX(periode1,NEVAL,Nenfant)=\"A\",\"X\",\"\")","v":{"$error":"#NAME?"}},""]
[96,null,null,"Formuler ses émotions, entendre et respecter celles des autres.",null,null,{"$f":"IF(INDEX(periode1,NEVAL,Nenfant)=\"D\",\"X\",\"\")","v":{"$error":"#NAME?"}},{"$f":"IF(INDEX(periode1,NEVAL,Nenfant)=\"C\",\"X\",\"\")","v":{"$error":"#NAME?"}},{"$f":"IF(INDEX(periode1,NEVAL,Nenfant)=\"B\",\"X\",\"\")","v":{"$error":"#NAME?"}},{"$f":"IF(INDEX(periode1,NEVAL,Nenfant)=\"A\",\"X\",\"\")","v":{"$error":"#NAME?"}},""]
[97,null,null,"Repérer les éléments du langage plastique dans une production : couleurs, formes, matières, support… ",null,null,{"$f":"IF(INDEX(periode1,NEVAL,Nenfant)=\"D\",\"X\",\"\")","v":{"$error":"#NAME?"}},{"$f":"IF(INDEX(periode1,NEVAL,Nenfant)=\"C\",\"X\",\"\")","v":{"$error":"#NAME?"}},{"$f":"IF(INDEX(periode1,NEVAL,Nenfant)=\"B\",\"X\",\"\")","v":{"$error":"#NAME?"}},{"$f":"IF(INDEX(periode1,NEVAL,Nenfant)=\"A\",\"X\",\"\")","v":{"$error":"#NAME?"}},""]
[98,null,null,"SE REPERER DANS LES DOMAINES LIES AUX ARTS PLASTIQUES",null,null,{"$f":"COUNTIF(G108:G111,\"X\")","v":0},{"$f":"COUNTIF(H108:H111,\"X\")","v":0},{"$f":"COUNTIF(I108:I111,\"X\")","v":0},{"$f":"COUNTIF(J108:J111,\"X\")","v":0},{"$f":"IF(COUNTIF(G107:J107,\">0\"),\"X\",\"\")","v":""}]
[99,null,null,"Effectuer des choix parmi les images rencontrées, établir un premier lien entre son univers visuel et la culture artistique.",null,null,{"$f":"IF(INDEX(periode1,NEVAL,Nenfant)=\"D\",\"X\",\"\")","v":{"$error":"#NAME?"}},{"$f":"IF(INDEX(periode1,NEVAL,Nenfant)=\"C\",\"X\",\"\")","v":{"$error":"#NAME?"}},{"$f":"IF(INDEX(periode1,NEVAL,Nenfant)=\"B\",\"X\",\"\")","v":{"$error":"#NAME?"}},{"$f":"IF(INDEX(periode1,NEVAL,Nenfant)=\"A\",\"X\",\"\")","v":{"$error":"#NAME?"}},""]
[100,null,null,"Exprimer ses émotions lors de la rencontre avec des œuvres d’art, manifester son intérêt pour la rencontre directe avec des œuvres. ",null,null,{"$f":"IF(INDEX(periode1,NEVAL,Nenfant)=\"D\",\"X\",\"\")","v":{"$error":"#NAME?"}},{"$f":"IF(INDEX(periode1,NEVAL,Nenfant)=\"C\",\"X\",\"\")","v":{"$error":"#NAME?"}},{"$f":"IF(INDEX(periode1,NEVAL,Nenfant)=\"B\",\"X\",\"\")","v":{"$error":"#NAME?"}},{"$f":"IF(INDEX(periode1,NEVAL,Nenfant)=\"A\",\"X\",\"\")","v":{"$error":"#NAME?"}},""]
[101,null,null,"S’approprier quelques œuvres de domaines et d’époques variés appartenant au patrimoine national et mondial.",null,null,{"$f":"IF(INDEX(periode1,NEVAL,Nenfant)=\"D\",\"X\",\"\")","v":{"$error":"#NAME?"}},{"$f":"IF(INDEX(periode1,NEVAL,Nenfant)=\"C\",\"X\",\"\")","v":{"$error":"#NAME?"}},{"$f":"IF(INDEX(periode1,NEVAL,Nenfant)=\"B\",\"X\",\"\")","v":{"$error":"#NAME?"}},{"$f":"IF(INDEX(periode1,NEVAL,Nenfant)=\"A\",\"X\",\"\")","v":{"$error":"#NAME?"}},""]
[102,null,null,"S’ouvrir à la diversité des pratiques et des cultures artistiques.",null,null,{"$f":"IF(INDEX(periode1,NEVAL,Nenfant)=\"D\",\"X\",\"\")","v":{"$error":"#NAME?"}},{"$f":"IF(INDEX(periode1,NEVAL,Nenfant)=\"C\",\"X\",\"\")","v":{"$error":"#NAME?"}},{"$f":"IF(INDEX(periode1,NEVAL,Nenfant)=\"B\",\"X\",\"\")","v":{"$error":"#NAME?"}},{"$f":"IF(INDEX(periode1,NEVAL,Nenfant)=\"A\",\"X\",\"\")","v":{"$error":"#NAME?"}},""]
[103,null,"EMC","CHANTER",null,null,{"$f":"COUNTIF(G113:G114,\"X\")","v":0},{"$f":"COUNTIF(H113:H114,\"X\")","v":0},{"$f":"COUNTIF(I113:I114,\"X\")","v":0},{"$f":"COUNTIF(J113:J114,\"X\")","v":0},{"$f":"IF(COUNTIF(G112:J112,\">0\"),\"X\",\"\")","v":""}]
[104,null,null,"Chanter une mélodie simple avec une intonation juste, chanter une comptine ou un chant par imitation.",null,null,{"$f":"IF(INDEX(periode1,NEVAL,Nenfant)=\"D\",\"X\",\"\")","v":{"$error":"#NAME?"}},{"$f":"IF(INDEX(periode1,NEVAL,Nenfant)=\"C\",\"X\",\"\")","v":{"$error":"#NAME?"}},{"$f":"IF(INDEX(periode1,NEVAL,Nenfant)=\"B\",\"X\",\"\")","v":{"$error":"#NAME?"}},{"$f":"IF(INDEX(periode1,NEVAL,Nenfant)=\"A\",\"X\",\"\")","v":{"$error":"#NAME?"}},""]
[105,null,null,"Interpréter un chant avec expressivité.",null,null,{"$error":"#NAME?"},{"$error":"#NAME?"},{"$error":"#NAME?"},{"$error":"#NAME?"},""]
[106,null,null,"ECOUTER, COMPARER",null,null,{"$f":"COUNTIF(G116:G117,\"X\")","v":0},{"$f":"COUNTIF(H116:H117,\"X\")","v":0},{"$f":"COUNTIF(I116:I117,\"X\")","v":0},{"$f":"COUNTIF(J116:J117,\"X\")","v":0},{"$f":"IF(COUNTIF(G115:J115,\">0\"),\"X\",\"\")","v":""}]
[107,null,null,"Décrire et comparer des éléments sonores. ",null,null,{"$error":"#NAME?"},{"$error":"#NAME?"},{"$error":"#NAME?"},{"$error":"#NAME?"},""]
[108,null,null,"Comparer des musiques et identifier des ressemblances et des différences.",null,null,{"$error":"#NAME?"},{"$error":"#NAME?"},{"$error":"#NAME?"},{"$error":"#NAME?"},""]
[109,null,null,"EXPLORER, IMAGINER",null,null,{"$f":"COUNTIF(G119:G120,\"X\")","v":0},{"$f":"COUNTIF(H119:H120,\"X\")","v":0},{"$f":"COUNTIF(I119:I120,\"X\")","v":0},{"$f":"COUNTIF(J119:J120,\"X\")","v":0},{"$f":"IF(COUNTIF(G118:J118,\">0\"),\"X\",\"\")","v":""}]
[110,null,null,"Imaginer des représentations graphiques ou corporelles de la musique.",null,null,{"$error":"#NAME?"},{"$error":"#NAME?"},{"$error":"#NAME?"},{"$error":"#NAME?"},""]
[111,null,null,"Inventer une organisation simple à partir de différents éléments sonores. ",null,null,{"$error":"#NAME?"},{"$error":"#NAME?"},{"$error":"#NAME?"},{"$error":"#NAME?"},""]
[112,null,null,"ECHANGER, PARTAGER",null,null,{"$f":"COUNTIF(G122:G123,\"X\")","v":0},{"$f":"COUNTIF(H122:H123,\"X\")","v":0},{"$f":"COUNTIF(I122:I123,\"X\")","v":0},{"$f":"COUNTIF(J122:J123,\"X\")","v":0},{"$f":"IF(COUNTIF(G121:J121,\">0\"),\"X\",\"\")","v":""}]
[113,null,null,"Exprimer ses émotions, ses sentiments et ses préférences.",null,null,{"$error":"#NAME?"},{"$error":"#NAME?"},{"$error":"#NAME?"},{"$error":"#NAME?"},""]
[114,null,null,"Écouter et respecter l’avis des autres et l’expression de leur sensibilité.",null,null,{"$error":"#NAME?"},{"$error":"#NAME?"},{"$error":"#NAME?"},{"$error":"#NAME?"},""]
[115,null,"EPS","DEVELOPPER SA MOTRICITE, LE LANGAGE DU CORPS ",null,null,{"$f":"COUNTIF(G125:G127,\"X\")","v":0},{"$f":"COUNTIF(H125:H127,\"X\")","v":0},{"$f":"COUNTIF(I125:I127,\"X\")","v":0},{"$f":"COUNTIF(J125:J127,\"X\")","v":0},{"$f":"IF(COUNTIF(G124:J124,\">0\"),\"X\",\"\")","v":""}]
[116,null,null,"Prendre conscience des différentes ressources à mobiliser pour agir avec son corps. ",null,null,{"$error":"#NAME?"},{"$error":"#NAME?"},{"$error":"#NAME?"},{"$error":"#NAME?"},""]
[117,null,null,"Adapter sa motricité à des environnements variés.",null,null,{"$error":"#NAME?"},{"$error":"#NAME?"},{"$error":"#NAME?"},{"$error":"#NAME?"},""]
[118,null,null,"S’exprimer par son corps et accepter de se montrer à autrui.",null,null,{"$error":"#NAME?"},{"$error":"#NAME?"},{"$error":"#NAME?"},{"$error":"#NAME?"},""]
[119,null,null,"S’APPROPRIER LES MÉTHODES ET OUTILS POUR APPRENDRE",null,null,{"$f":"COUNTIF(G129:G130,\"X\")","v":0},{"$f":"COUNTIF(H129:H130,\"X\")","v":0},{"$f":"COUNTIF(I129:I130,\"X\")","v":0},{"$f":"COUNTIF(J129:J130,\"X\")","v":0},{"$f":"IF(COUNTIF(G128:J128,\">0\"),\"X\",\"\")","v":""}]
[120,null,null,"Apprendre par essai-erreur en utilisant les effets de son action.",null,null,{"$error":"#NAME?"},{"$error":"#NAME?"},{"$error":"#NAME?"},{"$error":"#NAME?"},""]
[121,null,null,"Apprendre à planifier son action avant de la réaliser.",null,null,{"$error":"#NAME?"},{"$error":"#NAME?"},{"$error":"#NAME?"},{"$error":"#NAME?"},""]
[122,null,null,"PARTAGER DES RÈGLES, ASSUMER DES RÔLES ",null,null,{"$f":"COUNTIF(G132:G134,\"X\")","v":0},{"$f":"COUNTIF(H132:H134,\"X\")","v":0},{"$f":"COUNTIF(I132:I134,\"X\")","v":0},{"$f":"COUNTIF(J132:J134,\"X\")","v":0},{"$f":"IF(COUNTIF(G131:J131,\">0\"),\"X\",\"\")","v":""}]
[123,null,null,"Assumer les rôles spécifiques aux différentes APSA (joueur, coach, arbitre, juge, médiateur, organisateur…). ",null,null,{"$error":"#NAME?"},{"$error":"#NAME?"},{"$error":"#NAME?"},{"$error":"#NAME?"},""]
[124,null,null,"Élaborer, respecter et faire respecter règles et règlements.",null,null,{"$error":"#NAME?"},{"$error":"#NAME?"},{"$error":"#NAME?"},{"$error":"#NAME?"},""]
[125,null,null,"Accepter et prendre en considération toutes les différences interindividuelles au sein d’un groupe.",null,null,{"$error":"#NAME?"},{"$error":"#NAME?"},{"$error":"#NAME?"},{"$error":"#NAME?"},""]
[126,null,null,"ENTRETENIR SA SANTÉ ",null,null,{"$f":"COUNTIF(G136:G137,\"X\")","v":0},{"$f":"COUNTIF(H136:H137,\"X\")","v":0},{"$f":"COUNTIF(I136:I137,\"X\")","v":0},{"$f":"COUNTIF(J136:J137,\"X\")","v":0},{"$f":"IF(COUNTIF(G135:J135,\">0\"),\"X\",\"\")","v":""}]
[127,null,null,"Découvrir les principes d’une bonne hygiène de vie, à des fins de santé et de bien être.",null,null,{"$error":"#NAME?"},{"$error":"#NAME?"},{"$error":"#NAME?"},{"$error":"#NAME?"},""]
[128,null,null,"Ne pas se mettre en danger par un engagement physique dont l’intensité excède ses qualités physiques.",null,null,{"$error":"#NAME?"},{"$error":"#NAME?"},{"$error":"#NAME?"},{"$error":"#NAME?"},""]
[129,null,null,"S’APPROPRIER UNE CULTURE PHYSIQUE SPORTIVE ET ARTISTIQUE ",null,null,{"$f":"COUNTIF(G139:G140,\"X\")","v":0},{"$f":"COUNTIF(H139:H140,\"X\")","v":0},{"$f":"COUNTIF(I139:I140,\"X\")","v":0},{"$f":"COUNTIF(J139:J140,\"X\")","v":0},{"$f":"IF(COUNTIF(G138:J138,\">0\"),\"X\",\"\")","v":""}]
[130,null,null,"Découvrir la variété des activités et des spectacles sportifs.",null,null,{"$error":"#NAME?"},{"$error":"#NAME?"},{"$error":"#NAME?"},{"$error":"#NAME?"},""]
[131,null,null,"Exprimer des intentions et des émotions par son corps dans un projet artistique individuel ou collectif.",null,null,{"$error":"#NAME?"},{"$error":"#NAME?"},{"$error":"#NAME?"},{"$error":"#NAME?"},""]
[132,null,"EMC","ENSEIGNEMENT CIVIQUE ET MORAL",null,null,{"$f":"COUNTIF(G142:G147,\"X\")","v":0},{"$f":"COUNTIF(H142:H147,\"X\")","v":0},{"$f":"COUNTIF(I142:I147,\"X\")","v":0},{"$f":"COUNTIF(J142:J147,\"X\")","v":0},{"$f":"IF(COUNTIF(G141:J141,\">0\"),\"X\",\"\")","v":""}]
[133,null,null," Identifier et partager des émotions, des sentiments dans des situations et à propos d'objets diversifiés.",null,null,{"$error":"#NAME?"},{"$error":"#NAME?"},{"$error":"#NAME?"},{"$error":"#NAME?"},""]
[134,null,null,"Se situer et s'exprimer en respectant les codes de la communication orale, les règles de l'échange et le statut de l'interlocuteur.",null,null,{"$error":"#NAME?"},{"$error":"#NAME?"},{"$error":"#NAME?"},{"$error":"#NAME?"},{"$f":"IF(COUNTIF(G143:J143,\"X\"),\"X\",\"\")","v":""}]
[135,null,null,"Prendre soin de soi et des autres.",null,null,{"$error":"#NAME?"},{"$error":"#NAME?"},{"$error":"#NAME?"},{"$error":"#NAME?"},{"$f":"IF(COUNTIF(G144:J144,\"X\"),\"X\",\"\")","v":""}]
[136,null,null,"Accepter les différences. ",null,null,{"$error":"#NAME?"},{"$error":"#NAME?"},{"$error":"#NAME?"},{"$error":"#NAME?"},{"$f":"IF(COUNTIF(G145:J145,\"X\"),\"X\",\"\")","v":""}]
[137,null,null,"Identifier les symboles de la République présents dans l'école. ",null,null,{"$error":"#NAME?"},{"$error":"#NAME?"},{"$error":"#NAME?"},{"$error":"#NAME?"},{"$f":"IF(COUNTIF(G146:J146,\"X\"),\"X\",\"\")","v":""}]
[138,null,null,"Apprendre à coopérer. ",null,null,{"$error":"#NAME?"},{"$error":"#NAME?"},{"$error":"#NAME?"},{"$error":"#NAME?"},{"$f":"IF(COUNTIF(G147:J147,\"X\"),\"X\",\"\")","v":""}]
[139,{"$nulls":8},{"$f":"passage","v":0},"x"]
[140,null,null,"PARCOURS CITOYENS",{"$nulls":5},0,{"$f":"K150","v":""}]
[{"$nulls":9},0,{"$f":"IF(COUNTIF(D150,\"*\"),\"X\",\"\")","v":""}]
[141,null,null,"PARCOURS ARTISTIQUE ET CULTUREL",{"$nulls":5},0,{"$f":"K152","v":""}]
[142,{"$nulls":8},0,{"$f":"IF(COUNTIF(D152,\"*\"),\"X\",\"\")","v":""}]
[143,{"$nulls":8},0,"x"]
[144,null,null,"Appréciations",null,null,"Absences",{"$nulls":3},{"$f":"K155","v":""}]
[145,{"$nulls":9},{"$f":"IF(COUNTIF(D155,\"*\"),\"X\",\"\")","v":""}]
[146,null,null,"Décision du conseil de cycle",{"$nulls":5},{"$f":"absences","v":0},{"$f":"K157","v":""}]
[147,{"$nulls":8},{"$f":"passage","v":0},{"$f":"IF(COUNTIF(D157,\"*\"),\"X\",\"\")","v":""}]
[148,{"$nulls":8},{"$f":"passage","v":0},"x"]
[149,null,null,"Signatures",{"$nulls":6},"x"]
[150,{"$nulls":9},"x"]
[151]
[152]
[153]
[154]
[155]
[156]
[157]
[158]
[159]
[160]
[161]
[162]
[163]
[164]
[165]
[166]
[167]
[168]
[169]
[170]
[171]
[172]
[173]
[174]
[175]
[176]
[177]
[178]
[179]
[180]
[181]
[182]
[183]
[184]
[185]
[186]
[187]
[188]
[189]
[190]
[191]
[192]
[193]
[194]
[195]
[196]
[197]
[198]
[199]
[200]
[201]
[202]
[203]
[204]
[205]
[206]
[207]
[208]
[209]
[210]
[211]
[212]
[213]
[214]
[215]
[216]
[217]
[218]
[219]
[220]
[221]
[222]
[223]
[224]
[225]
[226]

{"sheet":"Parcours","index":10,"n_rows":5,"n_cols":8,"rows_kept":5,"hidden":true}
[]
[{"$nulls":3},"PERIODE 1","PERIODE 2","PERIODE 3","PERIODE 4","PERIODE 5"]
[]
[null,"Parcours citoyen",null,"blabla"]
[null,"Parcours Artistique et culturel",null,"blablablabla"]