{"text_format":"3","workbook":"xlsx","n_sheets":11,"sheets":["Accueil","Notice","Renseignements","Programmation","Période","Formules","Appréciations","Synt","Socle","Bulletin","Parcours"],"not_rendered":{"images":1,"macros":1,"defined_names":101},"read":"whole","date_system":"1900"}

{"sheet":"Accueil","index":0,"n_rows":22,"n_cols":2,"rows_kept":22,"merged":[[2,1,2,11],[3,1,3,11],[4,1,4,11],[5,1,5,11],[7,1,7,11],[9,1,9,11],[11,1,11,11],[13,1,13,11],[21,1,21,11]]}
[]
[]
[null,"PROGRAMMATION, EVALUATION DES COMPETENCES DU"]
[null,"CYCLE 2"]
[null,"Nécessite d'accepter les macros *"]
[null,"NOTICE D'UTLISATION"]
[]
[null,"  -1                             Saisir les renseignements"]
[]
[null,"   -2                            Etablir la programmation des compétences par période"]
[]
[null,"  - 3                            Saisie des appréciations par période"]
[]
[null,"   -4                            Edition du socle commun"]
[]
[null,"* Vous pouvez avoir besoin de modifier votre niveau de sécurité s'il est trop élevé, cochez faible (ce logiciel est sans danger)"]
[]
[]
[]
[]
[]
[null,"Le livret cycle 2 version 4 by Eric Di Donfrancesco sont mis à disposition selon les termes de la licence Creative Commons Paternité - Pas d'Utilisation Commerciale - Partage des Conditions Initiales à l'Identique 3.0 Unported."]

{"sheet":"Notice","index":1,"n_rows":37,"n_cols":2,"rows_kept":37}
[null,"NOTICE"]
[]
[null,"Principes de bases  :  \nCette version du livret reprend les compétences 2016 en les liant au socle sur le modèle du livret EN."]
[]
[null,"Les versions :  \nCette version fonctionne sous PC avec  excel 2010 et plus. Si vous utilisez une version plus ancienne téléchargez la version XLS (excel 97 2000) du livret. Les conversions sont sources d'erreurs.  Les versions trop anciennes d'excel (95) risquent de mal fonctionner.  Il est recommandé d'éviter de passer d'une version à l'autre, ou de mac à PC avec le même livret."]
[null,"Si vous utilisez mac excel "]
[null,"Renseignements :     onglet renseignement"]
[null,"Renseigner dans les cadres blancs les données de l’école et de la classe, puis ceux des élèves (nom et prénom).\nVous pouvez modifier le type de notes ou créer les vôtres en cochant l'option. "]
[null,"Puis aller à la page programmation pour établir votre programmation des compétences abordées par période."]
[]
[null,"Les compétences: onglet programmation"]
[null,"Dans l'onglet \"programmation\" vous avez les compétences du BO. Vous pouvez les modifier:\n- En les réécrivant dans la cellule mais attention n'en changez pas le sens, car chaque compétence est en lien avec le socle.\n\"valider les modifications\" sinon elles ne seront pas prises en compte dans la génération des périodes."]
[]
[null,"Programmation :  onglet programmation"]
[null,"Cocher par une croix (x) les compétences que vous allez aborder dans chaque période. Colonnes P1 P2 …"]
[]
[null,"Évaluation des compétences de chaque élève par période :"]
[null,"Une fois les compétences à évaluer programmées dans les périodes, vous allez créer la grille d'évaluation de la période qui vous intéresse en cliquant sur les boutons P1, P2.. en haut des colonnes concernées. \nVous pouvez évaluer chacun de vos élèves dans un tableau collectif (4 degrés d’évaluation et NE – Non Évalué- ) Le A renvoie à une maîtrise dépassée, le B suffisante, le C fragile et le D non acquise.\nSi vous modifiez de nouveau la programmation, elle sera prise en compte dans vos feuilles périodes. Par contre une fois une période créée vous ne pouvez plus ajouter ou enlever des compétences sur cette dernière."]
[]
[null,"La feuille d'évaluation:  (onglets P1, P2, P3, P4, P5) "]
[null,"Elles se nomment P1, P2, P3, P4 ou P5 Quand vous l'ouvrez, cliquez sur le bouton \"mise à jour de la feuille\" pour filtrer les colonnes vides et actualiser les compétences programmées. Vous pouvez ensuite mettre les notes . \nPour supprimer une feuille période il faut passer par les macros: en cliquant sur le bouton Effacer. La boite de dialogue apparaitra et vous choisirez la période à supprimer. "]
[]
[null,"Saisie des appréciations par période :"]
[null,"Pour chaque enfant, vous noterez dans un tableau collectif l’appréciation littérale concernant la période. Vous pouvez aussi noter les jours d’absences. La cellule s'adaptera à la longueur de votre texte."]
[]
[null,"Bulletin : onglets B1, B2, B3, B4, B5,  Bilan  "]
[null,"Une fois les évaluations terminées vous devez générer le bulletin correspondant ( B1 pour P1)  utiliser le bouton Bulletin présent dans les feuilles périodes.  Pour chaque compétence vous pouvez la préciser sur ce bulletin, écrire quelle partie de cette compétence a été évaluée. Après avoir choisi l’enfant dans la liste déroulante et la période, vous pourrez cliquer sur le bouton imprimer, ou imprimez en passant par le menu. Vous pouvez aussi générer des bulletins PDF. Si vous cliquez sur \"imprimer tout\" toutes les feuilles sortiront mais pas en recto verso.\nLe bilan annuel : si vous générez cette feuille, toutes les compétences évaluées sur le nombre de période que vous aurez choisi se reporteront sur cette feuille. si une compétence a été évaluée plusieurs fois; c'est la dernière note qui l'emporte (vous pouvez toujours modifier manuellement cela). "]
[]
[null,"Édition du socle commun : onglet socle"]
[null,"En fin du cycle, il est possible d’éditer le livret du socle commun pour chaque élève."]
[null,"Toutes les compétences sont liées au  socle c'est pourquoi vous ne pouvez pas en rajouter."]
[null,"Pour valider les compétences du socle, un bouton est prévu mettra à jour à chaque fois que vous l’utiliserez."]
[]
[null,"Pour l’enseignant des tableaux statistiques peuvent être utiles :"]
[null,"Sur chaque période vous pouvez voir les pourcentages d'acquisition pour chaque compétences."]
[null,"bilan élèves: C'est un bulletin qui reprend les compétences sur toute l'année, il se réfère à la feuille \"Année\" le même sous forme synoptique regroupant l’ensemble des élèves de la classe."]
[null,"Sur la feuille \"Année\" vous avez, comme sur les autres périodes, un bilan des compétences qui montre, pour la classe, les compétences réussies, à renforcer, en cours d’acquisition ou non acquises par période ou sur l'année."]

{"sheet":"Renseignements","index":2,"n_rows":49,"n_cols":16,"rows_kept":49,"merged":[[1,2,1,6],[2,2,2,3],[2,4,2,6],[3,2,3,3],[3,4,3,6],[4,2,4,3],[4,4,4,6],[5,2,5,3],[5,4,5,6],[6,2,6,3],[6,4,6,6],[7,2,7,3],[7,4,7,6],[8,2,8,3],[8,4,8,6],[9,2,9,3],[9,4,9,6],[10,2,10,3],[10,4,10,6],[13,2,13,4],[18,7,18,11]]}
[]
[null,null,"RENSEIGNEMENTS"]
[null,null,"Académie",null,"Toscana"]
[null,null,"Circonscription ",null,"Firenza "]
[null,null,"Ville",null,"Sienna"]
[null,null,"Ecole",null,"Léonard de Vinci"]
[null,null,"Adresse"]
[null,null,"Cycle",null,3]
[null,null,"Classe",null,"CM2"]
[null,null,"Enseignant",null,"M. DURANT"]
[null,null,"Année",null,"2016   2017"]
[]
[]
[null,null,"LISTE"]
[null,null,"Prénom","Nom","Né le"]
[null,1,"Marc","Aurèle","1999-11-12",{"$nulls":10},{"$f":"CONCATENATE(C16,\"  \",D16)","v":"Marc  Aurèle"}]
[null,2,"Jérôme","Lenoir","1998-07-04",{"$nulls":10},{"$f":"CONCATENATE(C17,\"  \",D17)","v":"Jérôme  Lenoir"}]
[null,3,"Fabien","Léglise","1999-10-05",{"$nulls":10},"Fabien  Léglise"]
[null,4,"Aicha","Samarahoui","1999-12-03",{"$nulls":10},"Aicha  Samarahoui"]
[null,5,"Karim","Maha","2000-03-30",{"$nulls":10},"Karim  Maha"]
[null,6,{"$nulls":13},"  "]
[null,7,{"$nulls":13},"  "]
[null,8,{"$nulls":13},"  "]
[null,9,{"$nulls":13},"  "]
[null,10,{"$nulls":13},"  "]
[null,11,{"$nulls":13},"  "]
[null,12,{"$nulls":13},"  "]
[null,13,{"$nulls":13},"  "]
[null,14,{"$nulls":13},"  "]
[null,15,{"$nulls":13},"  "]
[null,16,{"$nulls":13},"  "]
[null,17,{"$nulls":13},"  "]
[null,18,{"$nulls":13},"  "]
[null,19,{"$nulls":13},"  "]
[null,20,{"$nulls":13},"  "]
[null,21,{"$nulls":13},"  "]
[null,22,{"$nulls":13},"  "]
[null,23,{"$nulls":13},"  "]
[null,24,{"$nulls":13},"  "]
[null,25,{"$nulls":13},"  "]
[null,26,{"$nulls":13},"  "]
[null,27,{"$nulls":13},"  "]
[null,28,{"$nulls":13},"  "]
[null,29,{"$nulls":13},"  "]
[null,30,{"$nulls":13},"  "]
[null,31,{"$nulls":13},"  "]
[null,32,{"$nulls":13},"  "]
[null,33,{"$nulls":13},"  "]
[null,null,{"$f":"COUNTIF(C16:C48,\"*\")","v":5}]

{"sheet":"Programmation","index":3,"n_rows":215,"n_cols":22,"rows_kept":215,"merged":[[0,0,1,1],[0,2,3,2],[0,4,2,12],[0,14,2,14],[4,1,26,1],[27,1,53,1],[54,1,91,1],[92,1,128,1],[129,1,151,1],[152,1,169,1],[170,1,182,1],[183,1,187,1],[188,1,207,1],[208,1,214,1]]}
[null,null,"Vous pouvez reformuler les compétences. Cliquez sur le bouton pour les valider. \nDans la logique des programmes 2016 chaque compétence est liée avec le socle, donc n'en modifiez pas le sens ",null,"1)  Choisir les compétences à  travailler par période en mettant une croix (x) dans les cases P1, P2…\n\n2) Cliquer sur un bouton pour générer la grille d'évaluation de la période voulue.",{"$nulls":9},"Fusionne toutes les notes de l'année"]
[]
[]
[{"$nulls":3},215,"P1",null,"P2",null,"P3",null,"P4",null,"P5"]
[5,"FRANCAIS","LANGAGE ORAL",null,{"$f":"IF(COUNTIF(E6:E9,\"x\")>0,\"x\",0)","v":"x"},null,{"$f":"IF(COUNTIF(G6:G9,\"x\")>0,\"x\",0)","v":"x"},null,{"$f":"IF(COUNTIF(I6:I9,\"x\")>0,\"x\",0)","v":0},null,{"$f":"IF(COUNTIF(K6:K9,\"x\")>0,\"x\",0)","v":0},null,{"$f":"IF(COUNTIF(M6:M9,\"x\")>0,\"x\",0)","v":0},null,{"$f":"IF(COUNTIF(E5:M5,\"X\"),\"X\",\"\")","v":"X"},null,{"$f":"E5","v":"x"},{"$f":"G5","v":"x"},{"$f":"I5","v":0},{"$f":"K5","v":0},{"$f":"M5","v":0},{"$f":"O5","v":"X"}]
[{"$f":"A5+1","v":6},null,"Écouter pour comprendre un message oral, un propos, un discours, un texte lu.",null,"X",null,"X",{"$nulls":7},"X",null,"X","X",0,0,0,"X"]
[{"$f":"A6+1","v":7},null,"Parler en prenant en compte son auditoire.",null,"x",null,"x",{"$nulls":7},"X",null,"x","x",0,0,0,"X"]
[8,null,"Participer à des échanges dans des situations diversifiées.",{"$nulls":3},"x",{"$nulls":7},"X",null,0,"x",0,0,0,"X"]
[9,null,"Adopter une attitude critique par rapport au langage produit.",null,"x",null,"x",{"$nulls":7},"X",null,"x","x",0,0,0,"X"]
[10,null,"LIRE",null,{"$f":"IF(COUNTIF(E11:E14,\"x\")>0,\"x\",0)","v":"x"},null,{"$f":"IF(COUNTIF(G11:G14,\"x\")>0,\"x\",0)","v":"x"},null,{"$f":"IF(COUNTIF(I11:I14,\"x\")>0,\"x\",0)","v":0},null,{"$f":"IF(COUNTIF(K11:K14,\"x\")>0,\"x\",0)","v":0},null,{"$f":"IF(COUNTIF(M11:M14,\"x\")>0,\"x\",0)","v":0},null,"X",null,"x","x",0,0,0,"X"]
[11,null,"Lire avec fluidité.",null,"x",null,"x",{"$nulls":7},"X",null,"x","x",0,0,0,"X"]
[12,null,"Comprendre un texte littéraire et l’interpréter.",null,"x",null,"x",{"$nulls":7},"X",null,"x","x",0,0,0,"X"]
[13,null,"Comprendre des textes, des documents et des images et les interpréter. ",null,"x",{"$nulls":9},"X",null,"x",0,0,0,0,"X"]
[14,null,"Contrôler sa compréhension, être un lecteur autonome.",null,"x",{"$nulls":9},"X",null,"x",0,0,0,0,"X"]
[15,null,"ECRIRE",null,{"$f":"IF(COUNTIF(E16:E21,\"x\")>0,\"x\",0)","v":"x"},null,{"$f":"IF(COUNTIF(G16:G21,\"x\")>0,\"x\",0)","v":0},null,{"$f":"IF(COUNTIF(I16:I21,\"x\")>0,\"x\",0)","v":0},null,{"$f":"IF(COUNTIF(K16:K21,\"x\")>0,\"x\",0)","v":0},null,{"$f":"IF(COUNTIF(M16:M21,\"x\")>0,\"x\",0)","v":0},null,"X",null,"x",0,0,0,0,"X"]
[16,null,"Écrire à la main de manière fluide et efficace.",null,"x",{"$nulls":9},"X",null,"x",0,0,0,0,"X"]
[17,null,"Écrire avec un clavier rapidement et efficacement. "]
[18,null,"Recourir à l’écriture pour réfléchir et pour apprendre. "]
[19,null,"Produire des écrits variés."]
[20,null,"Réécrire à partir de nouvelles consignes ou faire évoluer son texte.",null,"x",{"$nulls":9},{"$f":"IF(COUNTIF(E20:M20,\"X\"),\"X\",\"\")","v":"X"},null,{"$f":"E20","v":"x"},{"$f":"G20","v":0},{"$f":"I20","v":0},{"$f":"K20","v":0},{"$f":"M20","v":0},{"$f":"O20","v":"X"}]
[21,null,"Prendre en compte les normes de l’écrit pour formuler, transcrire et réviser.",null,"x",{"$nulls":9},"X",null,"x",0,0,0,0,"X"]
[22,null,"ETUDE DE LA LANGUE",null,{"$f":"IF(COUNTIF(E23:E27,\"x\")>0,\"x\",0)","v":0},null,{"$f":"IF(COUNTIF(G23:G27,\"x\")>0,\"x\",0)","v":0},null,{"$f":"IF(COUNTIF(I23:I27,\"x\")>0,\"x\",0)","v":0},null,{"$f":"IF(COUNTIF(K23:K27,\"x\")>0,\"x\",0)","v":0},null,{"$f":"IF(COUNTIF(M23:M27,\"x\")>0,\"x\",0)","v":0},null,"",null,0,0,0,0,0,""]
[23,null,"Maitriser les relations entre l’oral et l’écrit.",{"$nulls":11},"",null,0,0,0,0,0,""]
[24,null,"Acquérir la structure, le sens et l’orthographe des mots.",{"$nulls":11},"",null,0,0,0,0,0,""]
[25,null,"Maitriser la forme des mots en lien avec la syntaxe.",{"$nulls":11},"",null,0,0,0,0,0,""]
[26,null,"Observer le fonctionnement du verbe et l’orthographier.",{"$nulls":11},"",null,0,0,0,0,0,""]
[27,null,"Identifier les constituants d’une phrase simple en relation avec son sens ; distinguer phrase simple et phrase complexe.",{"$nulls":11},"",null,0,0,0,0,0,""]
[28,"MATHEMATIQUES","NOMBRES ET CALCUL",null,{"$f":"IF(COUNTIF(E29:E31,\"x\")>0,\"x\",0)","v":0},null,{"$f":"IF(COUNTIF(G29:G31,\"x\")>0,\"x\",0)","v":0},null,{"$f":"IF(COUNTIF(I29:I31,\"x\")>0,\"x\",0)","v":0},null,{"$f":"IF(COUNTIF(K29:K31,\"x\")>0,\"x\",0)","v":0},null,{"$f":"IF(COUNTIF(M29:M31,\"x\")>0,\"x\",0)","v":0},null,"",null,0,0,0,0,0,""]
[29,null,"Calculer avec des nombres décimaux.",{"$nulls":11},"",null,0,0,0,0,0,""]
[30,null,"Contrôler la vraisemblance de ses résultats. ",{"$nulls":11},"",null,0,0,0,0,0,""]
[31,null,"Utiliser une calculatrice pour trouver ou vérifier un résultat.",{"$nulls":11},"",null,0,0,0,0,0,""]
[32,null,"CHERCHER",null,{"$f":"IF(COUNTIF(E33:E35,\"x\")>0,\"x\",0)","v":0},null,{"$f":"IF(COUNTIF(G33:G35,\"x\")>0,\"x\",0)","v":0},null,{"$f":"IF(COUNTIF(I33:I35,\"x\")>0,\"x\",0)","v":0},null,{"$f":"IF(COUNTIF(K33:K35,\"x\")>0,\"x\",0)","v":0},null,{"$f":"IF(COUNTIF(M33:M35,\"x\")>0,\"x\",0)","v":0},null,"",null,0,0,0,0,0,""]
[33,null,"Prélever et organiser les informations nécessaires à la résolution de problèmes.",{"$nulls":11},"",null,0,0,0,0,0,""]
[34,null,"S’engager dans une démarche, observer, questionner, manipuler, expérimenter, émettre des hypothèses."]
[35,null,"Tester, essayer plusieurs pistes de résolution.",{"$nulls":11},{"$f":"IF(COUNTIF(E35:M35,\"X\"),\"X\",\"\")","v":""},null,{"$f":"E35","v":0},{"$f":"G35","v":0},{"$f":"I35","v":0},{"$f":"K35","v":0},{"$f":"M35","v":0},{"$f":"O35","v":""}]
[36,null,"MODELISER",null,{"$f":"IF(COUNTIF(E43:E46,\"x\")>0,\"x\",0)","v":0},null,{"$f":"IF(COUNTIF(G43:G46,\"x\")>0,\"x\",0)","v":0},null,{"$f":"IF(COUNTIF(I43:I46,\"x\")>0,\"x\",0)","v":0},null,{"$f":"IF(COUNTIF(K43:K46,\"x\")>0,\"x\",0)","v":0},null,{"$f":"IF(COUNTIF(M43:M46,\"x\")>0,\"x\",0)","v":0},null,{"$f":"IF(COUNTIF(E36:M36,\"X\"),\"X\",\"\")","v":""},null,{"$f":"E36","v":0},{"$f":"G36","v":0},{"$f":"I36","v":0},{"$f":"K36","v":0},{"$f":"M36","v":0},{"$f":"O36","v":""}]
[37,null,"Résoudre quelques problèmes issus de situations de la vie quotidienne. ",{"$nulls":11},{"$f":"IF(COUNTIF(E37:M37,\"X\"),\"X\",\"\")","v":""}]
[38,null,"Reconnaitre et distinguer des problèmes relevant de situations additives, multiplicatives, de proportionnalité. "]
[39,null,"Reconnaitre des situations réelles pouvant être modélisées par des relations géométriques (alignement, parallélisme, perpendicularité, symétrie).",{"$nulls":11},{"$f":"IF(COUNTIF(E39:M39,\"X\"),\"X\",\"\")","v":""}]
[40,null,"Utiliser des propriétés géométriques pour reconnaitre des objets.",{"$nulls":11},{"$f":"IF(COUNTIF(E40:M40,\"X\"),\"X\",\"\")","v":""}]
[41,null,"REPRESENTER",null,{"$f":"IF(COUNTIF(E48:E51,\"x\")>0,\"x\",0)","v":0},null,{"$f":"IF(COUNTIF(G48:G51,\"x\")>0,\"x\",0)","v":0},null,{"$f":"IF(COUNTIF(I48:I51,\"x\")>0,\"x\",0)","v":0},null,{"$f":"IF(COUNTIF(K48:K51,\"x\")>0,\"x\",0)","v":0},null,{"$f":"IF(COUNTIF(M48:M51,\"x\")>0,\"x\",0)","v":0},null,{"$f":"IF(COUNTIF(E41:M41,\"X\"),\"X\",\"\")","v":""}]
[42,null,"Utiliser des outils pour représenter un problème : dessins, schémas, diagrammes, graphiques, écritures avec parenthésages, …",{"$nulls":11},{"$f":"IF(COUNTIF(E42:M42,\"X\"),\"X\",\"\")","v":""}]
[43,null,"Produire et utiliser diverses représentations des fractions simples et des nombres décimaux.",{"$nulls":13},{"$f":"E43","v":0},{"$f":"G43","v":0},{"$f":"I43","v":0},{"$f":"K43","v":0},{"$f":"M43","v":0},{"$f":"O43","v":0}]
[44,null,"Analyser une figure plane sous différents aspects (surface, contour de celle-ci, lignes et points).",{"$nulls":11},{"$f":"IF(COUNTIF(E44:M44,\"X\"),\"X\",\"\")","v":""}]
[45,null,"Reconnaitre et utiliser des premiers éléments de codages d’une figure plane ou d’un solide.",{"$nulls":11},"",null,{"$f":"E45","v":0},{"$f":"G45","v":0},{"$f":"I45","v":0},{"$f":"K45","v":0},{"$f":"M45","v":0},{"$f":"O45","v":""}]
[46,null,"Utiliser et produire des représentations de solides et de situations spatiales.",{"$nulls":11},"",null,0,0,0,0,0,""]
[47,null,"RAISONNER",null,{"$f":"IF(COUNTIF(E48:E50,\"x\")>0,\"x\",0)","v":0},null,{"$f":"IF(COUNTIF(G48:G50,\"x\")>0,\"x\",0)","v":0},null,{"$f":"IF(COUNTIF(I48:I50,\"x\")>0,\"x\",0)","v":0},null,{"$f":"IF(COUNTIF(K48:K50,\"x\")>0,\"x\",0)","v":0},null,{"$f":"IF(COUNTIF(M48:M50,\"x\")>0,\"x\",0)","v":0},null,"",null,0,0,0,0,0,""]
[48,null,"Résoudre des problèmes complexes",{"$nulls":11},"",null,0,0,0,0,0,""]
[49,null,"En géométrie, passer progressivement de la perception au contrôle par les instruments pour amorcer des raisonnements s’appuyant uniquement sur des propriétés des figures et sur des relations entre objets.",{"$nulls":11},"",null,0,0,0,0,0,""]
[50,null,"Progresser collectivement dans une investigation en sachant prendre en compte le point de vue d’autrui.",{"$nulls":11},"",null,0,0,0,0,0,""]
[51,null,"Justifier ses affirmations et rechercher la validité des informations dont on dispose.",{"$nulls":11},"",null,0,0,0,0,0,""]
[52,null,"COMMUNIQUER",null,{"$f":"IF(COUNTIF(E53:E93,\"x\")>0,\"x\",0)","v":0},null,{"$f":"IF(COUNTIF(G53:G93,\"x\")>0,\"x\",0)","v":0},null,{"$f":"IF(COUNTIF(I53:I93,\"x\")>0,\"x\",0)","v":0},null,{"$f":"IF(COUNTIF(K53:K93,\"x\")>0,\"x\",0)","v":0},null,{"$f":"IF(COUNTIF(M53:M93,\"x\")>0,\"x\",0)","v":0},null,"",null,0,0,0,0,0,""]
[53,null,"Utiliser un vocabulaire adéquat et/ou des notations adaptées pour décrire une situation, exposer une argumentation.",{"$nulls":11},"",null,0,0,0,0,0,""]
[54,null,"Expliquer sa démarche ou son raisonnement, comprendre les explications d’un autre et argumenter dans l’échange."]
[55,"HISTOIRE ET GEOGRAPHIE","SE REPERER DANS LE TEMPS, CONSTRUIRE DES REPERES HISTORIQUES",null,{"$f":"IF(COUNTIF(E56:E60,\"x\")>C645,\"x\",0)","v":0},null,{"$f":"IF(COUNTIF(G56:G56,\"x\")>0,\"x\",0)","v":0},null,{"$f":"IF(COUNTIF(I56:I60,\"x\")>G645,\"x\",0)","v":0},null,{"$f":"IF(COUNTIF(K56:K60,\"x\")>I645,\"x\",0)","v":0},null,{"$f":"IF(COUNTIF(M56:M60,\"x\")>K645,\"x\",0)","v":0},null,{"$f":"IF(COUNTIF(E55:M55,\"X\"),\"X\",\"\")","v":""}]
[56,null,"Situer chronologiquement des grandes périodes historiques. "]
[57,null,"Ordonner des faits les uns par rapport aux autres et les situer dans une époque ou une période donnée."]
[58,null,"Manipuler et réinvestir le repère historique dans différents contextes."]
[59,null,"Utiliser des documents donnant à voir une représentation du temps."]
[60,null,"Mémoriser les repères historiques liés au programme"]
[61,null,"SE REPERER DANS L'ESPACE, CONSTRUIRE DES REPERES GEOGRAPHIQUES",null,{"$f":"IF(COUNTIF(E62:E62,\"x\")>0,\"x\",0)","v":0},null,{"$f":"IF(COUNTIF(G62:G62,\"x\")>0,\"x\",0)","v":0},null,{"$f":"IF(COUNTIF(I62:I62,\"x\")>0,\"x\",0)","v":0},null,{"$f":"IF(COUNTIF(K62:K62,\"x\")>0,\"x\",0)","v":0},null,{"$f":"IF(COUNTIF(M62:M62,\"x\")>0,\"x\",0)","v":0},null,{"$f":"IF(COUNTIF(E61:M61,\"X\"),\"X\",\"\")","v":""}]
[62,null,"Nommer et localiser les grands repères géographiques."]
[63,null,"Nommer et localiser un lieu dans un espace géographique."]
[64,null,"Nommer, localiser et caractériser des espaces."]
[65,null,"Situer des lieux et des espaces les uns par rapport aux autres."]
[66,null,"Appréhender la notion d’échelle géographique."]
[67,null,"Mémoriser les repères géographiques liés au programme."]
[68,null,"RAISONNER, JUSTIFIER UNE DEMARCHE ET LES CHOIX EFFECTUES",null,{"$f":"IF(COUNTIF(E69:E73,\"x\")>C652,\"x\",0)","v":0},null,{"$f":"IF(COUNTIF(G69:G69,\"x\")>0,\"x\",0)","v":0},null,{"$f":"IF(COUNTIF(I69:I73,\"x\")>G652,\"x\",0)","v":0},null,{"$f":"IF(COUNTIF(K69:K73,\"x\")>I652,\"x\",0)","v":0},null,{"$f":"IF(COUNTIF(M69:M73,\"x\")>K652,\"x\",0)","v":0},null,{"$f":"IF(COUNTIF(E68:M68,\"X\"),\"X\",\"\")","v":""}]
[69,null,"Poser des questions, se poser des questions."]
[70,null,"Formuler des hypothèses."]
[{"$f":"A70+1","v":71},null,"Vérifier."]
[72,null,"Justifier."]
[73,null,"S'INFORMER DANS LE MONDE NUMERIQUE",null,{"$f":"IF(COUNTIF(E74:E77,\"x\")>C655,\"x\",0)","v":0},null,{"$f":"IF(COUNTIF(G74:G74,\"x\")>0,\"x\",0)","v":0},null,{"$f":"IF(COUNTIF(I74:I77,\"x\")>G655,\"x\",0)","v":0},null,{"$f":"IF(COUNTIF(K74:K77,\"x\")>I655,\"x\",0)","v":0},null,{"$f":"IF(COUNTIF(M74:M77,\"x\")>K655,\"x\",0)","v":0},null,{"$f":"IF(COUNTIF(E73:M73,\"X\"),\"X\",\"\")","v":""}]
[74,null,"Connaitre différents systèmes d’information, les utiliser."]
[75,null,"Trouver, sélectionner et exploiter des informations dans une ressource numérique."]
[76,null," Identifier la ressource numérique utilisée"]
[77,null,"COMPRENDRE UN DOCUMENT",null,{"$f":"IF(COUNTIF(E78:E82,\"x\")>C658,\"x\",0)","v":0},null,{"$f":"IF(COUNTIF(G78:G78,\"x\")>0,\"x\",0)","v":0},null,{"$f":"IF(COUNTIF(I78:I82,\"x\")>G658,\"x\",0)","v":0},null,{"$f":"IF(COUNTIF(K78:K82,\"x\")>I658,\"x\",0)","v":0},null,{"$f":"IF(COUNTIF(M78:M82,\"x\")>K658,\"x\",0)","v":0},null,{"$f":"IF(COUNTIF(E77:M77,\"X\"),\"X\",\"\")","v":""}]
[78,null,"Comprendre le sens général d’un document."]
[79,null,"Identifier le document et savoir pourquoi il doit être identifié."]
[80,null,"Extraire des informations pertinentes pour répondre à une question."]
[81,null,"Savoir que le document exprime un point de vue, identifier et questionner le sens implicite d’un document."]
[82,null,"PRATIQUER DIFFERENTS LANGAGES EN HISTOIRE ET EN GEOGRAPHIE",null,{"$f":"IF(COUNTIF(E83:E89,\"x\")>C661,\"x\",0)","v":0},null,{"$f":"IF(COUNTIF(G83:G83,\"x\")>0,\"x\",0)","v":0},null,{"$f":"IF(COUNTIF(I83:I89,\"x\")>G661,\"x\",0)","v":0},null,{"$f":"IF(COUNTIF(K83:K89,\"x\")>I661,\"x\",0)","v":0},null,{"$f":"IF(COUNTIF(M83:M89,\"x\")>K661,\"x\",0)","v":0},null,{"$f":"IF(COUNTIF(E82:M82,\"X\"),\"X\",\"\")","v":""}]
[83,null,"Écrire pour structurer sa pensée et son savoir, pour argumenter et écrire pour communiquer et échanger."]
[84,null,"Reconnaitre un récit historique."]
[85,null,"S’exprimer à l’oral pour penser, communiquer et échanger."]
[86,null,"S’approprier et utiliser un lexique historique et géographique approprié."]
[87,null,"Réaliser ou compléter des productions graphiques."]
[88,null,"Utiliser des cartes analogiques et numériques à différentes échelles, des photographies de paysages ou de lieux."]
[89,null,"COOPERER ET MUTUALISER",null,{"$f":"IF(COUNTIF(E90:E92,\"x\")>C664,\"x\",0)","v":0},null,{"$f":"IF(COUNTIF(G90:G92,\"x\")>E664,\"x\",0)","v":0},null,{"$f":"IF(COUNTIF(I90:I92,\"x\")>G664,\"x\",0)","v":0},null,{"$f":"IF(COUNTIF(K90:K92,\"x\")>I664,\"x\",0)","v":0},null,{"$f":"IF(COUNTIF(M90:M92,\"x\")>K664,\"x\",0)","v":0},null,{"$f":"IF(COUNTIF(E89:M89,\"X\"),\"X\",\"\")","v":""}]
[90,null,"Organiser son travail dans le cadre d’un groupe pour élaborer une tâche commune."]
[91,null,"Travailler en commun pour faciliter les apprentissages individuels. "]
[92,null,"Apprendre à utiliser les outils numériques qui peuvent conduire à des réalisations collectives."]
[93,"SCIENCES ET TECHNOLOGIE","PRATIQUE LA DEMARCHE SCIENTIFIQUE",null,{"$f":"IF(COUNTIF(E94:E94,\"x\")>0,\"x\",0)","v":0},null,{"$f":"IF(COUNTIF(G94:G94,\"x\")>0,\"x\",0)","v":0},null,{"$f":"IF(COUNTIF(I94:I94,\"x\")>0,\"x\",0)","v":0},null,{"$f":"IF(COUNTIF(K94:K94,\"x\")>0,\"x\",0)","v":0},null,{"$f":"IF(COUNTIF(M94:M94,\"x\")>0,\"x\",0)","v":0},null,{"$f":"IF(COUNTIF(E93:M93,\"X\"),\"X\",\"\")","v":""},null,{"$f":"E93","v":0},{"$f":"G93","v":0},{"$f":"I93","v":0},{"$f":"K93","v":0},{"$f":"M93","v":0},{"$f":"O93","v":""}]
[94,null,"Proposer, avec l’aide du professeur, une démarche pour résoudre un problème ou répondre à une question de nature scientifique ou technologique :",{"$nulls":11},{"$f":"IF(COUNTIF(E94:M94,\"X\"),\"X\",\"\")","v":""},null,{"$f":"E94","v":0},{"$f":"G94","v":0},{"$f":"I94","v":0},{"$f":"K94","v":0},{"$f":"M94","v":0},{"$f":"O94","v":""}]
[95,null,"Formuler une question ou une problématique scientifique ou technologique simple ;"]
[96,null,"Proposer une ou des hypothèses pour répondre à une question ou un problème ;"]
[97,null,"Pproposer des expériences simples pour tester une hypothèse ;"]
[98,null,"Interpréter un résultat, en tirer une conclusion ;"]
[99,null,"Formaliser une partie de sa recherche sous une forme écrite ou orale."]
[100,null,"PERCEVOIR, CREER , REALISER",null,{"$f":"IF(COUNTIF(E101:E105,\"x\")>0,\"x\",0)","v":0},null,{"$f":"IF(COUNTIF(G101:G105,\"x\")>0,\"x\",0)","v":0},null,{"$f":"IF(COUNTIF(I101:I105,\"x\")>0,\"x\",0)","v":0},null,{"$f":"IF(COUNTIF(K101:K105,\"x\")>0,\"x\",0)","v":0},null,{"$f":"IF(COUNTIF(M101:M105,\"x\")>0,\"x\",0)","v":0},null,{"$f":"IF(COUNTIF(E100:M100,\"X\"),\"X\",\"\")","v":""},null,{"$f":"E100","v":0},{"$f":"G100","v":0},{"$f":"I100","v":0},{"$f":"K100","v":0},{"$f":"M100","v":0},{"$f":"O100","v":""}]
[101,null,"Identifier les évolutions des besoins et des objets techniques dans leur contexte.",{"$nulls":11},{"$f":"IF(COUNTIF(E101:M101,\"X\"),\"X\",\"\")","v":""},null,{"$f":"E101","v":0},{"$f":"G101","v":0},{"$f":"I101","v":0},{"$f":"K101","v":0},{"$f":"M101","v":0},{"$f":"O101","v":""}]
[102,null,"Identifier les principales familles de matériaux."]
[103,null,"Décrire le fonctionnement d’objets techniques, leurs fonctions et leurs composants."]
[104,null,"Réaliser en équipe tout ou une partie d’un objet technique répondant à un besoin."]
[105,null,"Repérer et comprendre la communication et la gestion de l’information."]
[106,null,"S'APPROPRIER DES OUTILS ET DES METHODES",null,{"$f":"IF(COUNTIF(E107:E112,\"x\")>0,\"x\",0)","v":0},null,{"$f":"IF(COUNTIF(G107:G112,\"x\")>0,\"x\",0)","v":0},null,{"$f":"IF(COUNTIF(I107:I112,\"x\")>0,\"x\",0)","v":0},null,{"$f":"IF(COUNTIF(K107:K112,\"x\")>0,\"x\",0)","v":0},null,{"$f":"IF(COUNTIF(M107:M112,\"x\")>0,\"x\",0)","v":0},null,{"$f":"IF(COUNTIF(E106:M106,\"X\"),\"X\",\"\")","v":""},null,{"$f":"E106","v":0},{"$f":"G106","v":0},{"$f":"I106","v":0},{"$f":"K106","v":0},{"$f":"M106","v":0},{"$f":"O106","v":""}]
[107,null,"Choisir ou utiliser le matériel adapté pour mener une observation, effectuer une mesure, réaliser une expérience ou une production. ",{"$nulls":11},{"$f":"IF(COUNTIF(E107:M107,\"X\"),\"X\",\"\")","v":""},null,{"$f":"E107","v":0},{"$f":"G107","v":0},{"$f":"I107","v":0},{"$f":"K107","v":0},{"$f":"M107","v":0},{"$f":"O107","v":""}]
[108,null,"Faire le lien entre la mesure réalisée, les unités et l’outil utilisés."]
[109,null,"Garder une trace écrite ou numérique des recherches, des observations et des expériences réalisées."]
[110,null,"Organiser seul ou en groupe un espace de réalisation expérimentale."]
[111,null,"Effectuer des recherches bibliographiques simples et ciblées. Extraire les informations pertinentes d’un document et les mettre en relation pour répondre à une question."]
[112,null,"Utiliser les outils mathématiques adaptés.",{"$nulls":11},{"$f":"IF(COUNTIF(E112:M112,\"X\"),\"X\",\"\")","v":""},null,{"$f":"E112","v":0},{"$f":"G112","v":0},{"$f":"I112","v":0},{"$f":"K112","v":0},{"$f":"M112","v":0},{"$f":"O112","v":""}]
[113,null,"PRATIQUER DES LANGAGES",null,{"$f":"IF(COUNTIF(E114:E117,\"x\")>0,\"x\",0)","v":0},null,{"$f":"IF(COUNTIF(G114:G117,\"x\")>0,\"x\",0)","v":0},null,{"$f":"IF(COUNTIF(I114:I117,\"x\")>0,\"x\",0)","v":0},null,{"$f":"IF(COUNTIF(K114:K117,\"x\")>0,\"x\",0)","v":0},null,{"$f":"IF(COUNTIF(M114:M117,\"x\")>0,\"x\",0)","v":0},null,"",null,0,0,0,0,0,""]
[114,null,"Rendre compte des observations, expériences, hypothèses, conclusions en utilisant un vocabulaire précis.",{"$nulls":11},"",null,0,0,0,0,0,""]
[115,null,"Exploiter un document constitué de divers supports (texte, schéma, graphique, tableau, algorithme simple).",{"$nulls":11},"",null,0,0,0,0,0,""]
[116,null,"Utiliser différents modes de représentation formalisés (schéma, dessin, croquis, tableau, graphique, texte). ",{"$nulls":11},"",null,0,0,0,0,0,""]
[117,null,"Expliquer un phénomène à l’oral et à l’écrit.",{"$nulls":11},"",null,0,0,0,0,0,""]
[118,null,"MOBILISER LES OUTILS NUMERIQUES",null,{"$f":"IF(COUNTIF(E119:E123,\"x\")>0,\"x\",0)","v":0},null,{"$f":"IF(COUNTIF(G119:G123,\"x\")>0,\"x\",0)","v":0},null,{"$f":"IF(COUNTIF(I119:I123,\"x\")>0,\"x\",0)","v":0},null,{"$f":"IF(COUNTIF(K119:K123,\"x\")>0,\"x\",0)","v":0},null,{"$f":"IF(COUNTIF(M119:M123,\"x\")>0,\"x\",0)","v":0},null,"",null,0,0,0,0,0,""]
[119,null,"Communiquer des résultats ;"]
[120,null,"Traiter des données ;"]
[121,null,"Simuler des phénomènes ;"]
[122,null,"RIeprésenter des objets techniques."]
[123,null,"Identifier des sources d’informations fiables."]
[124,null,"ADOPTER UN COMPORTEMENT ETHIQUE ET RESPONSABLE",null,{"$f":"IF(COUNTIF(E125:E126,\"x\")>0,\"x\",0)","v":0},null,{"$f":"IF(COUNTIF(G125:G126,\"x\")>0,\"x\",0)","v":0},null,{"$f":"IF(COUNTIF(I125:I126,\"x\")>0,\"x\",0)","v":0},null,{"$f":"IF(COUNTIF(K125:K126,\"x\")>0,\"x\",0)","v":0},null,{"$f":"IF(COUNTIF(M125:M126,\"x\")>0,\"x\",0)","v":0},null,{"$f":"IF(COUNTIF(E124:M124,\"X\"),\"X\",\"\")","v":""},null,{"$f":"E124","v":0},{"$f":"G124","v":0},{"$f":"I124","v":0},{"$f":"K124","v":0},{"$f":"M124","v":0},{"$f":"O124","v":""}]
[125,null,"Relier des connaissances acquises en sciences et technologie à des questions de santé, de sécurité et d’environnement.",{"$nulls":11},{"$f":"IF(COUNTIF(E125:M125,\"X\"),\"X\",\"\")","v":""},null,{"$f":"E125","v":0},{"$f":"G125","v":0},{"$f":"I125","v":0},{"$f":"K125","v":0},{"$f":"M125","v":0},{"$f":"O125","v":""}]
[126,null,"Mettre en œuvre une action responsable et citoyenne, ",{"$nulls":11},"",null,0,0,0,0,0,""]
[127,null,"SE SITUER DANS L'ESPACE ET DANS LE TEMPS",null,{"$f":"IF(COUNTIF(E128:E129,\"x\")>0,\"x\",0)","v":0},null,{"$f":"IF(COUNTIF(G128:G129,\"x\")>0,\"x\",0)","v":0},null,{"$f":"IF(COUNTIF(I128:I129,\"x\")>0,\"x\",0)","v":0},null,{"$f":"IF(COUNTIF(K128:K129,\"x\")>0,\"x\",0)","v":0},null,{"$f":"IF(COUNTIF(M128:M129,\"x\")>0,\"x\",0)","v":0},null,"",null,0,0,0,0,0,""]
[128,null,"Replacer des évolutions scientifiques et technologiques dans un contexte historique, géographique, économique et culturel.",{"$nulls":11},"",null,0,0,0,0,0,""]
[129,null,"Se situer dans l’environnement et maitriser les notions d’échelle.",{"$nulls":11},"",null,0,0,0,0,0,""]
[130,"LVE","ECOUTER ET COMPRENDRE",null,{"$f":"IF(COUNTIF(E131:E133,\"x\")>0,\"x\",0)","v":0},null,{"$f":"IF(COUNTIF(G131:G133,\"x\")>0,\"x\",0)","v":0},null,{"$f":"IF(COUNTIF(I131:I133,\"x\")>0,\"x\",0)","v":0},null,{"$f":"IF(COUNTIF(K131:K133,\"x\")>0,\"x\",0)","v":0},null,{"$f":"IF(COUNTIF(M131:M133,\"x\")>0,\"x\",0)","v":0},null,"",null,0,0,0,0,0,""]
[131,null,"Écouter et comprendre des messages oraux simples relevant de la vie quotidienne, des histoires simples. ",{"$nulls":11},"",null,0,0,0,0,0,""]
[132,null,"Exercer sa mémoire auditive à court et à long terme pour mémoriser des mots, des expressions courantes."]
[133,null,"Utiliser des indices sonores et visuels pour déduire le sens de mots inconnus, d’un message."]
[134,null,"LIRE ET COMPRENDRE",null,{"$f":"IF(COUNTIF(E135:E138,\"x\")>0,\"x\",0)","v":0},null,{"$f":"IF(COUNTIF(G135:G138,\"x\")>0,\"x\",0)","v":0},null,{"$f":"IF(COUNTIF(I135:I138,\"x\")>0,\"x\",0)","v":0},null,{"$f":"IF(COUNTIF(K135:K138,\"x\")>0,\"x\",0)","v":0},null,{"$f":"IF(COUNTIF(M135:M138,\"x\")>0,\"x\",0)","v":0},null,"",null,0,0,0,0,0,""]
[{"$f":"A134+1","v":135},null,"Utiliser le contexte, les illustrations et les connaissances pour comprendre un texte.",{"$nulls":11},"",null,0,0,0,0,0,""]
[136,null,"Reconnaitre des mots isolés dans un énoncé, un court texte."]
[137,null,"S’appuyer sur des mots outils, des structures simples, des expressions rituelles."]
[138,null,"Percevoir la relation entre certains graphèmes et phonèmes spécifiques à la langue."]
[139,null,"PARLER EN CONTINUE",null,{"$f":"IF(COUNTIF(E144:E145,\"x\")>0,\"x\",0)","v":0},null,{"$f":"IF(COUNTIF(G144:G145,\"x\")>0,\"x\",0)","v":0},null,{"$f":"IF(COUNTIF(I144:I145,\"x\")>0,\"x\",0)","v":0},null,{"$f":"IF(COUNTIF(K144:K145,\"x\")>0,\"x\",0)","v":0},null,{"$f":"IF(COUNTIF(M144:M145,\"x\")>0,\"x\",0)","v":0},null,"",null,0,0,0,0,0,""]
[140,null,"Mémoriser et reproduire des énoncés.",{"$nulls":11},""]
[141,null,"S’exprimer de manière audible, en modulant débit et voix."]
[142,null,"Participer à des échanges simples ,pour être entendu et compris dans quelques situations diversifiées de la vie quotidienne.",{"$nulls":11},""]
[143,null,"ECRIRE",null,{"$f":"IF(COUNTIF(E144:E145,\"x\")>0,\"x\",0)","v":0},null,{"$f":"IF(COUNTIF(G144:G145,\"x\")>0,\"x\",0)","v":0},null,{"$f":"IF(COUNTIF(I144:I145,\"x\")>0,\"x\",0)","v":0},null,{"$f":"IF(COUNTIF(K144:K145,\"x\")>0,\"x\",0)","v":0},null,{"$f":"IF(COUNTIF(M144:M145,\"x\")>0,\"x\",0)","v":0},null,{"$f":"IF(COUNTIF(E143:M143,\"X\"),\"X\",\"\")","v":""}]
[144,null,"Écrire des mots et des expressions dont l’orthographe et la syntaxe ont été mémorisées. ",{"$nulls":11},{"$f":"IF(COUNTIF(E144:M144,\"X\"),\"X\",\"\")","v":""},null,0,0,0,0,0,""]
[145,null,"Mobiliser des structures simples pour écrire des phrases en s’appuyant sur une trame connue.",{"$nulls":11},{"$f":"IF(COUNTIF(E145:M145,\"X\"),\"X\",\"\")","v":""}]
[146,null,"REAGIR ET DIALOGUER",null,{"$f":"IF(COUNTIF(E147:E149,\"x\")>0,\"x\",0)","v":0},null,{"$f":"IF(COUNTIF(G147:G149,\"x\")>0,\"x\",0)","v":0},null,{"$f":"IF(COUNTIF(I147:I149,\"x\")>0,\"x\",0)","v":0},null,{"$f":"IF(COUNTIF(K147:K149,\"x\")>0,\"x\",0)","v":0},null,{"$f":"IF(COUNTIF(M147:M149,\"x\")>0,\"x\",0)","v":0},null,{"$f":"IF(COUNTIF(E146:M146,\"X\"),\"X\",\"\")","v":""}]
[147,null,"Poser des questions simples.",{"$nulls":11},{"$f":"IF(COUNTIF(E147:M147,\"X\"),\"X\",\"\")","v":""}]
[148,null,"Mobiliser des énoncés adéquats au contexte dans une succession d’échanges ritualisés."]
[149,null,"Utiliser des procédés très simples pour commencer, poursuivre et terminer une conversation brève.",{"$nulls":11},{"$f":"IF(COUNTIF(E149:M149,\"X\"),\"X\",\"\")","v":""}]
[150,null,"ASPECTS CULTURELS",null,{"$f":"IF(COUNTIF(E151:E152,\"x\")>0,\"x\",0)","v":0},null,{"$f":"IF(COUNTIF(G151:G152,\"x\")>0,\"x\",0)","v":0},null,{"$f":"IF(COUNTIF(I151:I152,\"x\")>0,\"x\",0)","v":0},null,{"$f":"IF(COUNTIF(K151:K152,\"x\")>0,\"x\",0)","v":0},null,{"$f":"IF(COUNTIF(M151:M152,\"x\")>0,\"x\",0)","v":0},null,"",null,0,0,0,0,0,""]
[151,null,"Identifier quelques grands repères culturels de l’environnement quotidien des élèves du même âge dans les pays ou régions étudiés.",{"$nulls":11},{"$f":"IF(COUNTIF(E151:M151,\"X\"),\"X\",\"\")","v":""}]
[152,null,"Mobiliser ses connaissances culturelles pour décrire ou raconter des personnages réels ou imaginaires.",{"$nulls":11},"",null,0,0,0,0,0,""]
[153,"ARTS PLASTIQUES","EXPERIMENTER, PRODUIRE, CRÉER",null,{"$f":"IF(COUNTIF(E154:E170,\"x\")>0,\"x\",0)","v":0},null,{"$f":"IF(COUNTIF(G154:G170,\"x\")>0,\"x\",0)","v":0},null,{"$f":"IF(COUNTIF(I154:I170,\"x\")>0,\"x\",0)","v":0},null,{"$f":"IF(COUNTIF(K154:K170,\"x\")>0,\"x\",0)","v":0},null,{"$f":"IF(COUNTIF(M154:M170,\"x\")>0,\"x\",0)","v":0},null,"",null,0,0,0,0,0,""]
[154,null,"Choisir, organiser et mobiliser des gestes, des outils et des matériaux en fonction des effets qu’ils produisent.",{"$nulls":11},"",null,0,0,0,0,0,""]
[155,null,"Représenter le monde environnant ou donner forme à son imaginaire en explorant divers domaines.",{"$nulls":11},"",null,0,0,0,0,0,""]
[156,null,"Rechercher une expression personnelle en s’éloignant des stéréotypes.",{"$nulls":11},"",null,0,0,0,0,0,""]
[157,null,"Intégrer l’usage des outils informatiques de travail de l’image et de recherche d’information, au service de la pratique plastique.",{"$nulls":11},"",null,0,0,0,0,0,""]
[158,null,"METTRE EN OEUVRE UN PROJET ARTISTIQUE",null,{"$f":"IF(COUNTIF(E159:E175,\"x\")>0,\"x\",0)","v":0},null,{"$f":"IF(COUNTIF(G159:G175,\"x\")>0,\"x\",0)","v":0},null,{"$f":"IF(COUNTIF(I159:I175,\"x\")>0,\"x\",0)","v":0},null,{"$f":"IF(COUNTIF(K159:K175,\"x\")>0,\"x\",0)","v":0},null,{"$f":"IF(COUNTIF(M159:M175,\"x\")>0,\"x\",0)","v":0},null,"",null,0,0,0,0,0,""]
[159,null,"Identifier les principaux outils et compétences nécessaires à la réalisation d’un projet artistique.",{"$nulls":11},"",null,0,0,0,0,0,""]
[160,null,"Se repérer dans les étapes de la réalisation d’une production plastique individuelle ou collective, anticiper les difficultés éventuelles.",{"$nulls":11},"",null,0,0,0,0,0,""]
[161,null,"Identifier et assumer sa part de responsabilité dans un processus coopératif de création."]
[162,null,"Adapter son projet en fonction des contraintes de réalisation et de la prise en compte du spectateur.",{"$nulls":11},"",null,0,0,0,0,0,""]
[163,null,"S'EXPRIMER, ANALYSER SA PRATIQUE, CELLE DE SES PAIRS",null,{"$f":"IF(COUNTIF(E164:E183,\"x\")>0,\"x\",0)","v":0},null,{"$f":"IF(COUNTIF(G164:G183,\"x\")>0,\"x\",0)","v":0},null,{"$f":"IF(COUNTIF(I164:I183,\"x\")>0,\"x\",0)","v":0},null,{"$f":"IF(COUNTIF(K164:K183,\"x\")>0,\"x\",0)","v":0},null,{"$f":"IF(COUNTIF(M164:M183,\"x\")>0,\"x\",0)","v":0},null,"",null,0,0,0,0,0,""]
[164,null,"Décrire et interroger à l’aide d’un vocabulaire spécifique ses productions plastiques, celles de ses pairs et des œuvres d’art étudiées en classe.",{"$nulls":11},"",null,0,0,0,0,0,""]
[165,null,"Justifier des choix pour rendre compte du cheminement qui conduit de l’intention à la réalisation.",{"$nulls":11},"",null,0,0,0,0,0,""]
[166,null,"Formuler une expression juste de ses émotions, en prenant appui sur ses propres réalisations plastiques, celles des autres élèves et des œuvres d’art.",{"$nulls":11},"",null,0,0,0,0,0,""]
[167,null,"SE REPERER DANS LES DOMAINES LIES AUX ARTS PLASTIQUES",null,{"$f":"IF(COUNTIF(E168:E206,\"x\")>0,\"x\",0)","v":0},null,{"$f":"IF(COUNTIF(G168:G206,\"x\")>0,\"x\",0)","v":0},null,{"$f":"IF(COUNTIF(I168:I206,\"x\")>0,\"x\",0)","v":0},null,{"$f":"IF(COUNTIF(K168:K206,\"x\")>0,\"x\",0)","v":0},null,{"$f":"IF(COUNTIF(M168:M206,\"x\")>0,\"x\",0)","v":0},null,{"$f":"IF(COUNTIF(E167:M167,\"X\"),\"X\",\"\")","v":""}]
[168,null,"Repérer, pour les dépasser, certains a priori et stéréotypes culturels et artistiques.",{"$nulls":11},{"$f":"IF(COUNTIF(E168:M168,\"X\"),\"X\",\"\")","v":""}]
[169,null,"Identifier quelques caractéristiques qui inscrivent une œuvre d’art dans une aire géographique ou culturelle et dans un temps historique, contemporain, proche ou lointain.",{"$nulls":11},{"$f":"IF(COUNTIF(E169:M169,\"X\"),\"X\",\"\")","v":""}]
[170,null,"Décrire des œuvres d’art, en proposer une compréhension personnelle argumentée.",{"$nulls":11},{"$f":"IF(COUNTIF(E170:M170,\"X\"),\"X\",\"\")","v":""}]
[171,"EDUCATION MUSICALE","CHANTER ET INTERPRETER",null,{"$f":"IF(COUNTIF(E172:E183,\"x\")>0,\"x\",0)","v":0},null,{"$f":"IF(COUNTIF(G172:G183,\"x\")>0,\"x\",0)","v":0},null,{"$f":"IF(COUNTIF(I172:I183,\"x\")>0,\"x\",0)","v":0},null,{"$f":"IF(COUNTIF(K172:K183,\"x\")>0,\"x\",0)","v":0},null,{"$f":"IF(COUNTIF(M172:M183,\"x\")>0,\"x\",0)","v":0},null,"",null,0,0,0,0,0,""]
[172,null,"Reproduire et interpréter un modèle mélodique et rythmique.",{"$nulls":11},"",null,0,0,0,0,0,""]
[173,null,"Interpréter un répertoire varié avec expressivité.",{"$nulls":11},"",null,0,0,0,0,0,""]
[174,null,"ECOUTER, COMPARER ET COMMENTER",null,{"$f":"IF(COUNTIF(E175:E211,\"x\")>0,\"x\",0)","v":0},null,{"$f":"IF(COUNTIF(G175:G211,\"x\")>0,\"x\",0)","v":0},null,{"$f":"IF(COUNTIF(I175:I211,\"x\")>0,\"x\",0)","v":0},null,{"$f":"IF(COUNTIF(K175:K211,\"x\")>0,\"x\",0)","v":0},null,{"$f":"IF(COUNTIF(M175:M211,\"x\")>0,\"x\",0)","v":0},null,"",null,0,0,0,0,0,""]
[175,null,"Décrire et comparer des éléments sonores issus de contextes musicaux différents.",{"$nulls":11},"",null,0,0,0,0,0,""]
[176,null,"Identifier et nommer ressemblances et différences dans deux extraits musicaux."]
[177,null,"Identifier quelques caractéristiques qui inscrivent une œuvre musicale dans une aire géographique ou culturelle et dans un temps historique contemporain, proche ou lointain.",{"$nulls":11},"",null,0,0,0,0,0,""]
[178,null,"EXPLORER, IMAGINER",null,{"$f":"IF(COUNTIF(E179:E214,\"x\")>0,\"x\",0)","v":0},null,{"$f":"IF(COUNTIF(G179:G214,\"x\")>0,\"x\",0)","v":0},null,{"$f":"IF(COUNTIF(I179:I214,\"x\")>0,\"x\",0)","v":0},null,{"$f":"IF(COUNTIF(K179:K214,\"x\")>0,\"x\",0)","v":0},null,{"$f":"IF(COUNTIF(M179:M214,\"x\")>0,\"x\",0)","v":0},null,"",null,0,0,0,0,0,""]
[179,null,"Imaginer l’organisation de différents éléments sonores.",{"$nulls":11},"",null,0,0,0,0,0,""]
[180,null,"Faire des propositions personnelles lors de moments de création, d’invention et d’interprétation.",{"$nulls":11},"",null,0,0,0,0,0,""]
[181,null,"ECHANGER, PARTAGER",null,{"$f":"IF(COUNTIF(E182:E217,\"x\")>0,\"x\",0)","v":0},null,{"$f":"IF(COUNTIF(G182:G217,\"x\")>0,\"x\",0)","v":0},null,{"$f":"IF(COUNTIF(I182:I217,\"x\")>0,\"x\",0)","v":0},null,{"$f":"IF(COUNTIF(K182:K217,\"x\")>0,\"x\",0)","v":0},null,{"$f":"IF(COUNTIF(M182:M217,\"x\")>0,\"x\",0)","v":0},null,"",null,0,0,0,0,0,""]
[182,null,"Argumenter un jugement sur une musique.",{"$nulls":11},"",null,0,0,0,0,0,""]
[183,null,"Écouter et respecter le point de vue des autres et l’expression de leur sensibilité.",{"$nulls":11},"",null,0,0,0,0,0,""]
[184,null,"HISTOIRE DES ARTS",null,{"$f":"IF(COUNTIF(E185:E230,\"x\")>0,\"x\",0)","v":0},null,{"$f":"IF(COUNTIF(G185:G230,\"x\")>0,\"x\",0)","v":0},null,{"$f":"IF(COUNTIF(I185:I230,\"x\")>0,\"x\",0)","v":0},null,{"$f":"IF(COUNTIF(K185:K230,\"x\")>0,\"x\",0)","v":0},null,{"$f":"IF(COUNTIF(M185:M230,\"x\")>0,\"x\",0)","v":0},null,{"$f":"IF(COUNTIF(E184:M184,\"X\"),\"X\",\"\")","v":""}]
[185,null,"Identifier : donner un avis argumenté sur ce que représente ou exprime une œuvre d’art. ",{"$nulls":11},{"$f":"IF(COUNTIF(E185:M185,\"X\"),\"X\",\"\")","v":""}]
[186,null,"Analyser : dégager d’une œuvre d’art, par l’observation ou l’écoute, ses principales caractéristiques techniques et formelles.",{"$nulls":11},{"$f":"IF(COUNTIF(E186:M186,\"X\"),\"X\",\"\")","v":""}]
[187,null,"Situer : relier des caractéristiques d’une œuvre d’art à des usages ainsi qu’au contexte historique et culturel de sa création.",{"$nulls":11},{"$f":"IF(COUNTIF(E187:M187,\"X\"),\"X\",\"\")","v":""}]
[188,null,"Se repérer dans un musée, un lieu d’art, un site patrimonial.",{"$nulls":11},{"$f":"IF(COUNTIF(E188:M188,\"X\"),\"X\",\"\")","v":""}]
[189,"EPS","DEVELOPPER SA MOTRICITE, LE LANGAGE DU CORPS ",null,{"$f":"IF(COUNTIF(E190:E192,\"x\")>0,\"x\",0)","v":0},null,{"$f":"IF(COUNTIF(G190:G192,\"x\")>0,\"x\",0)","v":0},null,{"$f":"IF(COUNTIF(I190:I192,\"x\")>0,\"x\",0)","v":0},null,{"$f":"IF(COUNTIF(K190:K192,\"x\")>0,\"x\",0)","v":0},null,{"$f":"IF(COUNTIF(M190:M192,\"x\")>0,\"x\",0)","v":0},null,"",null,0,0,0,0,0,""]
[190,null,"Adapter sa motricité à des situations variées.",{"$nulls":11},"",null,0,0,0,0,0,""]
[191,null,"Acquérir des techniques spécifiques pour améliorer son efficacité.",{"$nulls":11},"",null,0,0,0,0,0,""]
[192,null,"Mobiliser différentes ressources (physiologique, biomécanique, psychologique, émotionnelle) pour agir de manière efficiente.",{"$nulls":11},"",null,0,0,0,0,0,""]
[193,null,"S’APPROPRIER LES MÉTHODES ET OUTILS POUR APPRENDRE",null,{"$f":"IF(COUNTIF(E194:E196,\"x\")>0,\"x\",0)","v":0},null,{"$f":"IF(COUNTIF(G194:G196,\"x\")>0,\"x\",0)","v":0},null,{"$f":"IF(COUNTIF(I194:I196,\"x\")>0,\"x\",0)","v":0},null,{"$f":"IF(COUNTIF(K194:K196,\"x\")>0,\"x\",0)","v":0},null,{"$f":"IF(COUNTIF(M194:M196,\"x\")>0,\"x\",0)","v":0},null,"",null,0,0,0,0,0,""]
[194,null,"Apprendre par l’action, l’observation, l’analyse de son activité et de celle des autres. ",{"$nulls":11},"",null,0,0,0,0,0,""]
[195,null,"Répéter un geste pour le stabiliser et le rendre plus efficace."]
[196,null,"Utiliser des outils numériques pour observer, évaluer et modifier ses actions.",{"$nulls":11},"",null,0,0,0,0,0,""]
[197,null,"PARTAGER DES RÈGLES, ASSUMER DES RÔLES ",null,{"$f":"IF(COUNTIF(E198:E201,\"x\")>0,\"x\",0)","v":0},null,{"$f":"IF(COUNTIF(G198:G201,\"x\")>0,\"x\",0)","v":0},null,{"$f":"IF(COUNTIF(I198:I201,\"x\")>0,\"x\",0)","v":0},null,{"$f":"IF(COUNTIF(K198:K201,\"x\")>0,\"x\",0)","v":0},null,{"$f":"IF(COUNTIF(M198:M201,\"x\")>0,\"x\",0)","v":0},null,"",null,0,0,0,0,0,""]
[198,null,"Assumer les rôles sociaux  (joueur, arbitre,…).",{"$nulls":11},"",null,0,0,0,0,0,""]
[{"$f":"A198+1","v":199},null,"Comprendre, respecter et faire respecter règles et règlements."]
[200,null,"Assurer sa sécurité et celle d’autrui dans des situations variées.",{"$nulls":11},"",null,0,0,0,0,0,""]
[201,null,"S’engager dans les activités sportives et artistiques collectives.",{"$nulls":11},"",null,0,0,0,0,0,""]
[202,null,"ENTRETENIR SA SANTÉ ",null,{"$f":"IF(COUNTIF(E203:E205,\"x\")>0,\"x\",0)","v":0},null,{"$f":"IF(COUNTIF(G203:G205,\"x\")>0,\"x\",0)","v":0},null,{"$f":"IF(COUNTIF(I203:I205,\"x\")>0,\"x\",0)","v":0},null,{"$f":"IF(COUNTIF(K203:K205,\"x\")>0,\"x\",0)","v":0},null,{"$f":"IF(COUNTIF(M203:M205,\"x\")>0,\"x\",0)","v":0},null,"",null,0,0,0,0,0,""]
[203,null,"Évaluer la quantité et la qualité de son activité physique quotidienne dans et hors l’école.",{"$nulls":11},"",null,0,0,0,0,0,""]
[204,null,"Connaitre et appliquer des principes d’une bonne hygiène de vie."]
[205,null,"Adapter l’intensité de son engagement physique à ses possibilités pour ne pas se mettre en danger.",{"$nulls":11},"",null,0,0,0,0,0,""]
[206,null,"S’APPROPRIER UNE CULTURE PHYSIQUE SPORTIVE ET ARTISTIQUE ",null,{"$f":"IF(COUNTIF(E207:E208,\"x\")>0,\"x\",0)","v":0},null,{"$f":"IF(COUNTIF(G207:G208,\"x\")>0,\"x\",0)","v":0},null,{"$f":"IF(COUNTIF(I207:I208,\"x\")>0,\"x\",0)","v":0},null,{"$f":"IF(COUNTIF(K207:K208,\"x\")>0,\"x\",0)","v":0},null,{"$f":"IF(COUNTIF(M207:M208,\"x\")>0,\"x\",0)","v":0},null,"",null,0,0,0,0,0,""]
[207,null,"Savoir situer des performances à l’échelle de la performance humaine.",{"$nulls":11},"",null,0,0,0,0,0,""]
[208,null,"Comprendre et respecter l’environnement des pratiques physiques et sportives.",{"$nulls":11},"",null,0,0,0,0,0,""]
[209,"EMC","ENSEIGNEMENT CIVIQUE ET MORAL",null,{"$f":"IF(COUNTIF(E210:E215,\"x\")>0,\"x\",0)","v":0},null,{"$f":"IF(COUNTIF(G210:G215,\"x\")>0,\"x\",0)","v":0},null,{"$f":"IF(COUNTIF(I210:I215,\"x\")>0,\"x\",0)","v":0},null,{"$f":"IF(COUNTIF(K210:K215,\"x\")>0,\"x\",0)","v":0},null,{"$f":"IF(COUNTIF(M210:M215,\"x\")>0,\"x\",0)","v":0},null,"",null,0,0,0,0,0,""]
[210,null," Identifier et partager des émotions, des sentiments dans des situations et à propos d'objets diversifiés.",{"$nulls":11},"",null,0,0,0,0,0,""]
[211,null,"Se situer et s'exprimer en respectant les codes de la communication orale, les règles de l'échange et le statut de l'interlocuteur.",{"$nulls":11},{"$f":"IF(COUNTIF(E211:M211,\"X\"),\"X\",\"\")","v":""},null,{"$f":"E211","v":0},{"$f":"G211","v":0},{"$f":"I211","v":0},{"$f":"K211","v":0},{"$f":"M211","v":0},{"$f":"O211","v":""}]
[212,null,"Prendre soin de soi et des autres.",{"$nulls":11},{"$f":"IF(COUNTIF(E212:M212,\"X\"),\"X\",\"\")","v":""},null,{"$f":"E212","v":0},{"$f":"G212","v":0},{"$f":"I212","v":0},{"$f":"K212","v":0},{"$f":"M212","v":0},{"$f":"O212","v":""}]
[213,null,"Accepter les différences. ",{"$nulls":11},{"$f":"IF(COUNTIF(E213:M213,\"X\"),\"X\",\"\")","v":""},null,{"$f":"E213","v":0},{"$f":"G213","v":0},{"$f":"I213","v":0},{"$f":"K213","v":0},{"$f":"M213","v":0},{"$f":"O213","v":""}]
[214,null,"Identifier les symboles de la République présents dans l'école. ",{"$nulls":11},{"$f":"IF(COUNTIF(E214:M214,\"X\"),\"X\",\"\")","v":""},null,{"$f":"E214","v":0},{"$f":"G214","v":0},{"$f":"I214","v":0},{"$f":"K214","v":0},{"$f":"M214","v":0},{"$f":"O214","v":""}]
[215,null,"Apprendre à coopérer. ",{"$nulls":11},{"$f":"IF(COUNTIF(E215:M215,\"X\"),\"X\",\"\")","v":""},null,{"$f":"E215","v":0},{"$f":"G215","v":0},{"$f":"I215","v":0},{"$f":"K215","v":0},{"$f":"M215","v":0},{"$f":"O215","v":""}]

{"sheet":"Période","index":4,"n_rows":215,"n_cols":48,"rows_kept":215,"hidden":true,"merged":[[4,1,26,1],[4,48,26,48],[27,1,53,1],[27,48,53,48],[54,1,91,1],[54,48,91,48],[92,1,128,1],[92,48,128,48],[129,1,151,1],[129,48,151,48],[152,1,169,1],[152,48,169,48],[170,1,182,1],[183,1,187,1],[183,48,187,48],[188,1,207,1],[188,48,207,48],[208,1,214,1],[208,48,214,48]]}
[{"$nulls":3},1,2,3,4,5,6,7,8,9,10,11,12,13,14,15,16,17,18,19,20,21,22,23,24,25,26,27,28,29,30,31,32,33,{"$nulls":10},"A",{"$f":"Renseignements!C49","v":5}]
[{"$nulls":46},"B"]
[{"$nulls":3},{"$f":"IF(ISBLANK(INDEX(nom,noligne,1)),\"\",(INDEX(prenom,noligne,1))&\" \" &(INDEX(nom,noligne,1)))","v":"Marc Aurèle"},"Jérôme Lenoir","Fabien Léglise","Aicha Samarahoui","Karim Maha","","","","","","","","","","","","","","","","","","","","","","","","","","","","",{"$nulls":10},"C"]
[{"$nulls":39},"A","B","C","D","NE",null,null,"D"]
[null,"FRANCAIS","LANGAGE ORAL",{"$f":"COUNTA(D6:D9)*10","v":0},{"$f":"COUNTA(E6:E9)*10","v":0},0,0,0,0,0,0,0,0,0,0,0,0,0,0,0,0,0,0,0,0,0,0,0,0,0,0,0,0,0,0,0]
[null,null,"Écouter pour comprendre un message oral, un propos, un discours, un texte lu.",{"$nulls":36},{"$f":"COUNTIF($D6:$AJ6,$AU$1)/$AV$1","v":{"v":0,"d":"0%"}},{"$f":"COUNTIF($D6:$AJ6,$AU$2)/$AV$1","v":{"v":0,"d":"0%"}},{"$f":"COUNTIF($D6:$AJ6,$AU$3)/$AV$1","v":{"v":0,"d":"0%"}},{"$f":"COUNTIF($D6:$AJ6,$AU$4)/$AV$1","v":{"v":0,"d":"0%"}},{"$f":"COUNTIF(D6:$AJ6,\"NE\")/$AV$1","v":{"v":0,"d":"0%"}},{"$f":"AN6+(AO6*0.66)+(AP6*0.33)","v":{"v":0,"d":"0%"}}]
[null,null,"Parler en prenant en compte son auditoire.",{"$nulls":36},{"$f":"COUNTIF($D7:$AJ7,$AU$1)/$AV$1","v":{"v":0,"d":"0%"}},{"$f":"COUNTIF($D7:$AJ7,$AU$2)/$AV$1","v":{"v":0,"d":"0%"}},{"$f":"COUNTIF($D7:$AJ7,$AU$3)/$AV$1","v":{"v":0,"d":"0%"}},{"$f":"COUNTIF($D7:$AJ7,$AU$4)/$AV$1","v":{"v":0,"d":"0%"}},{"$f":"COUNTIF(D7:$AJ7,\"NE\")/$AV$1","v":{"v":0,"d":"0%"}},{"$f":"AN7+(AO7*0.66)+(AP7*0.33)","v":{"v":0,"d":"0%"}}]
[null,null,"Participer à des échanges dans des situations diversifiées.",{"$nulls":36},{"$f":"COUNTIF($D8:$AJ8,$AU$1)/$AV$1","v":{"v":0,"d":"0%"}},{"$f":"COUNTIF($D8:$AJ8,$AU$2)/$AV$1","v":{"v":0,"d":"0%"}},{"$f":"COUNTIF($D8:$AJ8,$AU$3)/$AV$1","v":{"v":0,"d":"0%"}},{"$f":"COUNTIF($D8:$AJ8,$AU$4)/$AV$1","v":{"v":0,"d":"0%"}},{"$f":"COUNTIF(D8:$AJ8,\"NE\")/$AV$1","v":{"v":0,"d":"0%"}},{"$f":"AN8+(AO8*0.66)+(AP8*0.33)","v":{"v":0,"d":"0%"}}]
[null,null,"Adopter une attitude critique par rapport au langage produit.",{"$nulls":36},{"$f":"COUNTIF($D9:$AJ9,$AU$1)/$AV$1","v":{"v":0,"d":"0%"}},{"$f":"COUNTIF($D9:$AJ9,$AU$2)/$AV$1","v":{"v":0,"d":"0%"}},{"$f":"COUNTIF($D9:$AJ9,$AU$3)/$AV$1","v":{"v":0,"d":"0%"}},{"$f":"COUNTIF($D9:$AJ9,$AU$4)/$AV$1","v":{"v":0,"d":"0%"}},{"$f":"COUNTIF(D9:$AJ9,\"NE\")/$AV$1","v":{"v":0,"d":"0%"}},{"$f":"AN9+(AO9*0.66)+(AP9*0.33)","v":{"v":0,"d":"0%"}}]
[null,null,"LIRE",{"$f":"COUNTA(D11:D14)*10","v":0},0,0,0,0,0,0,0,0,0,0,0,0,0,0,0,0,0,0,0,0,0,0,0,0,0,0,0,0,0,0,0,0]
[null,null,"Lire avec fluidité.",{"$nulls":36},{"$f":"COUNTIF($D11:$AJ11,$AU$1)/$AV$1","v":{"v":0,"d":"0%"}},{"$f":"COUNTIF($D11:$AJ11,$AU$2)/$AV$1","v":{"v":0,"d":"0%"}},{"$f":"COUNTIF($D11:$AJ11,$AU$3)/$AV$1","v":{"v":0,"d":"0%"}},{"$f":"COUNTIF($D11:$AJ11,$AU$4)/$AV$1","v":{"v":0,"d":"0%"}},{"$f":"COUNTIF(D11:$AJ11,\"NE\")/$AV$1","v":{"v":0,"d":"0%"}},{"$f":"AN11+(AO11*0.66)+(AP11*0.33)","v":{"v":0,"d":"0%"}}]
[null,null,"Comprendre un texte littéraire et l’interpréter.",{"$nulls":36},{"$f":"COUNTIF($D12:$AJ12,$AU$1)/$AV$1","v":{"v":0,"d":"0%"}},{"$f":"COUNTIF($D12:$AJ12,$AU$2)/$AV$1","v":{"v":0,"d":"0%"}},{"$f":"COUNTIF($D12:$AJ12,$AU$3)/$AV$1","v":{"v":0,"d":"0%"}},{"$f":"COUNTIF($D12:$AJ12,$AU$4)/$AV$1","v":{"v":0,"d":"0%"}},{"$f":"COUNTIF(D12:$AJ12,\"NE\")/$AV$1","v":{"v":0,"d":"0%"}},{"$f":"AN12+(AO12*0.66)+(AP12*0.33)","v":{"v":0,"d":"0%"}}]
[null,null,"Comprendre des textes, des documents et des images et les interpréter. ",{"$nulls":36},{"$f":"COUNTIF($D13:$AJ13,$AU$1)/$AV$1","v":{"v":0,"d":"0%"}},{"$f":"COUNTIF($D13:$AJ13,$AU$2)/$AV$1","v":{"v":0,"d":"0%"}},{"$f":"COUNTIF($D13:$AJ13,$AU$3)/$AV$1","v":{"v":0,"d":"0%"}},{"$f":"COUNTIF($D13:$AJ13,$AU$4)/$AV$1","v":{"v":0,"d":"0%"}},{"$f":"COUNTIF(D13:$AJ13,\"NE\")/$AV$1","v":{"v":0,"d":"0%"}},{"$f":"AN13+(AO13*0.66)+(AP13*0.33)","v":{"v":0,"d":"0%"}}]
[null,null,"Contrôler sa compréhension, être un lecteur autonome.",{"$nulls":36},{"$f":"COUNTIF($D14:$AJ14,$AU$1)/$AV$1","v":{"v":0,"d":"0%"}},{"$f":"COUNTIF($D14:$AJ14,$AU$2)/$AV$1","v":{"v":0,"d":"0%"}},{"$f":"COUNTIF($D14:$AJ14,$AU$3)/$AV$1","v":{"v":0,"d":"0%"}},{"$f":"COUNTIF($D14:$AJ14,$AU$4)/$AV$1","v":{"v":0,"d":"0%"}},{"$f":"COUNTIF(D14:$AJ14,\"NE\")/$AV$1","v":{"v":0,"d":"0%"}},{"$f":"AN14+(AO14*0.66)+(AP14*0.33)","v":{"v":0,"d":"0%"}}]
[null,null,"ECRIRE",{"$f":"COUNTA(D16:D21)*10","v":0},0,0,0,0,0,0,0,0,0,0,0,0,0,0,0,0,0,0,0,0,0,0,0,0,0,0,0,0,0,0,0,0]
[null,null,"Écrire à la main de manière fluide et efficace.",{"$nulls":36},{"$f":"COUNTIF($D16:$AJ16,$AU$1)/$AV$1","v":{"v":0,"d":"0%"}},{"$f":"COUNTIF($D16:$AJ16,$AU$2)/$AV$1","v":{"v":0,"d":"0%"}},{"$f":"COUNTIF($D16:$AJ16,$AU$3)/$AV$1","v":{"v":0,"d":"0%"}},{"$f":"COUNTIF($D16:$AJ16,$AU$4)/$AV$1","v":{"v":0,"d":"0%"}},{"$f":"COUNTIF(D16:$AJ16,\"NE\")/$AV$1","v":{"v":0,"d":"0%"}},{"$f":"AN16+(AO16*0.66)+(AP16*0.33)","v":{"v":0,"d":"0%"}}]
[null,null,"Écrire avec un clavier rapidement et efficacement. ",{"$nulls":36},{"v":0,"d":"0%"},{"v":0,"d":"0%"},{"v":0,"d":"0%"},{"v":0,"d":"0%"},{"$f":"COUNTIF(D17:$AJ17,\"NE\")/$AV$1","v":{"v":0,"d":"0%"}},{"v":0,"d":"0%"}]
[null,null,"Recourir à l’écriture pour réfléchir et pour apprendre. ",{"$nulls":36},{"v":0,"d":"0%"},{"v":0,"d":"0%"},{"v":0,"d":"0%"},{"v":0,"d":"0%"},{"$f":"COUNTIF(D18:$AJ18,\"NE\")/$AV$1","v":{"v":0,"d":"0%"}},{"v":0,"d":"0%"}]
[null,null,"Produire des écrits variés.",{"$nulls":36},{"v":0,"d":"0%"},{"v":0,"d":"0%"},{"v":0,"d":"0%"},{"v":0,"d":"0%"},{"$f":"COUNTIF(D19:$AJ19,\"NE\")/$AV$1","v":{"v":0,"d":"0%"}},{"v":0,"d":"0%"}]
[null,null,"Réécrire à partir de nouvelles consignes ou faire évoluer son texte.",{"$nulls":36},{"v":0,"d":"0%"},{"v":0,"d":"0%"},{"v":0,"d":"0%"},{"v":0,"d":"0%"},{"$f":"COUNTIF(D20:$AJ20,\"NE\")/$AV$1","v":{"v":0,"d":"0%"}},{"v":0,"d":"0%"}]
[null,null,"Prendre en compte les normes de l’écrit pour formuler, transcrire et réviser.",{"$nulls":36},{"v":0,"d":"0%"},{"v":0,"d":"0%"},{"v":0,"d":"0%"},{"v":0,"d":"0%"},{"$f":"COUNTIF(D21:$AJ21,\"NE\")/$AV$1","v":{"v":0,"d":"0%"}},{"v":0,"d":"0%"}]
[null,null,"ETUDE DE LA LANGUE",{"$f":"COUNTA(D23:D27)*10","v":0},0,0,0,0,0,0,0,0,0,0,0,0,0,0,0,0,0,0,0,0,0,0,0,0,0,0,0,0,0,0,0,0]
[null,null,"Maitriser les relations entre l’oral et l’écrit.",{"$nulls":36},{"$f":"COUNTIF($D23:$AJ23,$AU$1)/$AV$1","v":{"v":0,"d":"0%"}},{"$f":"COUNTIF($D23:$AJ23,$AU$2)/$AV$1","v":{"v":0,"d":"0%"}},{"$f":"COUNTIF($D23:$AJ23,$AU$3)/$AV$1","v":{"v":0,"d":"0%"}},{"$f":"COUNTIF($D23:$AJ23,$AU$4)/$AV$1","v":{"v":0,"d":"0%"}},{"$f":"COUNTIF(D23:$AJ23,\"NE\")/$AV$1","v":{"v":0,"d":"0%"}},{"$f":"AN23+(AO23*0.66)+(AP23*0.33)","v":{"v":0,"d":"0%"}}]
[null,null,"Acquérir la structure, le sens et l’orthographe des mots.",{"$nulls":36},{"$f":"COUNTIF($D24:$AJ24,$AU$1)/$AV$1","v":{"v":0,"d":"0%"}},{"$f":"COUNTIF($D24:$AJ24,$AU$2)/$AV$1","v":{"v":0,"d":"0%"}},{"$f":"COUNTIF($D24:$AJ24,$AU$3)/$AV$1","v":{"v":0,"d":"0%"}},{"$f":"COUNTIF($D24:$AJ24,$AU$4)/$AV$1","v":{"v":0,"d":"0%"}},{"$f":"COUNTIF(D24:$AJ24,\"NE\")/$AV$1","v":{"v":0,"d":"0%"}},{"$f":"AN24+(AO24*0.66)+(AP24*0.33)","v":{"v":0,"d":"0%"}}]
[null,null,"Maitriser la forme des mots en lien avec la syntaxe.",{"$nulls":36},{"$f":"COUNTIF($D25:$AJ25,$AU$1)/$AV$1","v":{"v":0,"d":"0%"}},{"$f":"COUNTIF($D25:$AJ25,$AU$2)/$AV$1","v":{"v":0,"d":"0%"}},{"$f":"COUNTIF($D25:$AJ25,$AU$3)/$AV$1","v":{"v":0,"d":"0%"}},{"$f":"COUNTIF($D25:$AJ25,$AU$4)/$AV$1","v":{"v":0,"d":"0%"}},{"$f":"COUNTIF(D25:$AJ25,\"NE\")/$AV$1","v":{"v":0,"d":"0%"}},{"$f":"AN25+(AO25*0.66)+(AP25*0.33)","v":{"v":0,"d":"0%"}}]
[null,null,"Observer le fonctionnement du verbe et l’orthographier.",{"$nulls":36},{"$f":"COUNTIF($D26:$AJ26,$AU$1)/$AV$1","v":{"v":0,"d":"0%"}},{"$f":"COUNTIF($D26:$AJ26,$AU$2)/$AV$1","v":{"v":0,"d":"0%"}},{"$f":"COUNTIF($D26:$AJ26,$AU$3)/$AV$1","v":{"v":0,"d":"0%"}},{"$f":"COUNTIF($D26:$AJ26,$AU$4)/$AV$1","v":{"v":0,"d":"0%"}},{"$f":"COUNTIF(D26:$AJ26,\"NE\")/$AV$1","v":{"v":0,"d":"0%"}},{"$f":"AN26+(AO26*0.66)+(AP26*0.33)","v":{"v":0,"d":"0%"}}]
[null,null,"Identifier les constituants d’une phrase simple en relation avec son sens ; distinguer phrase simple et phrase complexe.",{"$nulls":36},{"$f":"COUNTIF($D27:$AJ27,$AU$1)/$AV$1","v":{"v":0,"d":"0%"}},{"$f":"COUNTIF($D27:$AJ27,$AU$2)/$AV$1","v":{"v":0,"d":"0%"}},{"$f":"COUNTIF($D27:$AJ27,$AU$3)/$AV$1","v":{"v":0,"d":"0%"}},{"$f":"COUNTIF($D27:$AJ27,$AU$4)/$AV$1","v":{"v":0,"d":"0%"}},{"$f":"COUNTIF(D27:$AJ27,\"NE\")/$AV$1","v":{"v":0,"d":"0%"}},{"$f":"AN27+(AO27*0.66)+(AP27*0.33)","v":{"v":0,"d":"0%"}}]
[null,"MATHEMATIQUES","NOMBRES ET CALCUL",{"$f":"COUNTA(D29:D31)*10","v":0},0,0,0,0,0,0,0,0,0,0,0,0,0,0,0,0,0,0,0,0,0,0,0,0,0,0,0,0,0,0,0,0]
[null,null,"Calculer avec des nombres décimaux.",{"$nulls":36},{"$f":"COUNTIF($D29:$AJ29,$AU$1)/$AV$1","v":{"v":0,"d":"0%"}},{"$f":"COUNTIF($D29:$AJ29,$AU$2)/$AV$1","v":{"v":0,"d":"0%"}},{"$f":"COUNTIF($D29:$AJ29,$AU$3)/$AV$1","v":{"v":0,"d":"0%"}},{"$f":"COUNTIF($D29:$AJ29,$AU$4)/$AV$1","v":{"v":0,"d":"0%"}},{"$f":"COUNTIF(D29:$AJ29,\"NE\")/$AV$1","v":{"v":0,"d":"0%"}},{"$f":"AN29+(AO29*0.66)+(AP29*0.33)","v":{"v":0,"d":"0%"}}]
[null,null,"Contrôler la vraisemblance de ses résultats. ",{"$nulls":36},{"$f":"COUNTIF($D30:$AJ30,$AU$1)/$AV$1","v":{"v":0,"d":"0%"}},{"$f":"COUNTIF($D30:$AJ30,$AU$2)/$AV$1","v":{"v":0,"d":"0%"}},{"$f":"COUNTIF($D30:$AJ30,$AU$3)/$AV$1","v":{"v":0,"d":"0%"}},{"$f":"COUNTIF($D30:$AJ30,$AU$4)/$AV$1","v":{"v":0,"d":"0%"}},{"$f":"COUNTIF(D30:$AJ30,\"NE\")/$AV$1","v":{"v":0,"d":"0%"}},{"$f":"AN30+(AO30*0.66)+(AP30*0.33)","v":{"v":0,"d":"0%"}}]
[null,null,"Utiliser une calculatrice pour trouver ou vérifier un résultat.",{"$nulls":36},{"$f":"COUNTIF($D31:$AJ31,$AU$1)/$AV$1","v":{"v":0,"d":"0%"}},{"$f":"COUNTIF($D31:$AJ31,$AU$2)/$AV$1","v":{"v":0,"d":"0%"}},{"$f":"COUNTIF($D31:$AJ31,$AU$3)/$AV$1","v":{"v":0,"d":"0%"}},{"$f":"COUNTIF($D31:$AJ31,$AU$4)/$AV$1","v":{"v":0,"d":"0%"}},{"$f":"COUNTIF(D31:$AJ31,\"NE\")/$AV$1","v":{"v":0,"d":"0%"}},{"$f":"AN31+(AO31*0.66)+(AP31*0.33)","v":{"v":0,"d":"0%"}}]
[null,null,"CHERCHER",{"$f":"COUNTA(D33:D35)*10","v":0},{"$f":"COUNTA(E33:E35)*10","v":0},0,0,0,0,0,0,0,0,0,0,0,0,0,0,0,0,0,0,0,0,0,0,0,0,0,0,0,0,0,0,0]
[null,null,"Prélever et organiser les informations nécessaires à la résolution de problèmes.",{"$nulls":36},{"$f":"COUNTIF($D33:$AJ33,$AU$1)/$AV$1","v":{"v":0,"d":"0%"}},{"$f":"COUNTIF($D33:$AJ33,$AU$2)/$AV$1","v":{"v":0,"d":"0%"}},{"$f":"COUNTIF($D33:$AJ33,$AU$3)/$AV$1","v":{"v":0,"d":"0%"}},{"$f":"COUNTIF($D33:$AJ33,$AU$4)/$AV$1","v":{"v":0,"d":"0%"}},{"$f":"COUNTIF(D33:$AJ33,\"NE\")/$AV$1","v":{"v":0,"d":"0%"}},{"$f":"AN33+(AO33*0.66)+(AP33*0.33)","v":{"v":0,"d":"0%"}}]
[null,null,"S’engager dans une démarche, observer, questionner, manipuler, expérimenter, émettre des hypothèses.",{"$nulls":36},{"$f":"COUNTIF($D34:$AJ34,$AU$1)/$AV$1","v":{"v":0,"d":"0%"}},{"$f":"COUNTIF($D34:$AJ34,$AU$2)/$AV$1","v":{"v":0,"d":"0%"}},{"$f":"COUNTIF($D34:$AJ34,$AU$3)/$AV$1","v":{"v":0,"d":"0%"}},{"$f":"COUNTIF($D34:$AJ34,$AU$4)/$AV$1","v":{"v":0,"d":"0%"}},{"$f":"COUNTIF(D34:$AJ34,\"NE\")/$AV$1","v":{"v":0,"d":"0%"}},{"$f":"AN34+(AO34*0.66)+(AP34*0.33)","v":{"v":0,"d":"0%"}}]
[null,null,"Tester, essayer plusieurs pistes de résolution.",{"$nulls":36},{"$f":"COUNTIF($D35:$AJ35,$AU$1)/$AV$1","v":{"v":0,"d":"0%"}},{"$f":"COUNTIF($D35:$AJ35,$AU$2)/$AV$1","v":{"v":0,"d":"0%"}},{"$f":"COUNTIF($D35:$AJ35,$AU$3)/$AV$1","v":{"v":0,"d":"0%"}},{"$f":"COUNTIF($D35:$AJ35,$AU$4)/$AV$1","v":{"v":0,"d":"0%"}},{"$f":"COUNTIF(D35:$AJ35,\"NE\")/$AV$1","v":{"v":0,"d":"0%"}},{"$f":"AN35+(AO35*0.66)+(AP35*0.33)","v":{"v":0,"d":"0%"}}]
[null,null,"MODELISER",{"$f":"COUNTA(D37:D40)*10","v":0},0,0,0,0,0,0,0,0,0,0,0,0,0,0,0,0,0,0,0,0,0,0,0,0,0,0,0,0,0,0,0,0]
[null,null,"Résoudre quelques problèmes issus de situations de la vie quotidienne. ",{"$nulls":36},{"$f":"COUNTIF($D37:$AJ37,$AU$1)/$AV$1","v":{"v":0,"d":"0%"}},{"$f":"COUNTIF($D37:$AJ37,$AU$2)/$AV$1","v":{"v":0,"d":"0%"}},{"$f":"COUNTIF($D37:$AJ37,$AU$3)/$AV$1","v":{"v":0,"d":"0%"}},{"$f":"COUNTIF($D37:$AJ37,$AU$4)/$AV$1","v":{"v":0,"d":"0%"}},{"$f":"COUNTIF(D37:$AJ37,\"NE\")/$AV$1","v":{"v":0,"d":"0%"}},{"$f":"AN37+(AO37*0.66)+(AP37*0.33)","v":{"v":0,"d":"0%"}}]
[null,null,"Reconnaitre et distinguer des problèmes relevant de situations additives, multiplicatives, de proportionnalité. ",{"$nulls":36},{"$f":"COUNTIF($D38:$AJ38,$AU$1)/$AV$1","v":{"v":0,"d":"0%"}},{"$f":"COUNTIF($D38:$AJ38,$AU$2)/$AV$1","v":{"v":0,"d":"0%"}},{"$f":"COUNTIF($D38:$AJ38,$AU$3)/$AV$1","v":{"v":0,"d":"0%"}},{"$f":"COUNTIF($D38:$AJ38,$AU$4)/$AV$1","v":{"v":0,"d":"0%"}},{"$f":"COUNTIF(D38:$AJ38,\"NE\")/$AV$1","v":{"v":0,"d":"0%"}},{"$f":"AN38+(AO38*0.66)+(AP38*0.33)","v":{"v":0,"d":"0%"}}]
[null,null,"Reconnaitre des situations réelles pouvant être modélisées par des relations géométriques (alignement, parallélisme, perpendicularité, symétrie).",{"$nulls":36},{"$f":"COUNTIF($D39:$AJ39,$AU$1)/$AV$1","v":{"v":0,"d":"0%"}},{"$f":"COUNTIF($D39:$AJ39,$AU$2)/$AV$1","v":{"v":0,"d":"0%"}},{"$f":"COUNTIF($D39:$AJ39,$AU$3)/$AV$1","v":{"v":0,"d":"0%"}},{"$f":"COUNTIF($D39:$AJ39,$AU$4)/$AV$1","v":{"v":0,"d":"0%"}},{"$f":"COUNTIF(D39:$AJ39,\"NE\")/$AV$1","v":{"v":0,"d":"0%"}},{"$f":"AN39+(AO39*0.66)+(AP39*0.33)","v":{"v":0,"d":"0%"}}]
[null,null,"Utiliser des propriétés géométriques pour reconnaitre des objets.",{"$nulls":36},{"$f":"COUNTIF($D40:$AJ40,$AU$1)/$AV$1","v":{"v":0,"d":"0%"}},{"$f":"COUNTIF($D40:$AJ40,$AU$2)/$AV$1","v":{"v":0,"d":"0%"}},{"$f":"COUNTIF($D40:$AJ40,$AU$3)/$AV$1","v":{"v":0,"d":"0%"}},{"$f":"COUNTIF($D40:$AJ40,$AU$4)/$AV$1","v":{"v":0,"d":"0%"}},{"$f":"COUNTIF(D40:$AJ40,\"NE\")/$AV$1","v":{"v":0,"d":"0%"}},{"$f":"AN40+(AO40*0.66)+(AP40*0.33)","v":{"v":0,"d":"0%"}}]
[null,null,"REPRESENTER",{"$f":"COUNTA(D42:D46)*10","v":0},0,0,0,0,0,{"$f":"COUNTA(J42:J46)*10","v":0},0,0,0,0,0,0,0,0,0,0,0,0,0,0,0,0,0,0,0,0,0,0,0,0,0,0]
[null,null,"Utiliser des outils pour représenter un problème : dessins, schémas, diagrammes, graphiques, écritures avec parenthésages, …",{"$nulls":36},{"$f":"COUNTIF($D42:$AJ42,$AU$1)/$AV$1","v":{"v":0,"d":"0%"}},{"$f":"COUNTIF($D42:$AJ42,$AU$2)/$AV$1","v":{"v":0,"d":"0%"}},{"$f":"COUNTIF($D42:$AJ42,$AU$3)/$AV$1","v":{"v":0,"d":"0%"}},{"$f":"COUNTIF($D42:$AJ42,$AU$4)/$AV$1","v":{"v":0,"d":"0%"}},{"$f":"COUNTIF(D42:$AJ42,\"NE\")/$AV$1","v":{"v":0,"d":"0%"}},{"$f":"AN42+(AO42*0.66)+(AP42*0.33)","v":{"v":0,"d":"0%"}}]
[null,null,"Produire et utiliser diverses représentations des fractions simples et des nombres décimaux.",{"$nulls":36},{"$f":"COUNTIF($D43:$AJ43,$AU$1)/$AV$1","v":{"v":0,"d":"0%"}},{"$f":"COUNTIF($D43:$AJ43,$AU$2)/$AV$1","v":{"v":0,"d":"0%"}},{"$f":"COUNTIF($D43:$AJ43,$AU$3)/$AV$1","v":{"v":0,"d":"0%"}},{"$f":"COUNTIF($D43:$AJ43,$AU$4)/$AV$1","v":{"v":0,"d":"0%"}},{"$f":"COUNTIF(D43:$AJ43,\"NE\")/$AV$1","v":{"v":0,"d":"0%"}},{"$f":"AN43+(AO43*0.66)+(AP43*0.33)","v":{"v":0,"d":"0%"}}]
[null,null,"Analyser une figure plane sous différents aspects (surface, contour de celle-ci, lignes et points).",{"$nulls":36},{"$f":"COUNTIF($D44:$AJ44,$AU$1)/$AV$1","v":{"v":0,"d":"0%"}},{"$f":"COUNTIF($D44:$AJ44,$AU$2)/$AV$1","v":{"v":0,"d":"0%"}},{"$f":"COUNTIF($D44:$AJ44,$AU$3)/$AV$1","v":{"v":0,"d":"0%"}},{"$f":"COUNTIF($D44:$AJ44,$AU$4)/$AV$1","v":{"v":0,"d":"0%"}},{"$f":"COUNTIF(D44:$AJ44,\"NE\")/$AV$1","v":{"v":0,"d":"0%"}},{"$f":"AN44+(AO44*0.66)+(AP44*0.33)","v":{"v":0,"d":"0%"}}]
[null,null,"Reconnaitre et utiliser des premiers éléments de codages d’une figure plane ou d’un solide.",{"$nulls":36},{"$f":"COUNTIF($D45:$AJ45,$AU$1)/$AV$1","v":{"v":0,"d":"0%"}},{"$f":"COUNTIF($D45:$AJ45,$AU$2)/$AV$1","v":{"v":0,"d":"0%"}},{"$f":"COUNTIF($D45:$AJ45,$AU$3)/$AV$1","v":{"v":0,"d":"0%"}},{"$f":"COUNTIF($D45:$AJ45,$AU$4)/$AV$1","v":{"v":0,"d":"0%"}},{"$f":"COUNTIF(D45:$AJ45,\"NE\")/$AV$1","v":{"v":0,"d":"0%"}},{"$f":"AN45+(AO45*0.66)+(AP45*0.33)","v":{"v":0,"d":"0%"}}]
[null,null,"Utiliser et produire des représentations de solides et de situations spatiales.",{"$nulls":36},{"$f":"COUNTIF($D46:$AJ46,$AU$1)/$AV$1","v":{"v":0,"d":"0%"}},{"$f":"COUNTIF($D46:$AJ46,$AU$2)/$AV$1","v":{"v":0,"d":"0%"}},{"$f":"COUNTIF($D46:$AJ46,$AU$3)/$AV$1","v":{"v":0,"d":"0%"}},{"$f":"COUNTIF($D46:$AJ46,$AU$4)/$AV$1","v":{"v":0,"d":"0%"}},{"$f":"COUNTIF(D46:$AJ46,\"NE\")/$AV$1","v":{"v":0,"d":"0%"}},{"$f":"AN46+(AO46*0.66)+(AP46*0.33)","v":{"v":0,"d":"0%"}}]
[null,null,"RAISONNER",{"$f":"COUNTA(D48:D51)*10","v":0},0,0,0,0,0,0,0,0,0,0,0,0,0,0,0,0,0,0,0,0,0,0,0,0,0,0,0,0,0,0,0,0]
[null,null,"Résoudre des problèmes complexes",{"$nulls":36},{"$f":"COUNTIF($D48:$AJ48,$AU$1)/$AV$1","v":{"v":0,"d":"0%"}},{"$f":"COUNTIF($D48:$AJ48,$AU$2)/$AV$1","v":{"v":0,"d":"0%"}},{"$f":"COUNTIF($D48:$AJ48,$AU$3)/$AV$1","v":{"v":0,"d":"0%"}},{"$f":"COUNTIF($D48:$AJ48,$AU$4)/$AV$1","v":{"v":0,"d":"0%"}},{"$f":"COUNTIF(D48:$AJ48,\"NE\")/$AV$1","v":{"v":0,"d":"0%"}},{"$f":"AN48+(AO48*0.66)+(AP48*0.33)","v":{"v":0,"d":"0%"}}]
[null,null,"En géométrie, passer progressivement de la perception au contrôle par les instruments pour amorcer des raisonnements s’appuyant uniquement sur des propriétés des figures et sur des relations entre objets.",{"$nulls":36},{"$f":"COUNTIF($D49:$AJ49,$AU$1)/$AV$1","v":{"v":0,"d":"0%"}},{"$f":"COUNTIF($D49:$AJ49,$AU$2)/$AV$1","v":{"v":0,"d":"0%"}},{"$f":"COUNTIF($D49:$AJ49,$AU$3)/$AV$1","v":{"v":0,"d":"0%"}},{"$f":"COUNTIF($D49:$AJ49,$AU$4)/$AV$1","v":{"v":0,"d":"0%"}},{"$f":"COUNTIF(D49:$AJ49,\"NE\")/$AV$1","v":{"v":0,"d":"0%"}},{"$f":"AN49+(AO49*0.66)+(AP49*0.33)","v":{"v":0,"d":"0%"}}]
[null,null,"Progresser collectivement dans une investigation en sachant prendre en compte le point de vue d’autrui.",{"$nulls":36},{"$f":"COUNTIF($D50:$AJ50,$AU$1)/$AV$1","v":{"v":0,"d":"0%"}},{"$f":"COUNTIF($D50:$AJ50,$AU$2)/$AV$1","v":{"v":0,"d":"0%"}},{"$f":"COUNTIF($D50:$AJ50,$AU$3)/$AV$1","v":{"v":0,"d":"0%"}},{"$f":"COUNTIF($D50:$AJ50,$AU$4)/$AV$1","v":{"v":0,"d":"0%"}},{"$f":"COUNTIF(D50:$AJ50,\"NE\")/$AV$1","v":{"v":0,"d":"0%"}},{"$f":"AN50+(AO50*0.66)+(AP50*0.33)","v":{"v":0,"d":"0%"}}]
[null,null,"Justifier ses affirmations et rechercher la validité des informations dont on dispose.",{"$nulls":36},{"$f":"COUNTIF($D51:$AJ51,$AU$1)/$AV$1","v":{"v":0,"d":"0%"}},{"$f":"COUNTIF($D51:$AJ51,$AU$2)/$AV$1","v":{"v":0,"d":"0%"}},{"$f":"COUNTIF($D51:$AJ51,$AU$3)/$AV$1","v":{"v":0,"d":"0%"}},{"$f":"COUNTIF($D51:$AJ51,$AU$4)/$AV$1","v":{"v":0,"d":"0%"}},{"$f":"COUNTIF(D51:$AJ51,\"NE\")/$AV$1","v":{"v":0,"d":"0%"}},{"$f":"AN51+(AO51*0.66)+(AP51*0.33)","v":{"v":0,"d":"0%"}}]
[null,null,"COMMUNIQUER",{"$f":"COUNTA(D53:D54)*10","v":0},0,0,0,0,0,0,0,0,0,0,0,0,0,0,0,0,0,0,0,0,0,0,0,0,0,0,0,0,0,0,0,0]
[null,null,"Utiliser un vocabulaire adéquat et/ou des notations adaptées pour décrire une situation, exposer une argumentation.",{"$nulls":36},{"$f":"COUNTIF($D53:$AJ53,$AU$1)/$AV$1","v":{"v":0,"d":"0%"}},{"$f":"COUNTIF($D53:$AJ53,$AU$2)/$AV$1","v":{"v":0,"d":"0%"}},{"$f":"COUNTIF($D53:$AJ53,$AU$3)/$AV$1","v":{"v":0,"d":"0%"}},{"$f":"COUNTIF($D53:$AJ53,$AU$4)/$AV$1","v":{"v":0,"d":"0%"}},{"$f":"COUNTIF(D53:$AJ53,\"NE\")/$AV$1","v":{"v":0,"d":"0%"}},{"$f":"AN53+(AO53*0.66)+(AP53*0.33)","v":{"v":0,"d":"0%"}}]
[null,null,"Expliquer sa démarche ou son raisonnement, comprendre les explications d’un autre et argumenter dans l’échange.",{"$nulls":36},{"$f":"COUNTIF($D54:$AJ54,$AU$1)/$AV$1","v":{"v":0,"d":"0%"}},{"$f":"COUNTIF($D54:$AJ54,$AU$2)/$AV$1","v":{"v":0,"d":"0%"}},{"$f":"COUNTIF($D54:$AJ54,$AU$3)/$AV$1","v":{"v":0,"d":"0%"}},{"$f":"COUNTIF($D54:$AJ54,$AU$4)/$AV$1","v":{"v":0,"d":"0%"}},{"$f":"COUNTIF(D54:$AJ54,\"NE\")/$AV$1","v":{"v":0,"d":"0%"}},{"$f":"AN54+(AO54*0.66)+(AP54*0.33)","v":{"v":0,"d":"0%"}}]
[null,"HISTOIRE ET GEOGRAPHIE","SE REPERER DANS LE TEMPS, CONSTRUIRE DES REPERES HISTORIQUES",{"$f":"COUNTA(D56:D60)*10","v":0},0,0,0,0,0,0,0,0,0,0,0,0,0,0,0,0,0,0,0,0,0,0,0,0,0,0,0,0,0,0,0,0]
[null,null,"Situer chronologiquement des grandes périodes historiques. ",{"$nulls":36},{"$f":"COUNTIF($D56:$AJ56,$AU$1)/$AV$1","v":{"v":0,"d":"0%"}},{"$f":"COUNTIF($D56:$AJ56,$AU$2)/$AV$1","v":{"v":0,"d":"0%"}},{"$f":"COUNTIF($D56:$AJ56,$AU$3)/$AV$1","v":{"v":0,"d":"0%"}},{"$f":"COUNTIF($D56:$AJ56,$AU$4)/$AV$1","v":{"v":0,"d":"0%"}},{"$f":"COUNTIF(D56:$AJ56,\"NE\")/$AV$1","v":{"v":0,"d":"0%"}},{"$f":"AN56+(AO56*0.66)+(AP56*0.33)","v":{"v":0,"d":"0%"}}]
[null,null,"Ordonner des faits les uns par rapport aux autres et les situer dans une époque ou une période donnée.",{"$nulls":36},{"$f":"COUNTIF($D57:$AJ57,$AU$1)/$AV$1","v":{"v":0,"d":"0%"}},{"$f":"COUNTIF($D57:$AJ57,$AU$2)/$AV$1","v":{"v":0,"d":"0%"}},{"$f":"COUNTIF($D57:$AJ57,$AU$3)/$AV$1","v":{"v":0,"d":"0%"}},{"$f":"COUNTIF($D57:$AJ57,$AU$4)/$AV$1","v":{"v":0,"d":"0%"}},{"$f":"COUNTIF(D57:$AJ57,\"NE\")/$AV$1","v":{"v":0,"d":"0%"}},{"$f":"AN57+(AO57*0.66)+(AP57*0.33)","v":{"v":0,"d":"0%"}}]
[null,null,"Manipuler et réinvestir le repère historique dans différents contextes.",{"$nulls":36},{"$f":"COUNTIF($D58:$AJ58,$AU$1)/$AV$1","v":{"v":0,"d":"0%"}},{"$f":"COUNTIF($D58:$AJ58,$AU$2)/$AV$1","v":{"v":0,"d":"0%"}},{"$f":"COUNTIF($D58:$AJ58,$AU$3)/$AV$1","v":{"v":0,"d":"0%"}},{"$f":"COUNTIF($D58:$AJ58,$AU$4)/$AV$1","v":{"v":0,"d":"0%"}},{"$f":"COUNTIF(D58:$AJ58,\"NE\")/$AV$1","v":{"v":0,"d":"0%"}},{"$f":"AN58+(AO58*0.66)+(AP58*0.33)","v":{"v":0,"d":"0%"}}]
[null,null,"Utiliser des documents donnant à voir une représentation du temps.",{"$nulls":36},{"$f":"COUNTIF($D59:$AJ59,$AU$1)/$AV$1","v":{"v":0,"d":"0%"}},{"$f":"COUNTIF($D59:$AJ59,$AU$2)/$AV$1","v":{"v":0,"d":"0%"}},{"$f":"COUNTIF($D59:$AJ59,$AU$3)/$AV$1","v":{"v":0,"d":"0%"}},{"$f":"COUNTIF($D59:$AJ59,$AU$4)/$AV$1","v":{"v":0,"d":"0%"}},{"$f":"COUNTIF(D59:$AJ59,\"NE\")/$AV$1","v":{"v":0,"d":"0%"}},{"$f":"AN59+(AO59*0.66)+(AP59*0.33)","v":{"v":0,"d":"0%"}}]
[null,null,"Mémoriser les repères historiques liés au programme",{"$nulls":36},{"$f":"COUNTIF($D60:$AJ60,$AU$1)/$AV$1","v":{"v":0,"d":"0%"}},{"$f":"COUNTIF($D60:$AJ60,$AU$2)/$AV$1","v":{"v":0,"d":"0%"}},{"$f":"COUNTIF($D60:$AJ60,$AU$3)/$AV$1","v":{"v":0,"d":"0%"}},{"$f":"COUNTIF($D60:$AJ60,$AU$4)/$AV$1","v":{"v":0,"d":"0%"}},{"$f":"COUNTIF(D60:$AJ60,\"NE\")/$AV$1","v":{"v":0,"d":"0%"}},{"$f":"AN60+(AO60*0.66)+(AP60*0.33)","v":{"v":0,"d":"0%"}}]
[null,null,"SE REPERER DANS L'ESPACE, CONSTRUIRE DES REPERES GEOGRAPHIQUES",{"$f":"COUNTA(D62:D67)*10","v":0},{"$f":"COUNTA(E62:E67)*10","v":0},0,0,0,0,0,0,0,0,0,0,0,0,0,0,0,0,0,0,0,0,0,0,0,0,0,0,0,0,0,0,0]
[null,null,"Nommer et localiser les grands repères géographiques.",{"$nulls":36},{"$f":"COUNTIF($D62:$AJ62,$AU$1)/$AV$1","v":{"v":0,"d":"0%"}},{"$f":"COUNTIF($D62:$AJ62,$AU$2)/$AV$1","v":{"v":0,"d":"0%"}},{"$f":"COUNTIF($D62:$AJ62,$AU$3)/$AV$1","v":{"v":0,"d":"0%"}},{"$f":"COUNTIF($D62:$AJ62,$AU$4)/$AV$1","v":{"v":0,"d":"0%"}},{"$f":"COUNTIF(D62:$AJ62,\"NE\")/$AV$1","v":{"v":0,"d":"0%"}},{"$f":"AN62+(AO62*0.66)+(AP62*0.33)","v":{"v":0,"d":"0%"}}]
[null,null,"Nommer et localiser un lieu dans un espace géographique.",{"$nulls":36},{"v":0,"d":"0%"},{"v":0,"d":"0%"},{"v":0,"d":"0%"},{"v":0,"d":"0%"},{"$f":"COUNTIF(D63:$AJ63,\"NE\")/$AV$1","v":{"v":0,"d":"0%"}},{"v":0,"d":"0%"}]
[null,null,"Nommer, localiser et caractériser des espaces.",{"$nulls":36},{"v":0,"d":"0%"},{"v":0,"d":"0%"},{"v":0,"d":"0%"},{"v":0,"d":"0%"},{"$f":"COUNTIF(D64:$AJ64,\"NE\")/$AV$1","v":{"v":0,"d":"0%"}},{"v":0,"d":"0%"}]
[null,null,"Situer des lieux et des espaces les uns par rapport aux autres.",{"$nulls":36},{"v":0,"d":"0%"},{"v":0,"d":"0%"},{"v":0,"d":"0%"},{"v":0,"d":"0%"},{"$f":"COUNTIF(D65:$AJ65,\"NE\")/$AV$1","v":{"v":0,"d":"0%"}},{"v":0,"d":"0%"}]
[null,null,"Appréhender la notion d’échelle géographique.",{"$nulls":36},{"v":0,"d":"0%"},{"v":0,"d":"0%"},{"v":0,"d":"0%"},{"v":0,"d":"0%"},{"$f":"COUNTIF(D66:$AJ66,\"NE\")/$AV$1","v":{"v":0,"d":"0%"}},{"v":0,"d":"0%"}]
[null,null,"Mémoriser les repères géographiques liés au programme.",{"$nulls":36},{"v":0,"d":"0%"},{"v":0,"d":"0%"},{"v":0,"d":"0%"},{"v":0,"d":"0%"},{"$f":"COUNTIF(D67:$AJ67,\"NE\")/$AV$1","v":{"v":0,"d":"0%"}},{"v":0,"d":"0%"}]
[null,null,"RAISONNER, JUSTIFIER UNE DEMARCHE ET LES CHOIX EFFECTUES",{"$f":"COUNTA(D69:D72)*10","v":0},{"$f":"COUNTA(E69:E72)*10","v":0},0,0,0,0,0,0,0,0,0,0,0,0,0,0,0,0,0,0,0,0,0,0,0,0,0,0,0,0,0,0,0]
[null,null,"Poser des questions, se poser des questions.",{"$nulls":36},{"$f":"COUNTIF($D69:$AJ69,$AU$1)/$AV$1","v":{"v":0,"d":"0%"}},{"$f":"COUNTIF($D69:$AJ69,$AU$2)/$AV$1","v":{"v":0,"d":"0%"}},{"$f":"COUNTIF($D69:$AJ69,$AU$3)/$AV$1","v":{"v":0,"d":"0%"}},{"$f":"COUNTIF($D69:$AJ69,$AU$4)/$AV$1","v":{"v":0,"d":"0%"}},{"$f":"COUNTIF(D69:$AJ69,\"NE\")/$AV$1","v":{"v":0,"d":"0%"}},{"$f":"AN69+(AO69*0.66)+(AP69*0.33)","v":{"v":0,"d":"0%"}}]
[null,null,"Formuler des hypothèses.",{"$nulls":36},{"$f":"COUNTIF($D70:$AJ70,$AU$1)/$AV$1","v":{"v":0,"d":"0%"}},{"$f":"COUNTIF($D70:$AJ70,$AU$2)/$AV$1","v":{"v":0,"d":"0%"}},{"$f":"COUNTIF($D70:$AJ70,$AU$3)/$AV$1","v":{"v":0,"d":"0%"}},{"$f":"COUNTIF($D70:$AJ70,$AU$4)/$AV$1","v":{"v":0,"d":"0%"}},{"$f":"COUNTIF(D70:$AJ70,\"NE\")/$AV$1","v":{"v":0,"d":"0%"}},{"$f":"AN70+(AO70*0.66)+(AP70*0.33)","v":{"v":0,"d":"0%"}}]
[null,null,"Vérifier.",{"$nulls":36},{"$f":"COUNTIF($D71:$AJ71,$AU$1)/$AV$1","v":{"v":0,"d":"0%"}},{"$f":"COUNTIF($D71:$AJ71,$AU$2)/$AV$1","v":{"v":0,"d":"0%"}},{"$f":"COUNTIF($D71:$AJ71,$AU$3)/$AV$1","v":{"v":0,"d":"0%"}},{"$f":"COUNTIF($D71:$AJ71,$AU$4)/$AV$1","v":{"v":0,"d":"0%"}},{"$f":"COUNTIF(D71:$AJ71,\"NE\")/$AV$1","v":{"v":0,"d":"0%"}},{"$f":"AN71+(AO71*0.66)+(AP71*0.33)","v":{"v":0,"d":"0%"}}]
[null,null,"Justifier.",{"$nulls":36},{"$f":"COUNTIF($D72:$AJ72,$AU$1)/$AV$1","v":{"v":0,"d":"0%"}},{"$f":"COUNTIF($D72:$AJ72,$AU$2)/$AV$1","v":{"v":0,"d":"0%"}},{"$f":"COUNTIF($D72:$AJ72,$AU$3)/$AV$1","v":{"v":0,"d":"0%"}},{"$f":"COUNTIF($D72:$AJ72,$AU$4)/$AV$1","v":{"v":0,"d":"0%"}},{"$f":"COUNTIF(D72:$AJ72,\"NE\")/$AV$1","v":{"v":0,"d":"0%"}},{"$f":"AN72+(AO72*0.66)+(AP72*0.33)","v":{"v":0,"d":"0%"}}]
[null,null,"S'INFORMER DANS LE MONDE NUMERIQUE",{"$f":"COUNTA(D74:D76)*10","v":0},0,0,0,0,0,0,0,0,0,0,0,0,0,0,0,0,0,0,0,0,0,0,0,0,0,0,0,0,0,0,0,0]
[null,null,"Connaitre différents systèmes d’information, les utiliser.",{"$nulls":36},{"$f":"COUNTIF($D74:$AJ74,$AU$1)/$AV$1","v":{"v":0,"d":"0%"}},{"$f":"COUNTIF($D74:$AJ74,$AU$2)/$AV$1","v":{"v":0,"d":"0%"}},{"$f":"COUNTIF($D74:$AJ74,$AU$3)/$AV$1","v":{"v":0,"d":"0%"}},{"$f":"COUNTIF($D74:$AJ74,$AU$4)/$AV$1","v":{"v":0,"d":"0%"}},{"$f":"COUNTIF(D74:$AJ74,\"NE\")/$AV$1","v":{"v":0,"d":"0%"}},{"$f":"AN74+(AO74*0.66)+(AP74*0.33)","v":{"v":0,"d":"0%"}}]
[null,null,"Trouver, sélectionner et exploiter des informations dans une ressource numérique.",{"$nulls":36},{"$f":"COUNTIF($D75:$AJ75,$AU$1)/$AV$1","v":{"v":0,"d":"0%"}},{"$f":"COUNTIF($D75:$AJ75,$AU$2)/$AV$1","v":{"v":0,"d":"0%"}},{"$f":"COUNTIF($D75:$AJ75,$AU$3)/$AV$1","v":{"v":0,"d":"0%"}},{"$f":"COUNTIF($D75:$AJ75,$AU$4)/$AV$1","v":{"v":0,"d":"0%"}},{"$f":"COUNTIF(D75:$AJ75,\"NE\")/$AV$1","v":{"v":0,"d":"0%"}},{"$f":"AN75+(AO75*0.66)+(AP75*0.33)","v":{"v":0,"d":"0%"}}]
[null,null," Identifier la ressource numérique utilisée",{"$nulls":36},{"$f":"COUNTIF($D76:$AJ76,$AU$1)/$AV$1","v":{"v":0,"d":"0%"}},{"$f":"COUNTIF($D76:$AJ76,$AU$2)/$AV$1","v":{"v":0,"d":"0%"}},{"$f":"COUNTIF($D76:$AJ76,$AU$3)/$AV$1","v":{"v":0,"d":"0%"}},{"$f":"COUNTIF($D76:$AJ76,$AU$4)/$AV$1","v":{"v":0,"d":"0%"}},{"$f":"COUNTIF(D76:$AJ76,\"NE\")/$AV$1","v":{"v":0,"d":"0%"}},{"$f":"AN76+(AO76*0.66)+(AP76*0.33)","v":{"v":0,"d":"0%"}}]
[null,null,"COMPRENDRE UN DOCUMENT",{"$f":"COUNTA(D78:D81)*10","v":0},0,0,0,0,0,0,0,0,0,0,0,0,0,0,0,0,0,0,0,0,0,0,0,0,0,0,0,0,0,0,0,0]
[null,null,"Comprendre le sens général d’un document.",{"$nulls":36},{"$f":"COUNTIF($D78:$AJ78,$AU$1)/$AV$1","v":{"v":0,"d":"0%"}},{"$f":"COUNTIF($D78:$AJ78,$AU$2)/$AV$1","v":{"v":0,"d":"0%"}},{"$f":"COUNTIF($D78:$AJ78,$AU$3)/$AV$1","v":{"v":0,"d":"0%"}},{"$f":"COUNTIF($D78:$AJ78,$AU$4)/$AV$1","v":{"v":0,"d":"0%"}},{"$f":"COUNTIF(D78:$AJ78,\"NE\")/$AV$1","v":{"v":0,"d":"0%"}},{"$f":"AN78+(AO78*0.66)+(AP78*0.33)","v":{"v":0,"d":"0%"}}]
[null,null,"Identifier le document et savoir pourquoi il doit être identifié.",{"$nulls":36},{"$f":"COUNTIF($D79:$AJ79,$AU$1)/$AV$1","v":{"v":0,"d":"0%"}},{"$f":"COUNTIF($D79:$AJ79,$AU$2)/$AV$1","v":{"v":0,"d":"0%"}},{"$f":"COUNTIF($D79:$AJ79,$AU$3)/$AV$1","v":{"v":0,"d":"0%"}},{"$f":"COUNTIF($D79:$AJ79,$AU$4)/$AV$1","v":{"v":0,"d":"0%"}},{"$f":"COUNTIF(D79:$AJ79,\"NE\")/$AV$1","v":{"v":0,"d":"0%"}},{"$f":"AN79+(AO79*0.66)+(AP79*0.33)","v":{"v":0,"d":"0%"}}]
[null,null,"Extraire des informations pertinentes pour répondre à une question.",{"$nulls":36},{"$f":"COUNTIF($D80:$AJ80,$AU$1)/$AV$1","v":{"v":0,"d":"0%"}},{"$f":"COUNTIF($D80:$AJ80,$AU$2)/$AV$1","v":{"v":0,"d":"0%"}},{"$f":"COUNTIF($D80:$AJ80,$AU$3)/$AV$1","v":{"v":0,"d":"0%"}},{"$f":"COUNTIF($D80:$AJ80,$AU$4)/$AV$1","v":{"v":0,"d":"0%"}},{"$f":"COUNTIF(D80:$AJ80,\"NE\")/$AV$1","v":{"v":0,"d":"0%"}},{"$f":"AN80+(AO80*0.66)+(AP80*0.33)","v":{"v":0,"d":"0%"}}]
[null,null,"Savoir que le document exprime un point de vue, identifier et questionner le sens implicite d’un document.",{"$nulls":36},{"$f":"COUNTIF($D81:$AJ81,$AU$1)/$AV$1","v":{"v":0,"d":"0%"}},{"$f":"COUNTIF($D81:$AJ81,$AU$2)/$AV$1","v":{"v":0,"d":"0%"}},{"$f":"COUNTIF($D81:$AJ81,$AU$3)/$AV$1","v":{"v":0,"d":"0%"}},{"$f":"COUNTIF($D81:$AJ81,$AU$4)/$AV$1","v":{"v":0,"d":"0%"}},{"$f":"COUNTIF(D81:$AJ81,\"NE\")/$AV$1","v":{"v":0,"d":"0%"}},{"$f":"AN81+(AO81*0.66)+(AP81*0.33)","v":{"v":0,"d":"0%"}}]
[null,null,"PRATIQUER DIFFERENTS LANGAGES EN HISTOIRE ET EN GEOGRAPHIE",{"$f":"COUNTA(D83:D88)*10","v":0},0,0,0,0,0,0,0,0,0,0,0,0,0,0,0,0,0,0,0,0,0,0,0,0,0,0,0,0,0,0,0,0]
[null,null,"Écrire pour structurer sa pensée et son savoir, pour argumenter et écrire pour communiquer et échanger.",{"$nulls":36},{"$f":"COUNTIF($D83:$AJ83,$AU$1)/$AV$1","v":{"v":0,"d":"0%"}},{"$f":"COUNTIF($D83:$AJ83,$AU$2)/$AV$1","v":{"v":0,"d":"0%"}},{"$f":"COUNTIF($D83:$AJ83,$AU$3)/$AV$1","v":{"v":0,"d":"0%"}},{"$f":"COUNTIF($D83:$AJ83,$AU$4)/$AV$1","v":{"v":0,"d":"0%"}},{"$f":"COUNTIF(D83:$AJ83,\"NE\")/$AV$1","v":{"v":0,"d":"0%"}},{"$f":"AN83+(AO83*0.66)+(AP83*0.33)","v":{"v":0,"d":"0%"}}]
[null,null,"Reconnaitre un récit historique.",{"$nulls":36},{"v":0,"d":"0%"},{"v":0,"d":"0%"},{"v":0,"d":"0%"},{"v":0,"d":"0%"},{"$f":"COUNTIF(D84:$AJ84,\"NE\")/$AV$1","v":{"v":0,"d":"0%"}},{"v":0,"d":"0%"}]
[null,null,"S’exprimer à l’oral pour penser, communiquer et échanger.",{"$nulls":36},{"v":0,"d":"0%"},{"v":0,"d":"0%"},{"v":0,"d":"0%"},{"v":0,"d":"0%"},{"$f":"COUNTIF(D85:$AJ85,\"NE\")/$AV$1","v":{"v":0,"d":"0%"}},{"v":0,"d":"0%"}]
[null,null,"S’approprier et utiliser un lexique historique et géographique approprié.",{"$nulls":36},{"v":0,"d":"0%"},{"v":0,"d":"0%"},{"v":0,"d":"0%"},{"v":0,"d":"0%"},{"$f":"COUNTIF(D86:$AJ86,\"NE\")/$AV$1","v":{"v":0,"d":"0%"}},{"v":0,"d":"0%"}]
[null,null,"Réaliser ou compléter des productions graphiques.",{"$nulls":36},{"v":0,"d":"0%"},{"v":0,"d":"0%"},{"v":0,"d":"0%"},{"v":0,"d":"0%"},{"$f":"COUNTIF(D87:$AJ87,\"NE\")/$AV$1","v":{"v":0,"d":"0%"}},{"v":0,"d":"0%"}]
[null,null,"Utiliser des cartes analogiques et numériques à différentes échelles, des photographies de paysages ou de lieux.",{"$nulls":36},{"v":0,"d":"0%"},{"v":0,"d":"0%"},{"v":0,"d":"0%"},{"v":0,"d":"0%"},{"$f":"COUNTIF(D88:$AJ88,\"NE\")/$AV$1","v":{"v":0,"d":"0%"}},{"v":0,"d":"0%"}]
[null,null,"COOPERER ET MUTUALISER",{"$f":"COUNTA(D90:D92)*10","v":0},0,0,0,0,0,0,0,0,0,0,0,0,0,0,0,0,0,0,0,0,0,0,0,0,0,0,0,0,0,0,0,0]
[null,null,"Organiser son travail dans le cadre d’un groupe pour élaborer une tâche commune.",{"$nulls":36},{"$f":"COUNTIF($D90:$AJ90,$AU$1)/$AV$1","v":{"v":0,"d":"0%"}},{"$f":"COUNTIF($D90:$AJ90,$AU$2)/$AV$1","v":{"v":0,"d":"0%"}},{"$f":"COUNTIF($D90:$AJ90,$AU$3)/$AV$1","v":{"v":0,"d":"0%"}},{"$f":"COUNTIF($D90:$AJ90,$AU$4)/$AV$1","v":{"v":0,"d":"0%"}},{"$f":"COUNTIF(D90:$AJ90,\"NE\")/$AV$1","v":{"v":0,"d":"0%"}},{"$f":"AN90+(AO90*0.66)+(AP90*0.33)","v":{"v":0,"d":"0%"}}]
[null,null,"Travailler en commun pour faciliter les apprentissages individuels. ",{"$nulls":36},{"$f":"COUNTIF($D91:$AJ91,$AU$1)/$AV$1","v":{"v":0,"d":"0%"}},{"$f":"COUNTIF($D91:$AJ91,$AU$2)/$AV$1","v":{"v":0,"d":"0%"}},{"$f":"COUNTIF($D91:$AJ91,$AU$3)/$AV$1","v":{"v":0,"d":"0%"}},{"$f":"COUNTIF($D91:$AJ91,$AU$4)/$AV$1","v":{"v":0,"d":"0%"}},{"$f":"COUNTIF(D91:$AJ91,\"NE\")/$AV$1","v":{"v":0,"d":"0%"}},{"$f":"AN91+(AO91*0.66)+(AP91*0.33)","v":{"v":0,"d":"0%"}}]
[null,null,"Apprendre à utiliser les outils numériques qui peuvent conduire à des réalisations collectives.",{"$nulls":36},{"$f":"COUNTIF($D92:$AJ92,$AU$1)/$AV$1","v":{"v":0,"d":"0%"}},{"$f":"COUNTIF($D92:$AJ92,$AU$2)/$AV$1","v":{"v":0,"d":"0%"}},{"$f":"COUNTIF($D92:$AJ92,$AU$3)/$AV$1","v":{"v":0,"d":"0%"}},{"$f":"COUNTIF($D92:$AJ92,$AU$4)/$AV$1","v":{"v":0,"d":"0%"}},{"$f":"COUNTIF(D92:$AJ92,\"NE\")/$AV$1","v":{"v":0,"d":"0%"}},{"$f":"AN92+(AO92*0.66)+(AP92*0.33)","v":{"v":0,"d":"0%"}}]
[null,"SCIENCES ET TECHNOLOGIE","PRATIQUE LA DEMARCHE SCIENTIFIQUE",{"$f":"COUNTA(D94:D99)*10","v":0},0,0,0,0,0,0,0,0,0,0,0,0,0,0,0,0,0,0,0,0,0,0,0,0,0,0,0,0,0,0,0,0]
[null,null,"Proposer, avec l’aide du professeur, une démarche pour résoudre un problème ou répondre à une question de nature scientifique ou technologique :",{"$nulls":36},{"$f":"COUNTIF($D94:$AJ94,$AU$1)/$AV$1","v":{"v":0,"d":"0%"}},{"$f":"COUNTIF($D94:$AJ94,$AU$2)/$AV$1","v":{"v":0,"d":"0%"}},{"$f":"COUNTIF($D94:$AJ94,$AU$3)/$AV$1","v":{"v":0,"d":"0%"}},{"$f":"COUNTIF($D94:$AJ94,$AU$4)/$AV$1","v":{"v":0,"d":"0%"}},{"$f":"COUNTIF(D94:$AJ94,\"NE\")/$AV$1","v":{"v":0,"d":"0%"}},{"$f":"AN94+(AO94*0.66)+(AP94*0.33)","v":{"v":0,"d":"0%"}}]
[null,null,"Formuler une question ou une problématique scientifique ou technologique simple ;",{"$nulls":36},{"v":0,"d":"0%"},{"v":0,"d":"0%"},{"v":0,"d":"0%"},{"v":0,"d":"0%"},{"$f":"COUNTIF(D95:$AJ95,\"NE\")/$AV$1","v":{"v":0,"d":"0%"}},{"v":0,"d":"0%"}]
[null,null,"Proposer une ou des hypothèses pour répondre à une question ou un problème ;",{"$nulls":36},{"v":0,"d":"0%"},{"v":0,"d":"0%"},{"v":0,"d":"0%"},{"v":0,"d":"0%"},{"$f":"COUNTIF(D96:$AJ96,\"NE\")/$AV$1","v":{"v":0,"d":"0%"}},{"v":0,"d":"0%"}]
[null,null,"Pproposer des expériences simples pour tester une hypothèse ;",{"$nulls":36},{"v":0,"d":"0%"},{"v":0,"d":"0%"},{"v":0,"d":"0%"},{"v":0,"d":"0%"},{"$f":"COUNTIF(D97:$AJ97,\"NE\")/$AV$1","v":{"v":0,"d":"0%"}},{"v":0,"d":"0%"}]
[null,null,"Interpréter un résultat, en tirer une conclusion ;",{"$nulls":36},{"v":0,"d":"0%"},{"v":0,"d":"0%"},{"v":0,"d":"0%"},{"v":0,"d":"0%"},{"$f":"COUNTIF(D98:$AJ98,\"NE\")/$AV$1","v":{"v":0,"d":"0%"}},{"v":0,"d":"0%"}]
[null,null,"Formaliser une partie de sa recherche sous une forme écrite ou orale.",{"$nulls":36},{"v":0,"d":"0%"},{"v":0,"d":"0%"},{"v":0,"d":"0%"},{"v":0,"d":"0%"},{"$f":"COUNTIF(D99:$AJ99,\"NE\")/$AV$1","v":{"v":0,"d":"0%"}},{"v":0,"d":"0%"}]
[null,null,"PERCEVOIR, CREER , REALISER",{"$f":"COUNTA(D101:D105)*10","v":0},{"$f":"COUNTA(E101:E105)*10","v":0},0,0,0,0,0,0,0,0,0,0,0,0,0,0,0,0,0,0,0,0,0,0,0,0,0,0,0,0,0,0,0]
[null,null,"Identifier les évolutions des besoins et des objets techniques dans leur contexte.",{"$nulls":36},{"$f":"COUNTIF($D101:$AJ101,$AU$1)/$AV$1","v":{"v":0,"d":"0%"}},{"$f":"COUNTIF($D101:$AJ101,$AU$2)/$AV$1","v":{"v":0,"d":"0%"}},{"$f":"COUNTIF($D101:$AJ101,$AU$3)/$AV$1","v":{"v":0,"d":"0%"}},{"$f":"COUNTIF($D101:$AJ101,$AU$4)/$AV$1","v":{"v":0,"d":"0%"}},{"$f":"COUNTIF(D101:$AJ101,\"NE\")/$AV$1","v":{"v":0,"d":"0%"}},{"$f":"AN101+(AO101*0.66)+(AP101*0.33)","v":{"v":0,"d":"0%"}}]
[null,null,"Identifier les principales familles de matériaux.",{"$nulls":36},{"$f":"COUNTIF($D102:$AJ102,$AU$1)/$AV$1","v":{"v":0,"d":"0%"}},{"$f":"COUNTIF($D102:$AJ102,$AU$2)/$AV$1","v":{"v":0,"d":"0%"}},{"$f":"COUNTIF($D102:$AJ102,$AU$3)/$AV$1","v":{"v":0,"d":"0%"}},{"$f":"COUNTIF($D102:$AJ102,$AU$4)/$AV$1","v":{"v":0,"d":"0%"}},{"$f":"COUNTIF(D102:$AJ102,\"NE\")/$AV$1","v":{"v":0,"d":"0%"}},{"$f":"AN102+(AO102*0.66)+(AP102*0.33)","v":{"v":0,"d":"0%"}}]
[null,null,"Décrire le fonctionnement d’objets techniques, leurs fonctions et leurs composants.",{"$nulls":36},{"$f":"COUNTIF($D103:$AJ103,$AU$1)/$AV$1","v":{"v":0,"d":"0%"}},{"$f":"COUNTIF($D103:$AJ103,$AU$2)/$AV$1","v":{"v":0,"d":"0%"}},{"$f":"COUNTIF($D103:$AJ103,$AU$3)/$AV$1","v":{"v":0,"d":"0%"}},{"$f":"COUNTIF($D103:$AJ103,$AU$4)/$AV$1","v":{"v":0,"d":"0%"}},{"$f":"COUNTIF(D103:$AJ103,\"NE\")/$AV$1","v":{"v":0,"d":"0%"}},{"$f":"AN103+(AO103*0.66)+(AP103*0.33)","v":{"v":0,"d":"0%"}}]
[null,null,"Réaliser en équipe tout ou une partie d’un objet technique répondant à un besoin.",{"$nulls":36},{"$f":"COUNTIF($D104:$AJ104,$AU$1)/$AV$1","v":{"v":0,"d":"0%"}},{"$f":"COUNTIF($D104:$AJ104,$AU$2)/$AV$1","v":{"v":0,"d":"0%"}},{"$f":"COUNTIF($D104:$AJ104,$AU$3)/$AV$1","v":{"v":0,"d":"0%"}},{"$f":"COUNTIF($D104:$AJ104,$AU$4)/$AV$1","v":{"v":0,"d":"0%"}},{"$f":"COUNTIF(D104:$AJ104,\"NE\")/$AV$1","v":{"v":0,"d":"0%"}},{"$f":"AN104+(AO104*0.66)+(AP104*0.33)","v":{"v":0,"d":"0%"}}]
[null,null,"Repérer et comprendre la communication et la gestion de l’information.",{"$nulls":36},{"$f":"COUNTIF($D105:$AJ105,$AU$1)/$AV$1","v":{"v":0,"d":"0%"}},{"$f":"COUNTIF($D105:$AJ105,$AU$2)/$AV$1","v":{"v":0,"d":"0%"}},{"$f":"COUNTIF($D105:$AJ105,$AU$3)/$AV$1","v":{"v":0,"d":"0%"}},{"$f":"COUNTIF($D105:$AJ105,$AU$4)/$AV$1","v":{"v":0,"d":"0%"}},{"$f":"COUNTIF(D105:$AJ105,\"NE\")/$AV$1","v":{"v":0,"d":"0%"}},{"$f":"AN105+(AO105*0.66)+(AP105*0.33)","v":{"v":0,"d":"0%"}}]
[null,null,"S'APPROPRIER DES OUTILS ET DES METHODES",{"$f":"COUNTA(D107:D112)*10","v":0},{"$f":"COUNTA(E107:E112)*10","v":0},0,0,0,0,0,0,0,0,0,0,0,0,0,0,0,0,0,0,0,0,0,0,0,0,0,0,0,0,0,0,0]
[null,null,"Choisir ou utiliser le matériel adapté pour mener une observation, effectuer une mesure, réaliser une expérience ou une production. ",{"$nulls":36},{"$f":"COUNTIF($D107:$AJ107,$AU$1)/$AV$1","v":{"v":0,"d":"0%"}},{"$f":"COUNTIF($D107:$AJ107,$AU$2)/$AV$1","v":{"v":0,"d":"0%"}},{"$f":"COUNTIF($D107:$AJ107,$AU$3)/$AV$1","v":{"v":0,"d":"0%"}},{"$f":"COUNTIF($D107:$AJ107,$AU$4)/$AV$1","v":{"v":0,"d":"0%"}},{"$f":"COUNTIF(D107:$AJ107,\"NE\")/$AV$1","v":{"v":0,"d":"0%"}},{"$f":"AN107+(AO107*0.66)+(AP107*0.33)","v":{"v":0,"d":"0%"}}]
[null,null,"Faire le lien entre la mesure réalisée, les unités et l’outil utilisés.",{"$nulls":36},{"v":0,"d":"0%"},{"v":0,"d":"0%"},{"v":0,"d":"0%"},{"v":0,"d":"0%"},{"$f":"COUNTIF(D108:$AJ108,\"NE\")/$AV$1","v":{"v":0,"d":"0%"}},{"v":0,"d":"0%"}]
[null,null,"Garder une trace écrite ou numérique des recherches, des observations et des expériences réalisées.",{"$nulls":36},{"v":0,"d":"0%"},{"v":0,"d":"0%"},{"v":0,"d":"0%"},{"v":0,"d":"0%"},{"$f":"COUNTIF(D109:$AJ109,\"NE\")/$AV$1","v":{"v":0,"d":"0%"}},{"v":0,"d":"0%"}]
[null,null,"Organiser seul ou en groupe un espace de réalisation expérimentale.",{"$nulls":36},{"v":0,"d":"0%"},{"v":0,"d":"0%"},{"v":0,"d":"0%"},{"v":0,"d":"0%"},{"$f":"COUNTIF(D110:$AJ110,\"NE\")/$AV$1","v":{"v":0,"d":"0%"}},{"v":0,"d":"0%"}]
[null,null,"Effectuer des recherches bibliographiques simples et ciblées. Extraire les informations pertinentes d’un document et les mettre en relation pour répondre à une question.",{"$nulls":36},{"v":0,"d":"0%"},{"v":0,"d":"0%"},{"v":0,"d":"0%"},{"v":0,"d":"0%"},{"$f":"COUNTIF(D111:$AJ111,\"NE\")/$AV$1","v":{"v":0,"d":"0%"}},{"v":0,"d":"0%"}]
[null,null,"Utiliser les outils mathématiques adaptés.",{"$nulls":36},{"v":0,"d":"0%"},{"v":0,"d":"0%"},{"v":0,"d":"0%"},{"v":0,"d":"0%"},{"$f":"COUNTIF(D112:$AJ112,\"NE\")/$AV$1","v":{"v":0,"d":"0%"}},{"v":0,"d":"0%"}]
[null,null,"PRATIQUER DES LANGAGES",{"$f":"COUNTA(D114:D117)*10","v":0},{"$f":"COUNTA(E114:E117)*10","v":0},0,0,0,0,0,0,0,0,0,0,0,0,0,0,0,0,0,0,0,0,0,0,0,0,0,0,0,0,0,0,0]
[null,null,"Rendre compte des observations, expériences, hypothèses, conclusions en utilisant un vocabulaire précis.",{"$nulls":36},{"$f":"COUNTIF($D114:$AJ114,$AU$1)/$AV$1","v":{"v":0,"d":"0%"}},{"$f":"COUNTIF($D114:$AJ114,$AU$2)/$AV$1","v":{"v":0,"d":"0%"}},{"$f":"COUNTIF($D114:$AJ114,$AU$3)/$AV$1","v":{"v":0,"d":"0%"}},{"$f":"COUNTIF($D114:$AJ114,$AU$4)/$AV$1","v":{"v":0,"d":"0%"}},{"$f":"COUNTIF(D114:$AJ114,\"NE\")/$AV$1","v":{"v":0,"d":"0%"}},{"$f":"AN114+(AO114*0.66)+(AP114*0.33)","v":{"v":0,"d":"0%"}}]
[null,null,"Exploiter un document constitué de divers supports (texte, schéma, graphique, tableau, algorithme simple).",{"$nulls":36},{"$f":"COUNTIF($D115:$AJ115,$AU$1)/$AV$1","v":{"v":0,"d":"0%"}},{"$f":"COUNTIF($D115:$AJ115,$AU$2)/$AV$1","v":{"v":0,"d":"0%"}},{"$f":"COUNTIF($D115:$AJ115,$AU$3)/$AV$1","v":{"v":0,"d":"0%"}},{"$f":"COUNTIF($D115:$AJ115,$AU$4)/$AV$1","v":{"v":0,"d":"0%"}},{"$f":"COUNTIF(D115:$AJ115,\"NE\")/$AV$1","v":{"v":0,"d":"0%"}},{"$f":"AN115+(AO115*0.66)+(AP115*0.33)","v":{"v":0,"d":"0%"}}]
[null,null,"Utiliser différents modes de représentation formalisés (schéma, dessin, croquis, tableau, graphique, texte). ",{"$nulls":36},{"$f":"COUNTIF($D116:$AJ116,$AU$1)/$AV$1","v":{"v":0,"d":"0%"}},{"$f":"COUNTIF($D116:$AJ116,$AU$2)/$AV$1","v":{"v":0,"d":"0%"}},{"$f":"COUNTIF($D116:$AJ116,$AU$3)/$AV$1","v":{"v":0,"d":"0%"}},{"$f":"COUNTIF($D116:$AJ116,$AU$4)/$AV$1","v":{"v":0,"d":"0%"}},{"$f":"COUNTIF(D116:$AJ116,\"NE\")/$AV$1","v":{"v":0,"d":"0%"}},{"$f":"AN116+(AO116*0.66)+(AP116*0.33)","v":{"v":0,"d":"0%"}}]
[null,null,"Expliquer un phénomène à l’oral et à l’écrit.",{"$nulls":36},{"$f":"COUNTIF($D117:$AJ117,$AU$1)/$AV$1","v":{"v":0,"d":"0%"}},{"$f":"COUNTIF($D117:$AJ117,$AU$2)/$AV$1","v":{"v":0,"d":"0%"}},{"$f":"COUNTIF($D117:$AJ117,$AU$3)/$AV$1","v":{"v":0,"d":"0%"}},{"$f":"COUNTIF($D117:$AJ117,$AU$4)/$AV$1","v":{"v":0,"d":"0%"}},{"$f":"COUNTIF(D117:$AJ117,\"NE\")/$AV$1","v":{"v":0,"d":"0%"}},{"$f":"AN117+(AO117*0.66)+(AP117*0.33)","v":{"v":0,"d":"0%"}}]
[null,null,"MOBILISER LES OUTILS NUMERIQUES",{"$f":"COUNTA(D119:D123)*10","v":0},{"$f":"COUNTA(E119:E123)*10","v":0},0,0,0,0,0,0,0,0,0,0,0,0,0,0,0,0,0,0,0,0,0,0,0,0,0,0,0,0,0,0,0]
[null,null,"Communiquer des résultats ;",{"$nulls":36},{"$f":"COUNTIF($D119:$AJ119,$AU$1)/$AV$1","v":{"v":0,"d":"0%"}},{"$f":"COUNTIF($D119:$AJ119,$AU$2)/$AV$1","v":{"v":0,"d":"0%"}},{"$f":"COUNTIF($D119:$AJ119,$AU$3)/$AV$1","v":{"v":0,"d":"0%"}},{"$f":"COUNTIF($D119:$AJ119,$AU$4)/$AV$1","v":{"v":0,"d":"0%"}},{"$f":"COUNTIF(D119:$AJ119,\"NE\")/$AV$1","v":{"v":0,"d":"0%"}},{"$f":"AN119+(AO119*0.66)+(AP119*0.33)","v":{"v":0,"d":"0%"}}]
[null,null,"Traiter des données ;",{"$nulls":36},{"$f":"COUNTIF($D120:$AJ120,$AU$1)/$AV$1","v":{"v":0,"d":"0%"}},{"$f":"COUNTIF($D120:$AJ120,$AU$2)/$AV$1","v":{"v":0,"d":"0%"}},{"$f":"COUNTIF($D120:$AJ120,$AU$3)/$AV$1","v":{"v":0,"d":"0%"}},{"$f":"COUNTIF($D120:$AJ120,$AU$4)/$AV$1","v":{"v":0,"d":"0%"}},{"$f":"COUNTIF(D120:$AJ120,\"NE\")/$AV$1","v":{"v":0,"d":"0%"}},{"$f":"AN120+(AO120*0.66)+(AP120*0.33)","v":{"v":0,"d":"0%"}}]
[null,null,"Simuler des phénomènes ;",{"$nulls":36},{"$f":"COUNTIF($D121:$AJ121,$AU$1)/$AV$1","v":{"v":0,"d":"0%"}},{"$f":"COUNTIF($D121:$AJ121,$AU$2)/$AV$1","v":{"v":0,"d":"0%"}},{"$f":"COUNTIF($D121:$AJ121,$AU$3)/$AV$1","v":{"v":0,"d":"0%"}},{"$f":"COUNTIF($D121:$AJ121,$AU$4)/$AV$1","v":{"v":0,"d":"0%"}},{"$f":"COUNTIF(D121:$AJ121,\"NE\")/$AV$1","v":{"v":0,"d":"0%"}},{"$f":"AN121+(AO121*0.66)+(AP121*0.33)","v":{"v":0,"d":"0%"}}]
[null,null,"RIeprésenter des objets techniques.",{"$nulls":36},{"$f":"COUNTIF($D122:$AJ122,$AU$1)/$AV$1","v":{"v":0,"d":"0%"}},{"$f":"COUNTIF($D122:$AJ122,$AU$2)/$AV$1","v":{"v":0,"d":"0%"}},{"$f":"COUNTIF($D122:$AJ122,$AU$3)/$AV$1","v":{"v":0,"d":"0%"}},{"$f":"COUNTIF($D122:$AJ122,$AU$4)/$AV$1","v":{"v":0,"d":"0%"}},{"$f":"COUNTIF(D122:$AJ122,\"NE\")/$AV$1","v":{"v":0,"d":"0%"}},{"$f":"AN122+(AO122*0.66)+(AP122*0.33)","v":{"v":0,"d":"0%"}}]
[null,null,"Identifier des sources d’informations fiables.",{"$nulls":36},{"$f":"COUNTIF($D123:$AJ123,$AU$1)/$AV$1","v":{"v":0,"d":"0%"}},{"$f":"COUNTIF($D123:$AJ123,$AU$2)/$AV$1","v":{"v":0,"d":"0%"}},{"$f":"COUNTIF($D123:$AJ123,$AU$3)/$AV$1","v":{"v":0,"d":"0%"}},{"$f":"COUNTIF($D123:$AJ123,$AU$4)/$AV$1","v":{"v":0,"d":"0%"}},{"$f":"COUNTIF(D123:$AJ123,\"NE\")/$AV$1","v":{"v":0,"d":"0%"}},{"$f":"AN123+(AO123*0.66)+(AP123*0.33)","v":{"v":0,"d":"0%"}}]
[null,null,"ADOPTER UN COMPORTEMENT ETHIQUE ET RESPONSABLE",{"$f":"COUNTA(D125:D126)*10","v":0},0,0,0,0,0,0,0,0,0,0,0,0,0,0,0,0,0,0,0,0,0,0,0,0,0,0,0,0,0,0,0,0]
[null,null,"Relier des connaissances acquises en sciences et technologie à des questions de santé, de sécurité et d’environnement.",{"$nulls":36},{"$f":"COUNTIF($D125:$AJ125,$AU$1)/$AV$1","v":{"v":0,"d":"0%"}},{"$f":"COUNTIF($D125:$AJ125,$AU$2)/$AV$1","v":{"v":0,"d":"0%"}},{"$f":"COUNTIF($D125:$AJ125,$AU$3)/$AV$1","v":{"v":0,"d":"0%"}},{"$f":"COUNTIF($D125:$AJ125,$AU$4)/$AV$1","v":{"v":0,"d":"0%"}},{"$f":"COUNTIF(D125:$AJ125,\"NE\")/$AV$1","v":{"v":0,"d":"0%"}},{"$f":"AN125+(AO125*0.66)+(AP125*0.33)","v":{"v":0,"d":"0%"}}]
[null,null,"Mettre en œuvre une action responsable et citoyenne, ",{"$nulls":36},{"$f":"COUNTIF($D126:$AJ126,$AU$1)/$AV$1","v":{"v":0,"d":"0%"}},{"$f":"COUNTIF($D126:$AJ126,$AU$2)/$AV$1","v":{"v":0,"d":"0%"}},{"$f":"COUNTIF($D126:$AJ126,$AU$3)/$AV$1","v":{"v":0,"d":"0%"}},{"$f":"COUNTIF($D126:$AJ126,$AU$4)/$AV$1","v":{"v":0,"d":"0%"}},{"$f":"COUNTIF(D126:$AJ126,\"NE\")/$AV$1","v":{"v":0,"d":"0%"}},{"$f":"AN126+(AO126*0.66)+(AP126*0.33)","v":{"v":0,"d":"0%"}}]
[null,null,"SE SITUER DANS L'ESPACE ET DANS LE TEMPS",{"$f":"COUNTA(D128:D129)*10","v":0},0,0,0,0,0,0,0,0,0,0,0,0,0,0,0,0,0,0,0,0,0,0,0,0,0,0,0,0,0,0,0,0]
[null,null,"Replacer des évolutions scientifiques et technologiques dans un contexte historique, géographique, économique et culturel.",{"$nulls":36},{"$f":"COUNTIF($D128:$AJ128,$AU$1)/$AV$1","v":{"v":0,"d":"0%"}},{"$f":"COUNTIF($D128:$AJ128,$AU$2)/$AV$1","v":{"v":0,"d":"0%"}},{"$f":"COUNTIF($D128:$AJ128,$AU$3)/$AV$1","v":{"v":0,"d":"0%"}},{"$f":"COUNTIF($D128:$AJ128,$AU$4)/$AV$1","v":{"v":0,"d":"0%"}},{"$f":"COUNTIF(D128:$AJ128,\"NE\")/$AV$1","v":{"v":0,"d":"0%"}},{"$f":"AN128+(AO128*0.66)+(AP128*0.33)","v":{"v":0,"d":"0%"}}]
[null,null,"Se situer dans l’environnement et maitriser les notions d’échelle.",{"$nulls":36},{"$f":"COUNTIF($D129:$AJ129,$AU$1)/$AV$1","v":{"v":0,"d":"0%"}},{"$f":"COUNTIF($D129:$AJ129,$AU$2)/$AV$1","v":{"v":0,"d":"0%"}},{"$f":"COUNTIF($D129:$AJ129,$AU$3)/$AV$1","v":{"v":0,"d":"0%"}},{"$f":"COUNTIF($D129:$AJ129,$AU$4)/$AV$1","v":{"v":0,"d":"0%"}},{"$f":"COUNTIF(D129:$AJ129,\"NE\")/$AV$1","v":{"v":0,"d":"0%"}},{"$f":"AN129+(AO129*0.66)+(AP129*0.33)","v":{"v":0,"d":"0%"}}]
[null,"LVE","ECOUTER ET COMPRENDRE",{"$f":"COUNTA(D131:D133)*10","v":0},{"$f":"COUNTA(E131:E133)*10","v":0},0,0,0,0,0,0,0,0,0,0,0,0,0,0,0,0,0,0,0,0,0,0,0,0,0,0,0,0,0,0,0]
[null,null,"Écouter et comprendre des messages oraux simples relevant de la vie quotidienne, des histoires simples. ",{"$nulls":36},{"$f":"COUNTIF($D131:$AJ131,$AU$1)/$AV$1","v":{"v":0,"d":"0%"}},{"$f":"COUNTIF($D131:$AJ131,$AU$2)/$AV$1","v":{"v":0,"d":"0%"}},{"$f":"COUNTIF($D131:$AJ131,$AU$3)/$AV$1","v":{"v":0,"d":"0%"}},{"$f":"COUNTIF($D131:$AJ131,$AU$4)/$AV$1","v":{"v":0,"d":"0%"}},{"$f":"COUNTIF(D131:$AJ131,\"NE\")/$AV$1","v":{"v":0,"d":"0%"}},{"$f":"AN131+(AO131*0.66)+(AP131*0.33)","v":{"v":0,"d":"0%"}}]
[null,null,"Exercer sa mémoire auditive à court et à long terme pour mémoriser des mots, des expressions courantes.",{"$nulls":36},{"$f":"COUNTIF($D132:$AJ132,$AU$1)/$AV$1","v":{"v":0,"d":"0%"}},{"$f":"COUNTIF($D132:$AJ132,$AU$2)/$AV$1","v":{"v":0,"d":"0%"}},{"$f":"COUNTIF($D132:$AJ132,$AU$3)/$AV$1","v":{"v":0,"d":"0%"}},{"$f":"COUNTIF($D132:$AJ132,$AU$4)/$AV$1","v":{"v":0,"d":"0%"}},{"$f":"COUNTIF(D132:$AJ132,\"NE\")/$AV$1","v":{"v":0,"d":"0%"}},{"$f":"AN132+(AO132*0.66)+(AP132*0.33)","v":{"v":0,"d":"0%"}}]
[null,null,"Utiliser des indices sonores et visuels pour déduire le sens de mots inconnus, d’un message.",{"$nulls":36},{"$f":"COUNTIF($D133:$AJ133,$AU$1)/$AV$1","v":{"v":0,"d":"0%"}},{"$f":"COUNTIF($D133:$AJ133,$AU$2)/$AV$1","v":{"v":0,"d":"0%"}},{"$f":"COUNTIF($D133:$AJ133,$AU$3)/$AV$1","v":{"v":0,"d":"0%"}},{"$f":"COUNTIF($D133:$AJ133,$AU$4)/$AV$1","v":{"v":0,"d":"0%"}},{"$f":"COUNTIF(D133:$AJ133,\"NE\")/$AV$1","v":{"v":0,"d":"0%"}},{"$f":"AN133+(AO133*0.66)+(AP133*0.33)","v":{"v":0,"d":"0%"}}]
[null,null,"LIRE ET COMPRENDRE",{"$f":"COUNTA(D135:D138)*10","v":0},{"$f":"COUNTA(E135:E138)*10","v":0},0,0,0,0,0,0,0,0,0,0,0,0,0,0,0,0,0,0,0,0,0,0,0,0,0,0,0,0,0,0,0]
[null,null,"Utiliser le contexte, les illustrations et les connaissances pour comprendre un texte.",{"$nulls":36},{"$f":"COUNTIF($D135:$AJ135,$AU$1)/$AV$1","v":{"v":0,"d":"0%"}},{"$f":"COUNTIF($D135:$AJ135,$AU$2)/$AV$1","v":{"v":0,"d":"0%"}},{"$f":"COUNTIF($D135:$AJ135,$AU$3)/$AV$1","v":{"v":0,"d":"0%"}},{"$f":"COUNTIF($D135:$AJ135,$AU$4)/$AV$1","v":{"v":0,"d":"0%"}},{"$f":"COUNTIF(D135:$AJ135,\"NE\")/$AV$1","v":{"v":0,"d":"0%"}},{"$f":"AN135+(AO135*0.66)+(AP135*0.33)","v":{"v":0,"d":"0%"}}]
[null,null,"Reconnaitre des mots isolés dans un énoncé, un court texte.",{"$nulls":36},{"$f":"COUNTIF($D136:$AJ136,$AU$1)/$AV$1","v":{"v":0,"d":"0%"}},{"$f":"COUNTIF($D136:$AJ136,$AU$2)/$AV$1","v":{"v":0,"d":"0%"}},{"$f":"COUNTIF($D136:$AJ136,$AU$3)/$AV$1","v":{"v":0,"d":"0%"}},{"$f":"COUNTIF($D136:$AJ136,$AU$4)/$AV$1","v":{"v":0,"d":"0%"}},{"$f":"COUNTIF(D136:$AJ136,\"NE\")/$AV$1","v":{"v":0,"d":"0%"}},{"$f":"AN136+(AO136*0.66)+(AP136*0.33)","v":{"v":0,"d":"0%"}}]
[null,null,"S’appuyer sur des mots outils, des structures simples, des expressions rituelles.",{"$nulls":36},{"$f":"COUNTIF($D137:$AJ137,$AU$1)/$AV$1","v":{"v":0,"d":"0%"}},{"$f":"COUNTIF($D137:$AJ137,$AU$2)/$AV$1","v":{"v":0,"d":"0%"}},{"$f":"COUNTIF($D137:$AJ137,$AU$3)/$AV$1","v":{"v":0,"d":"0%"}},{"$f":"COUNTIF($D137:$AJ137,$AU$4)/$AV$1","v":{"v":0,"d":"0%"}},{"$f":"COUNTIF(D137:$AJ137,\"NE\")/$AV$1","v":{"v":0,"d":"0%"}},{"$f":"AN137+(AO137*0.66)+(AP137*0.33)","v":{"v":0,"d":"0%"}}]
[null,null,"Percevoir la relation entre certains graphèmes et phonèmes spécifiques à la langue.",{"$nulls":36},{"$f":"COUNTIF($D138:$AJ138,$AU$1)/$AV$1","v":{"v":0,"d":"0%"}},{"$f":"COUNTIF($D138:$AJ138,$AU$2)/$AV$1","v":{"v":0,"d":"0%"}},{"$f":"COUNTIF($D138:$AJ138,$AU$3)/$AV$1","v":{"v":0,"d":"0%"}},{"$f":"COUNTIF($D138:$AJ138,$AU$4)/$AV$1","v":{"v":0,"d":"0%"}},{"$f":"COUNTIF(D138:$AJ138,\"NE\")/$AV$1","v":{"v":0,"d":"0%"}},{"$f":"AN138+(AO138*0.66)+(AP138*0.33)","v":{"v":0,"d":"0%"}}]
[null,null,"PARLER EN CONTINUE",{"$f":"COUNTA(D140:D142)*10","v":0},0,0,0,0,0,0,0,0,0,0,0,0,0,0,0,0,0,0,0,0,0,0,0,0,0,0,0,0,0,0,0,0]
[null,null,"Mémoriser et reproduire des énoncés.",{"$nulls":36},{"$f":"COUNTIF($D140:$AJ140,$AU$1)/$AV$1","v":{"v":0,"d":"0%"}},{"$f":"COUNTIF($D140:$AJ140,$AU$2)/$AV$1","v":{"v":0,"d":"0%"}},{"$f":"COUNTIF($D140:$AJ140,$AU$3)/$AV$1","v":{"v":0,"d":"0%"}},{"$f":"COUNTIF($D140:$AJ140,$AU$4)/$AV$1","v":{"v":0,"d":"0%"}},{"$f":"COUNTIF(D140:$AJ140,\"NE\")/$AV$1","v":{"v":0,"d":"0%"}},{"$f":"AN140+(AO140*0.66)+(AP140*0.33)","v":{"v":0,"d":"0%"}}]
[null,null,"S’exprimer de manière audible, en modulant débit et voix.",{"$nulls":36},{"$f":"COUNTIF($D141:$AJ141,$AU$1)/$AV$1","v":{"v":0,"d":"0%"}},{"$f":"COUNTIF($D141:$AJ141,$AU$2)/$AV$1","v":{"v":0,"d":"0%"}},{"$f":"COUNTIF($D141:$AJ141,$AU$3)/$AV$1","v":{"v":0,"d":"0%"}},{"$f":"COUNTIF($D141:$AJ141,$AU$4)/$AV$1","v":{"v":0,"d":"0%"}},{"$f":"COUNTIF(D141:$AJ141,\"NE\")/$AV$1","v":{"v":0,"d":"0%"}},{"$f":"AN141+(AO141*0.66)+(AP141*0.33)","v":{"v":0,"d":"0%"}}]
[null,null,"Participer à des échanges simples ,pour être entendu et compris dans quelques situations diversifiées de la vie quotidienne.",{"$nulls":36},{"$f":"COUNTIF($D142:$AJ142,$AU$1)/$AV$1","v":{"v":0,"d":"0%"}},{"$f":"COUNTIF($D142:$AJ142,$AU$2)/$AV$1","v":{"v":0,"d":"0%"}},{"$f":"COUNTIF($D142:$AJ142,$AU$3)/$AV$1","v":{"v":0,"d":"0%"}},{"$f":"COUNTIF($D142:$AJ142,$AU$4)/$AV$1","v":{"v":0,"d":"0%"}},{"$f":"COUNTIF(D142:$AJ142,\"NE\")/$AV$1","v":{"v":0,"d":"0%"}},{"$f":"AN142+(AO142*0.66)+(AP142*0.33)","v":{"v":0,"d":"0%"}}]
[null,null,"ECRIRE",{"$f":"COUNTA(D144:D145)*10","v":0},{"$f":"COUNTA(E144:E145)*10","v":0},0,0,0,0,0,0,0,0,0,0,0,0,0,0,0,0,0,0,0,0,0,0,0,0,0,0,0,0,0,0,0]
[null,null,"Écrire des mots et des expressions dont l’orthographe et la syntaxe ont été mémorisées. ",{"$nulls":36},{"$f":"COUNTIF($D144:$AJ144,$AU$1)/$AV$1","v":{"v":0,"d":"0%"}},{"$f":"COUNTIF($D144:$AJ144,$AU$2)/$AV$1","v":{"v":0,"d":"0%"}},{"$f":"COUNTIF($D144:$AJ144,$AU$3)/$AV$1","v":{"v":0,"d":"0%"}},{"$f":"COUNTIF($D144:$AJ144,$AU$4)/$AV$1","v":{"v":0,"d":"0%"}},{"$f":"COUNTIF(D144:$AJ144,\"NE\")/$AV$1","v":{"v":0,"d":"0%"}},{"$f":"AN144+(AO144*0.66)+(AP144*0.33)","v":{"v":0,"d":"0%"}}]
[null,null,"Mobiliser des structures simples pour écrire des phrases en s’appuyant sur une trame connue.",{"$nulls":36},{"$f":"COUNTIF($D145:$AJ145,$AU$1)/$AV$1","v":{"v":0,"d":"0%"}},{"$f":"COUNTIF($D145:$AJ145,$AU$2)/$AV$1","v":{"v":0,"d":"0%"}},{"$f":"COUNTIF($D145:$AJ145,$AU$3)/$AV$1","v":{"v":0,"d":"0%"}},{"$f":"COUNTIF($D145:$AJ145,$AU$4)/$AV$1","v":{"v":0,"d":"0%"}},{"$f":"COUNTIF(D145:$AJ145,\"NE\")/$AV$1","v":{"v":0,"d":"0%"}},{"$f":"AN145+(AO145*0.66)+(AP145*0.33)","v":{"v":0,"d":"0%"}}]
[null,null,"REAGIR ET DIALOGUER",{"$f":"COUNTA(D147:D149)*10","v":0},0,0,0,0,0,0,0,0,0,0,0,0,0,0,0,0,0,0,0,0,0,0,0,0,0,0,0,0,0,0,0,0]
[null,null,"Poser des questions simples.",{"$nulls":36},{"$f":"COUNTIF($D147:$AJ147,$AU$1)/$AV$1","v":{"v":0,"d":"0%"}},{"$f":"COUNTIF($D147:$AJ147,$AU$2)/$AV$1","v":{"v":0,"d":"0%"}},{"$f":"COUNTIF($D147:$AJ147,$AU$3)/$AV$1","v":{"v":0,"d":"0%"}},{"$f":"COUNTIF($D147:$AJ147,$AU$4)/$AV$1","v":{"v":0,"d":"0%"}},{"$f":"COUNTIF(D147:$AJ147,\"NE\")/$AV$1","v":{"v":0,"d":"0%"}},{"$f":"AN147+(AO147*0.66)+(AP147*0.33)","v":{"v":0,"d":"0%"}}]
[null,null,"Mobiliser des énoncés adéquats au contexte dans une succession d’échanges ritualisés.",{"$nulls":36},{"$f":"COUNTIF($D148:$AJ148,$AU$1)/$AV$1","v":{"v":0,"d":"0%"}},{"$f":"COUNTIF($D148:$AJ148,$AU$2)/$AV$1","v":{"v":0,"d":"0%"}},{"$f":"COUNTIF($D148:$AJ148,$AU$3)/$AV$1","v":{"v":0,"d":"0%"}},{"$f":"COUNTIF($D148:$AJ148,$AU$4)/$AV$1","v":{"v":0,"d":"0%"}},{"$f":"COUNTIF(D148:$AJ148,\"NE\")/$AV$1","v":{"v":0,"d":"0%"}},{"$f":"AN148+(AO148*0.66)+(AP148*0.33)","v":{"v":0,"d":"0%"}}]
[null,null,"Utiliser des procédés très simples pour commencer, poursuivre et terminer une conversation brève.",{"$nulls":36},{"$f":"COUNTIF($D149:$AJ149,$AU$1)/$AV$1","v":{"v":0,"d":"0%"}},{"$f":"COUNTIF($D149:$AJ149,$AU$2)/$AV$1","v":{"v":0,"d":"0%"}},{"$f":"COUNTIF($D149:$AJ149,$AU$3)/$AV$1","v":{"v":0,"d":"0%"}},{"$f":"COUNTIF($D149:$AJ149,$AU$4)/$AV$1","v":{"v":0,"d":"0%"}},{"$f":"COUNTIF(D149:$AJ149,\"NE\")/$AV$1","v":{"v":0,"d":"0%"}},{"$f":"AN149+(AO149*0.66)+(AP149*0.33)","v":{"v":0,"d":"0%"}}]
[null,null,"ASPECTS CULTURELS",{"$f":"COUNTA(D151:D152)*10","v":0},{"$f":"COUNTA(E151:E152)*10","v":0},0,0,0,0,0,0,0,0,0,0,0,0,0,0,0,0,0,0,0,0,0,0,0,0,0,0,0,0,0,0,0]
[null,null,"Identifier quelques grands repères culturels de l’environnement quotidien des élèves du même âge dans les pays ou régions étudiés.",{"$nulls":36},{"$f":"COUNTIF($D151:$AJ151,$AU$1)/$AV$1","v":{"v":0,"d":"0%"}},{"$f":"COUNTIF($D151:$AJ151,$AU$2)/$AV$1","v":{"v":0,"d":"0%"}},{"$f":"COUNTIF($D151:$AJ151,$AU$3)/$AV$1","v":{"v":0,"d":"0%"}},{"$f":"COUNTIF($D151:$AJ151,$AU$4)/$AV$1","v":{"v":0,"d":"0%"}},{"$f":"COUNTIF(D151:$AJ151,\"NE\")/$AV$1","v":{"v":0,"d":"0%"}},{"$f":"AN151+(AO151*0.66)+(AP151*0.33)","v":{"v":0,"d":"0%"}}]
[null,null,"Mobiliser ses connaissances culturelles pour décrire ou raconter des personnages réels ou imaginaires.",{"$nulls":36},{"$f":"COUNTIF($D152:$AJ152,$AU$1)/$AV$1","v":{"v":0,"d":"0%"}},{"$f":"COUNTIF($D152:$AJ152,$AU$2)/$AV$1","v":{"v":0,"d":"0%"}},{"$f":"COUNTIF($D152:$AJ152,$AU$3)/$AV$1","v":{"v":0,"d":"0%"}},{"$f":"COUNTIF($D152:$AJ152,$AU$4)/$AV$1","v":{"v":0,"d":"0%"}},{"$f":"COUNTIF(D152:$AJ152,\"NE\")/$AV$1","v":{"v":0,"d":"0%"}},{"$f":"AN152+(AO152*0.66)+(AP152*0.33)","v":{"v":0,"d":"0%"}}]
[null,"ARTS PLASTIQUES","EXPERIMENTER, PRODUIRE, CRÉER",{"$f":"COUNTA(D154:D157)*10","v":0},0,0,0,0,0,0,0,0,0,0,0,0,0,0,0,0,0,0,0,0,0,0,0,0,0,0,0,0,0,0,0,0]
[null,null,"Choisir, organiser et mobiliser des gestes, des outils et des matériaux en fonction des effets qu’ils produisent.",{"$nulls":36},{"$f":"COUNTIF($D154:$AJ154,$AU$1)/$AV$1","v":{"v":0,"d":"0%"}},{"$f":"COUNTIF($D154:$AJ154,$AU$2)/$AV$1","v":{"v":0,"d":"0%"}},{"$f":"COUNTIF($D154:$AJ154,$AU$3)/$AV$1","v":{"v":0,"d":"0%"}},{"$f":"COUNTIF($D154:$AJ154,$AU$4)/$AV$1","v":{"v":0,"d":"0%"}},{"$f":"COUNTIF(D154:$AJ154,\"NE\")/$AV$1","v":{"v":0,"d":"0%"}},{"$f":"AN154+(AO154*0.66)+(AP154*0.33)","v":{"v":0,"d":"0%"}}]
[null,null,"Représenter le monde environnant ou donner forme à son imaginaire en explorant divers domaines.",{"$nulls":36},{"$f":"COUNTIF($D155:$AJ155,$AU$1)/$AV$1","v":{"v":0,"d":"0%"}},{"$f":"COUNTIF($D155:$AJ155,$AU$2)/$AV$1","v":{"v":0,"d":"0%"}},{"$f":"COUNTIF($D155:$AJ155,$AU$3)/$AV$1","v":{"v":0,"d":"0%"}},{"$f":"COUNTIF($D155:$AJ155,$AU$4)/$AV$1","v":{"v":0,"d":"0%"}},{"$f":"COUNTIF(D155:$AJ155,\"NE\")/$AV$1","v":{"v":0,"d":"0%"}},{"$f":"AN155+(AO155*0.66)+(AP155*0.33)","v":{"v":0,"d":"0%"}}]
[null,null,"Rechercher une expression personnelle en s’éloignant des stéréotypes.",{"$nulls":36},{"$f":"COUNTIF($D156:$AJ156,$AU$1)/$AV$1","v":{"v":0,"d":"0%"}},{"$f":"COUNTIF($D156:$AJ156,$AU$2)/$AV$1","v":{"v":0,"d":"0%"}},{"$f":"COUNTIF($D156:$AJ156,$AU$3)/$AV$1","v":{"v":0,"d":"0%"}},{"$f":"COUNTIF($D156:$AJ156,$AU$4)/$AV$1","v":{"v":0,"d":"0%"}},{"$f":"COUNTIF(D156:$AJ156,\"NE\")/$AV$1","v":{"v":0,"d":"0%"}},{"$f":"AN156+(AO156*0.66)+(AP156*0.33)","v":{"v":0,"d":"0%"}}]
[null,null,"Intégrer l’usage des outils informatiques de travail de l’image et de recherche d’information, au service de la pratique plastique.",{"$nulls":36},{"$f":"COUNTIF($D157:$AJ157,$AU$1)/$AV$1","v":{"v":0,"d":"0%"}},{"$f":"COUNTIF($D157:$AJ157,$AU$2)/$AV$1","v":{"v":0,"d":"0%"}},{"$f":"COUNTIF($D157:$AJ157,$AU$3)/$AV$1","v":{"v":0,"d":"0%"}},{"$f":"COUNTIF($D157:$AJ157,$AU$4)/$AV$1","v":{"v":0,"d":"0%"}},{"$f":"COUNTIF(D157:$AJ157,\"NE\")/$AV$1","v":{"v":0,"d":"0%"}},{"$f":"AN157+(AO157*0.66)+(AP157*0.33)","v":{"v":0,"d":"0%"}}]
[null,null,"METTRE EN OEUVRE UN PROJET ARTISTIQUE",{"$f":"COUNTA(D159:D162)*10","v":0},0,0,0,0,0,0,0,0,0,0,0,0,0,0,0,0,0,0,0,0,0,0,0,0,0,0,0,0,0,0,0,0]
[null,null,"Identifier les principaux outils et compétences nécessaires à la réalisation d’un projet artistique.",{"$nulls":36},{"$f":"COUNTIF($D159:$AJ159,$AU$1)/$AV$1","v":{"v":0,"d":"0%"}},{"$f":"COUNTIF($D159:$AJ159,$AU$2)/$AV$1","v":{"v":0,"d":"0%"}},{"$f":"COUNTIF($D159:$AJ159,$AU$3)/$AV$1","v":{"v":0,"d":"0%"}},{"$f":"COUNTIF($D159:$AJ159,$AU$4)/$AV$1","v":{"v":0,"d":"0%"}},{"$f":"COUNTIF(D159:$AJ159,\"NE\")/$AV$1","v":{"v":0,"d":"0%"}},{"$f":"AN159+(AO159*0.66)+(AP159*0.33)","v":{"v":0,"d":"0%"}}]
[null,null,"Se repérer dans les étapes de la réalisation d’une production plastique individuelle ou collective, anticiper les difficultés éventuelles.",{"$nulls":36},{"$f":"COUNTIF($D160:$AJ160,$AU$1)/$AV$1","v":{"v":0,"d":"0%"}},{"$f":"COUNTIF($D160:$AJ160,$AU$2)/$AV$1","v":{"v":0,"d":"0%"}},{"$f":"COUNTIF($D160:$AJ160,$AU$3)/$AV$1","v":{"v":0,"d":"0%"}},{"$f":"COUNTIF($D160:$AJ160,$AU$4)/$AV$1","v":{"v":0,"d":"0%"}},{"$f":"COUNTIF(D160:$AJ160,\"NE\")/$AV$1","v":{"v":0,"d":"0%"}},{"$f":"AN160+(AO160*0.66)+(AP160*0.33)","v":{"v":0,"d":"0%"}}]
[null,null,"Identifier et assumer sa part de responsabilité dans un processus coopératif de création.",{"$nulls":36},{"$f":"COUNTIF($D161:$AJ161,$AU$1)/$AV$1","v":{"v":0,"d":"0%"}},{"$f":"COUNTIF($D161:$AJ161,$AU$2)/$AV$1","v":{"v":0,"d":"0%"}},{"$f":"COUNTIF($D161:$AJ161,$AU$3)/$AV$1","v":{"v":0,"d":"0%"}},{"$f":"COUNTIF($D161:$AJ161,$AU$4)/$AV$1","v":{"v":0,"d":"0%"}},{"$f":"COUNTIF(D161:$AJ161,\"NE\")/$AV$1","v":{"v":0,"d":"0%"}},{"$f":"AN161+(AO161*0.66)+(AP161*0.33)","v":{"v":0,"d":"0%"}}]
[null,null,"Adapter son projet en fonction des contraintes de réalisation et de la prise en compte du spectateur.",{"$nulls":36},{"$f":"COUNTIF($D162:$AJ162,$AU$1)/$AV$1","v":{"v":0,"d":"0%"}},{"$f":"COUNTIF($D162:$AJ162,$AU$2)/$AV$1","v":{"v":0,"d":"0%"}},{"$f":"COUNTIF($D162:$AJ162,$AU$3)/$AV$1","v":{"v":0,"d":"0%"}},{"$f":"COUNTIF($D162:$AJ162,$AU$4)/$AV$1","v":{"v":0,"d":"0%"}},{"$f":"COUNTIF(D162:$AJ162,\"NE\")/$AV$1","v":{"v":0,"d":"0%"}},{"$f":"AN162+(AO162*0.66)+(AP162*0.33)","v":{"v":0,"d":"0%"}}]
[null,null,"S'EXPRIMER, ANALYSER SA PRATIQUE, CELLE DE SES PAIRS",{"$f":"COUNTA(D164:D166)*10","v":0},{"$f":"COUNTA(E164:E166)*10","v":0},0,0,0,0,0,0,0,0,0,0,0,0,0,0,0,0,0,0,0,0,0,0,0,0,0,0,0,0,0,0,0]
[null,null,"Décrire et interroger à l’aide d’un vocabulaire spécifique ses productions plastiques, celles de ses pairs et des œuvres d’art étudiées en classe.",{"$nulls":36},{"$f":"COUNTIF($D164:$AJ164,$AU$1)/$AV$1","v":{"v":0,"d":"0%"}},{"$f":"COUNTIF($D164:$AJ164,$AU$2)/$AV$1","v":{"v":0,"d":"0%"}},{"$f":"COUNTIF($D164:$AJ164,$AU$3)/$AV$1","v":{"v":0,"d":"0%"}},{"$f":"COUNTIF($D164:$AJ164,$AU$4)/$AV$1","v":{"v":0,"d":"0%"}},{"$f":"COUNTIF(D164:$AJ164,\"NE\")/$AV$1","v":{"v":0,"d":"0%"}},{"$f":"AN164+(AO164*0.66)+(AP164*0.33)","v":{"v":0,"d":"0%"}}]
[null,null,"Justifier des choix pour rendre compte du cheminement qui conduit de l’intention à la réalisation.",{"$nulls":36},{"$f":"COUNTIF($D165:$AJ165,$AU$1)/$AV$1","v":{"v":0,"d":"0%"}},{"$f":"COUNTIF($D165:$AJ165,$AU$2)/$AV$1","v":{"v":0,"d":"0%"}},{"$f":"COUNTIF($D165:$AJ165,$AU$3)/$AV$1","v":{"v":0,"d":"0%"}},{"$f":"COUNTIF($D165:$AJ165,$AU$4)/$AV$1","v":{"v":0,"d":"0%"}},{"$f":"COUNTIF(D165:$AJ165,\"NE\")/$AV$1","v":{"v":0,"d":"0%"}},{"$f":"AN165+(AO165*0.66)+(AP165*0.33)","v":{"v":0,"d":"0%"}}]
[null,null,"Formuler une expression juste de ses émotions, en prenant appui sur ses propres réalisations plastiques, celles des autres élèves et des œuvres d’art.",{"$nulls":36},{"$f":"COUNTIF($D166:$AJ166,$AU$1)/$AV$1","v":{"v":0,"d":"0%"}},{"$f":"COUNTIF($D166:$AJ166,$AU$2)/$AV$1","v":{"v":0,"d":"0%"}},{"$f":"COUNTIF($D166:$AJ166,$AU$3)/$AV$1","v":{"v":0,"d":"0%"}},{"$f":"COUNTIF($D166:$AJ166,$AU$4)/$AV$1","v":{"v":0,"d":"0%"}},{"$f":"COUNTIF(D166:$AJ166,\"NE\")/$AV$1","v":{"v":0,"d":"0%"}},{"$f":"AN166+(AO166*0.66)+(AP166*0.33)","v":{"v":0,"d":"0%"}}]
[null,null,"SE REPERER DANS LES DOMAINES LIES AUX ARTS PLASTIQUES",{"$f":"COUNTA(D168:D170)*10","v":0},0,0,0,0,0,0,0,0,0,0,0,0,0,0,0,0,0,0,0,0,0,0,0,0,0,0,0,0,0,0,0,0]
[null,null,"Repérer, pour les dépasser, certains a priori et stéréotypes culturels et artistiques.",{"$nulls":36},{"$f":"COUNTIF($D168:$AJ168,$AU$1)/$AV$1","v":{"v":0,"d":"0%"}},{"$f":"COUNTIF($D168:$AJ168,$AU$2)/$AV$1","v":{"v":0,"d":"0%"}},{"$f":"COUNTIF($D168:$AJ168,$AU$3)/$AV$1","v":{"v":0,"d":"0%"}},{"$f":"COUNTIF($D168:$AJ168,$AU$4)/$AV$1","v":{"v":0,"d":"0%"}},{"$f":"COUNTIF(D168:$AJ168,\"NE\")/$AV$1","v":{"v":0,"d":"0%"}},{"$f":"AN168+(AO168*0.66)+(AP168*0.33)","v":{"v":0,"d":"0%"}}]
[null,null,"Identifier quelques caractéristiques qui inscrivent une œuvre d’art dans une aire géographique ou culturelle et dans un temps historique, contemporain, proche ou lointain.",{"$nulls":36},{"$f":"COUNTIF($D169:$AJ169,$AU$1)/$AV$1","v":{"v":0,"d":"0%"}},{"$f":"COUNTIF($D169:$AJ169,$AU$2)/$AV$1","v":{"v":0,"d":"0%"}},{"$f":"COUNTIF($D169:$AJ169,$AU$3)/$AV$1","v":{"v":0,"d":"0%"}},{"$f":"COUNTIF($D169:$AJ169,$AU$4)/$AV$1","v":{"v":0,"d":"0%"}},{"$f":"COUNTIF(D169:$AJ169,\"NE\")/$AV$1","v":{"v":0,"d":"0%"}},{"$f":"AN169+(AO169*0.66)+(AP169*0.33)","v":{"v":0,"d":"0%"}}]
[null,null,"Décrire des œuvres d’art, en proposer une compréhension personnelle argumentée.",{"$nulls":36},{"$f":"COUNTIF($D170:$AJ170,$AU$1)/$AV$1","v":{"v":0,"d":"0%"}},{"$f":"COUNTIF($D170:$AJ170,$AU$2)/$AV$1","v":{"v":0,"d":"0%"}},{"$f":"COUNTIF($D170:$AJ170,$AU$3)/$AV$1","v":{"v":0,"d":"0%"}},{"$f":"COUNTIF($D170:$AJ170,$AU$4)/$AV$1","v":{"v":0,"d":"0%"}},{"$f":"COUNTIF(D170:$AJ170,\"NE\")/$AV$1","v":{"v":0,"d":"0%"}},{"$f":"AN170+(AO170*0.66)+(AP170*0.33)","v":{"v":0,"d":"0%"}}]
[null,"EDUCATION MUSICALE","CHANTER ET INTERPRETER",{"$f":"COUNTA(D172:D173)*10","v":0},{"$f":"COUNTA(E172:E173)*10","v":0},0,0,0,0,0,0,0,0,0,0,0,0,0,0,0,0,0,0,0,0,0,0,0,0,0,0,0,0,0,0,0]
[null,null,"Reproduire et interpréter un modèle mélodique et rythmique.",{"$nulls":36},{"$f":"COUNTIF($D172:$AJ172,$AU$1)/$AV$1","v":{"v":0,"d":"0%"}},{"$f":"COUNTIF($D172:$AJ172,$AU$2)/$AV$1","v":{"v":0,"d":"0%"}},{"$f":"COUNTIF($D172:$AJ172,$AU$3)/$AV$1","v":{"v":0,"d":"0%"}},{"$f":"COUNTIF($D172:$AJ172,$AU$4)/$AV$1","v":{"v":0,"d":"0%"}},{"$f":"COUNTIF(D172:$AJ172,\"NE\")/$AV$1","v":{"v":0,"d":"0%"}},{"$f":"AN172+(AO172*0.66)+(AP172*0.33)","v":{"v":0,"d":"0%"}}]
[null,null,"Interpréter un répertoire varié avec expressivité.",{"$nulls":36},{"$f":"COUNTIF($D173:$AJ173,$AU$1)/$AV$1","v":{"v":0,"d":"0%"}},{"$f":"COUNTIF($D173:$AJ173,$AU$2)/$AV$1","v":{"v":0,"d":"0%"}},{"$f":"COUNTIF($D173:$AJ173,$AU$3)/$AV$1","v":{"v":0,"d":"0%"}},{"$f":"COUNTIF($D173:$AJ173,$AU$4)/$AV$1","v":{"v":0,"d":"0%"}},{"$f":"COUNTIF(D173:$AJ173,\"NE\")/$AV$1","v":{"v":0,"d":"0%"}},{"$f":"AN173+(AO173*0.66)+(AP173*0.33)","v":{"v":0,"d":"0%"}}]
[null,null,"ECOUTER, COMPARER ET COMMENTER",{"$f":"COUNTA(D175:D177)*10","v":0},{"$f":"COUNTA(E175:E177)*10","v":0},0,0,0,0,0,0,0,0,0,0,0,0,0,0,0,0,0,0,0,0,0,0,0,0,0,0,0,0,0,0,0]
[null,null,"Décrire et comparer des éléments sonores issus de contextes musicaux différents.",{"$nulls":36},{"$f":"COUNTIF($D175:$AJ175,$AU$1)/$AV$1","v":{"v":0,"d":"0%"}},{"$f":"COUNTIF($D175:$AJ175,$AU$2)/$AV$1","v":{"v":0,"d":"0%"}},{"$f":"COUNTIF($D175:$AJ175,$AU$3)/$AV$1","v":{"v":0,"d":"0%"}},{"$f":"COUNTIF($D175:$AJ175,$AU$4)/$AV$1","v":{"v":0,"d":"0%"}},{"$f":"COUNTIF(D175:$AJ175,\"NE\")/$AV$1","v":{"v":0,"d":"0%"}},{"$f":"AN175+(AO175*0.66)+(AP175*0.33)","v":{"v":0,"d":"0%"}}]
[null,null,"Identifier et nommer ressemblances et différences dans deux extraits musicaux.",{"$nulls":36},{"$f":"COUNTIF($D176:$AJ176,$AU$1)/$AV$1","v":{"v":0,"d":"0%"}},{"$f":"COUNTIF($D176:$AJ176,$AU$2)/$AV$1","v":{"v":0,"d":"0%"}},{"$f":"COUNTIF($D176:$AJ176,$AU$3)/$AV$1","v":{"v":0,"d":"0%"}},{"$f":"COUNTIF($D176:$AJ176,$AU$4)/$AV$1","v":{"v":0,"d":"0%"}},{"$f":"COUNTIF(D176:$AJ176,\"NE\")/$AV$1","v":{"v":0,"d":"0%"}},{"$f":"AN176+(AO176*0.66)+(AP176*0.33)","v":{"v":0,"d":"0%"}}]
[null,null,"Identifier quelques caractéristiques qui inscrivent une œuvre musicale dans une aire géographique ou culturelle et dans un temps historique contemporain, proche ou lointain.",{"$nulls":36},{"$f":"COUNTIF($D177:$AJ177,$AU$1)/$AV$1","v":{"v":0,"d":"0%"}},{"$f":"COUNTIF($D177:$AJ177,$AU$2)/$AV$1","v":{"v":0,"d":"0%"}},{"$f":"COUNTIF($D177:$AJ177,$AU$3)/$AV$1","v":{"v":0,"d":"0%"}},{"$f":"COUNTIF($D177:$AJ177,$AU$4)/$AV$1","v":{"v":0,"d":"0%"}},{"$f":"COUNTIF(D177:$AJ177,\"NE\")/$AV$1","v":{"v":0,"d":"0%"}},{"$f":"AN177+(AO177*0.66)+(AP177*0.33)","v":{"v":0,"d":"0%"}}]
[null,null,"EXPLORER, IMAGINER",{"$f":"COUNTA(D179:D180)*10","v":0},{"$f":"COUNTA(E179:E180)*10","v":0},0,0,0,0,0,0,0,0,0,0,0,0,0,0,0,0,0,0,0,0,0,0,0,0,0,0,0,0,0,0,0]
[null,null,"Imaginer l’organisation de différents éléments sonores.",{"$nulls":36},{"$f":"COUNTIF($D179:$AJ179,$AU$1)/$AV$1","v":{"v":0,"d":"0%"}},{"$f":"COUNTIF($D179:$AJ179,$AU$2)/$AV$1","v":{"v":0,"d":"0%"}},{"$f":"COUNTIF($D179:$AJ179,$AU$3)/$AV$1","v":{"v":0,"d":"0%"}},{"$f":"COUNTIF($D179:$AJ179,$AU$4)/$AV$1","v":{"v":0,"d":"0%"}},{"$f":"COUNTIF(D179:$AJ179,\"NE\")/$AV$1","v":{"v":0,"d":"0%"}},{"$f":"AN179+(AO179*0.66)+(AP179*0.33)","v":{"v":0,"d":"0%"}}]
[null,null,"Faire des propositions personnelles lors de moments de création, d’invention et d’interprétation.",{"$nulls":36},{"$f":"COUNTIF($D180:$AJ180,$AU$1)/$AV$1","v":{"v":0,"d":"0%"}},{"$f":"COUNTIF($D180:$AJ180,$AU$2)/$AV$1","v":{"v":0,"d":"0%"}},{"$f":"COUNTIF($D180:$AJ180,$AU$3)/$AV$1","v":{"v":0,"d":"0%"}},{"$f":"COUNTIF($D180:$AJ180,$AU$4)/$AV$1","v":{"v":0,"d":"0%"}},{"$f":"COUNTIF(D180:$AJ180,\"NE\")/$AV$1","v":{"v":0,"d":"0%"}},{"$f":"AN180+(AO180*0.66)+(AP180*0.33)","v":{"v":0,"d":"0%"}}]
[null,null,"ECHANGER, PARTAGER",{"$f":"COUNTA(D182:D183)*10","v":0},{"$f":"COUNTA(E182:E183)*10","v":0},0,0,0,0,0,0,0,0,0,0,0,0,0,0,0,0,0,0,0,0,0,0,0,0,0,0,0,0,0,0,0]
[null,null,"Argumenter un jugement sur une musique.",{"$nulls":36},{"$f":"COUNTIF($D182:$AJ182,$AU$1)/$AV$1","v":{"v":0,"d":"0%"}},{"$f":"COUNTIF($D182:$AJ182,$AU$2)/$AV$1","v":{"v":0,"d":"0%"}},{"$f":"COUNTIF($D182:$AJ182,$AU$3)/$AV$1","v":{"v":0,"d":"0%"}},{"$f":"COUNTIF($D182:$AJ182,$AU$4)/$AV$1","v":{"v":0,"d":"0%"}},{"$f":"COUNTIF(D182:$AJ182,\"NE\")/$AV$1","v":{"v":0,"d":"0%"}},{"$f":"AN182+(AO182*0.66)+(AP182*0.33)","v":{"v":0,"d":"0%"}}]
[null,null,"Écouter et respecter le point de vue des autres et l’expression de leur sensibilité.",{"$nulls":36},{"$f":"COUNTIF($D183:$AJ183,$AU$1)/$AV$1","v":{"v":0,"d":"0%"}},{"$f":"COUNTIF($D183:$AJ183,$AU$2)/$AV$1","v":{"v":0,"d":"0%"}},{"$f":"COUNTIF($D183:$AJ183,$AU$3)/$AV$1","v":{"v":0,"d":"0%"}},{"$f":"COUNTIF($D183:$AJ183,$AU$4)/$AV$1","v":{"v":0,"d":"0%"}},{"$f":"COUNTIF(D183:$AJ183,\"NE\")/$AV$1","v":{"v":0,"d":"0%"}},{"$f":"AN183+(AO183*0.66)+(AP183*0.33)","v":{"v":0,"d":"0%"}}]
[null,null,"HISTOIRE DES ARTS",{"$f":"COUNTA(D185:D188)*10","v":0},{"$f":"COUNTA(E185:E188)*10","v":0},0,0,0,0,0,0,0,0,0,0,0,0,0,0,0,0,0,0,0,0,0,0,0,0,0,0,0,0,0,0,0]
[null,null,"Identifier : donner un avis argumenté sur ce que représente ou exprime une œuvre d’art. ",{"$nulls":36},{"$f":"COUNTIF($D185:$AJ185,$AU$1)/$AV$1","v":{"v":0,"d":"0%"}},{"$f":"COUNTIF($D185:$AJ185,$AU$2)/$AV$1","v":{"v":0,"d":"0%"}},{"$f":"COUNTIF($D185:$AJ185,$AU$3)/$AV$1","v":{"v":0,"d":"0%"}},{"$f":"COUNTIF($D185:$AJ185,$AU$4)/$AV$1","v":{"v":0,"d":"0%"}},{"$f":"COUNTIF(D185:$AJ185,\"NE\")/$AV$1","v":{"v":0,"d":"0%"}},{"$f":"AN185+(AO185*0.66)+(AP185*0.33)","v":{"v":0,"d":"0%"}}]
[null,null,"Analyser : dégager d’une œuvre d’art, par l’observation ou l’écoute, ses principales caractéristiques techniques et formelles.",{"$nulls":36},{"$f":"COUNTIF($D186:$AJ186,$AU$1)/$AV$1","v":{"v":0,"d":"0%"}},{"$f":"COUNTIF($D186:$AJ186,$AU$2)/$AV$1","v":{"v":0,"d":"0%"}},{"$f":"COUNTIF($D186:$AJ186,$AU$3)/$AV$1","v":{"v":0,"d":"0%"}},{"$f":"COUNTIF($D186:$AJ186,$AU$4)/$AV$1","v":{"v":0,"d":"0%"}},{"$f":"COUNTIF(D186:$AJ186,\"NE\")/$AV$1","v":{"v":0,"d":"0%"}},{"$f":"AN186+(AO186*0.66)+(AP186*0.33)","v":{"v":0,"d":"0%"}}]
[null,null,"Situer : relier des caractéristiques d’une œuvre d’art à des usages ainsi qu’au contexte historique et culturel de sa création.",{"$nulls":36},{"$f":"COUNTIF($D187:$AJ187,$AU$1)/$AV$1","v":{"v":0,"d":"0%"}},{"$f":"COUNTIF($D187:$AJ187,$AU$2)/$AV$1","v":{"v":0,"d":"0%"}},{"$f":"COUNTIF($D187:$AJ187,$AU$3)/$AV$1","v":{"v":0,"d":"0%"}},{"$f":"COUNTIF($D187:$AJ187,$AU$4)/$AV$1","v":{"v":0,"d":"0%"}},{"$f":"COUNTIF(D187:$AJ187,\"NE\")/$AV$1","v":{"v":0,"d":"0%"}},{"$f":"AN187+(AO187*0.66)+(AP187*0.33)","v":{"v":0,"d":"0%"}}]
[null,null,"Se repérer dans un musée, un lieu d’art, un site patrimonial.",{"$nulls":36},{"$f":"COUNTIF($D188:$AJ188,$AU$1)/$AV$1","v":{"v":0,"d":"0%"}},{"$f":"COUNTIF($D188:$AJ188,$AU$2)/$AV$1","v":{"v":0,"d":"0%"}},{"$f":"COUNTIF($D188:$AJ188,$AU$3)/$AV$1","v":{"v":0,"d":"0%"}},{"$f":"COUNTIF($D188:$AJ188,$AU$4)/$AV$1","v":{"v":0,"d":"0%"}},{"$f":"COUNTIF(D188:$AJ188,\"NE\")/$AV$1","v":{"v":0,"d":"0%"}},{"$f":"AN188+(AO188*0.66)+(AP188*0.33)","v":{"v":0,"d":"0%"}}]
[null,"EPS","DEVELOPPER SA MOTRICITE, LE LANGAGE DU CORPS ",{"$f":"COUNTA(D190:D192)*10","v":0},{"$f":"COUNTA(E190:E192)*10","v":0},0,0,0,0,0,0,0,0,0,0,0,0,0,0,0,0,0,0,0,0,0,0,0,0,0,0,0,0,0,0,0]
[null,null,"Adapter sa motricité à des situations variées.",{"$nulls":36},{"$f":"COUNTIF($D190:$AJ190,$AU$1)/$AV$1","v":{"v":0,"d":"0%"}},{"$f":"COUNTIF($D190:$AJ190,$AU$2)/$AV$1","v":{"v":0,"d":"0%"}},{"$f":"COUNTIF($D190:$AJ190,$AU$3)/$AV$1","v":{"v":0,"d":"0%"}},{"$f":"COUNTIF($D190:$AJ190,$AU$4)/$AV$1","v":{"v":0,"d":"0%"}},{"$f":"COUNTIF(D190:$AJ190,\"NE\")/$AV$1","v":{"v":0,"d":"0%"}},{"$f":"AN190+(AO190*0.66)+(AP190*0.33)","v":{"v":0,"d":"0%"}}]
[null,null,"Acquérir des techniques spécifiques pour améliorer son efficacité.",{"$nulls":36},{"$f":"COUNTIF($D191:$AJ191,$AU$1)/$AV$1","v":{"v":0,"d":"0%"}},{"$f":"COUNTIF($D191:$AJ191,$AU$2)/$AV$1","v":{"v":0,"d":"0%"}},{"$f":"COUNTIF($D191:$AJ191,$AU$3)/$AV$1","v":{"v":0,"d":"0%"}},{"$f":"COUNTIF($D191:$AJ191,$AU$4)/$AV$1","v":{"v":0,"d":"0%"}},{"$f":"COUNTIF(D191:$AJ191,\"NE\")/$AV$1","v":{"v":0,"d":"0%"}},{"$f":"AN191+(AO191*0.66)+(AP191*0.33)","v":{"v":0,"d":"0%"}}]
[null,null,"Mobiliser différentes ressources (physiologique, biomécanique, psychologique, émotionnelle) pour agir de manière efficiente.",{"$nulls":36},{"$f":"COUNTIF($D192:$AJ192,$AU$1)/$AV$1","v":{"v":0,"d":"0%"}},{"$f":"COUNTIF($D192:$AJ192,$AU$2)/$AV$1","v":{"v":0,"d":"0%"}},{"$f":"COUNTIF($D192:$AJ192,$AU$3)/$AV$1","v":{"v":0,"d":"0%"}},{"$f":"COUNTIF($D192:$AJ192,$AU$4)/$AV$1","v":{"v":0,"d":"0%"}},{"$f":"COUNTIF(D192:$AJ192,\"NE\")/$AV$1","v":{"v":0,"d":"0%"}},{"$f":"AN192+(AO192*0.66)+(AP192*0.33)","v":{"v":0,"d":"0%"}}]
[null,null,"S’APPROPRIER LES MÉTHODES ET OUTILS POUR APPRENDRE",{"$f":"COUNTA(D194:D196)*10","v":0},{"$f":"COUNTA(E194:E196)*10","v":0},0,0,0,0,0,0,0,0,0,0,0,0,0,0,0,0,0,0,0,0,0,0,0,0,0,0,0,0,0,0,0]
[null,null,"Apprendre par l’action, l’observation, l’analyse de son activité et de celle des autres. ",{"$nulls":36},{"$f":"COUNTIF($D194:$AJ194,$AU$1)/$AV$1","v":{"v":0,"d":"0%"}},{"$f":"COUNTIF($D194:$AJ194,$AU$2)/$AV$1","v":{"v":0,"d":"0%"}},{"$f":"COUNTIF($D194:$AJ194,$AU$3)/$AV$1","v":{"v":0,"d":"0%"}},{"$f":"COUNTIF($D194:$AJ194,$AU$4)/$AV$1","v":{"v":0,"d":"0%"}},{"$f":"COUNTIF(D194:$AJ194,\"NE\")/$AV$1","v":{"v":0,"d":"0%"}},{"$f":"AN194+(AO194*0.66)+(AP194*0.33)","v":{"v":0,"d":"0%"}}]
[null,null,"Répéter un geste pour le stabiliser et le rendre plus efficace.",{"$nulls":36},{"$f":"COUNTIF($D195:$AJ195,$AU$1)/$AV$1","v":{"v":0,"d":"0%"}},{"$f":"COUNTIF($D195:$AJ195,$AU$2)/$AV$1","v":{"v":0,"d":"0%"}},{"$f":"COUNTIF($D195:$AJ195,$AU$3)/$AV$1","v":{"v":0,"d":"0%"}},{"$f":"COUNTIF($D195:$AJ195,$AU$4)/$AV$1","v":{"v":0,"d":"0%"}},{"$f":"COUNTIF(D195:$AJ195,\"NE\")/$AV$1","v":{"v":0,"d":"0%"}},{"$f":"AN195+(AO195*0.66)+(AP195*0.33)","v":{"v":0,"d":"0%"}}]
[null,null,"Utiliser des outils numériques pour observer, évaluer et modifier ses actions.",{"$nulls":36},{"$f":"COUNTIF($D196:$AJ196,$AU$1)/$AV$1","v":{"v":0,"d":"0%"}},{"$f":"COUNTIF($D196:$AJ196,$AU$2)/$AV$1","v":{"v":0,"d":"0%"}},{"$f":"COUNTIF($D196:$AJ196,$AU$3)/$AV$1","v":{"v":0,"d":"0%"}},{"$f":"COUNTIF($D196:$AJ196,$AU$4)/$AV$1","v":{"v":0,"d":"0%"}},{"$f":"COUNTIF(D196:$AJ196,\"NE\")/$AV$1","v":{"v":0,"d":"0%"}},{"$f":"AN196+(AO196*0.66)+(AP196*0.33)","v":{"v":0,"d":"0%"}}]
[null,null,"PARTAGER DES RÈGLES, ASSUMER DES RÔLES ",{"$f":"COUNTA(D198:D201)*10","v":0},{"$f":"COUNTA(E198:E201)*10","v":0},0,0,0,0,0,0,0,0,0,0,0,0,0,0,0,0,0,0,0,0,0,0,0,0,0,0,0,0,0,0,0]
[null,null,"Assumer les rôles sociaux  (joueur, arbitre,…).",{"$nulls":36},{"$f":"COUNTIF($D198:$AJ198,$AU$1)/$AV$1","v":{"v":0,"d":"0%"}},{"$f":"COUNTIF($D198:$AJ198,$AU$2)/$AV$1","v":{"v":0,"d":"0%"}},{"$f":"COUNTIF($D198:$AJ198,$AU$3)/$AV$1","v":{"v":0,"d":"0%"}},{"$f":"COUNTIF($D198:$AJ198,$AU$4)/$AV$1","v":{"v":0,"d":"0%"}},{"$f":"COUNTIF(D198:$AJ198,\"NE\")/$AV$1","v":{"v":0,"d":"0%"}},{"$f":"AN198+(AO198*0.66)+(AP198*0.33)","v":{"v":0,"d":"0%"}}]
[null,null,"Comprendre, respecter et faire respecter règles et règlements.",{"$nulls":36},{"$f":"COUNTIF($D199:$AJ199,$AU$1)/$AV$1","v":{"v":0,"d":"0%"}},{"$f":"COUNTIF($D199:$AJ199,$AU$2)/$AV$1","v":{"v":0,"d":"0%"}},{"$f":"COUNTIF($D199:$AJ199,$AU$3)/$AV$1","v":{"v":0,"d":"0%"}},{"$f":"COUNTIF($D199:$AJ199,$AU$4)/$AV$1","v":{"v":0,"d":"0%"}},{"$f":"COUNTIF(D199:$AJ199,\"NE\")/$AV$1","v":{"v":0,"d":"0%"}},{"$f":"AN199+(AO199*0.66)+(AP199*0.33)","v":{"v":0,"d":"0%"}}]
[null,null,"Assurer sa sécurité et celle d’autrui dans des situations variées.",{"$nulls":36},{"$f":"COUNTIF($D200:$AJ200,$AU$1)/$AV$1","v":{"v":0,"d":"0%"}},{"$f":"COUNTIF($D200:$AJ200,$AU$2)/$AV$1","v":{"v":0,"d":"0%"}},{"$f":"COUNTIF($D200:$AJ200,$AU$3)/$AV$1","v":{"v":0,"d":"0%"}},{"$f":"COUNTIF($D200:$AJ200,$AU$4)/$AV$1","v":{"v":0,"d":"0%"}},{"$f":"COUNTIF(D200:$AJ200,\"NE\")/$AV$1","v":{"v":0,"d":"0%"}},{"$f":"AN200+(AO200*0.66)+(AP200*0.33)","v":{"v":0,"d":"0%"}}]
[null,null,"S’engager dans les activités sportives et artistiques collectives.",{"$nulls":36},{"$f":"COUNTIF($D201:$AJ201,$AU$1)/$AV$1","v":{"v":0,"d":"0%"}},{"$f":"COUNTIF($D201:$AJ201,$AU$2)/$AV$1","v":{"v":0,"d":"0%"}},{"$f":"COUNTIF($D201:$AJ201,$AU$3)/$AV$1","v":{"v":0,"d":"0%"}},{"$f":"COUNTIF($D201:$AJ201,$AU$4)/$AV$1","v":{"v":0,"d":"0%"}},{"$f":"COUNTIF(D201:$AJ201,\"NE\")/$AV$1","v":{"v":0,"d":"0%"}},{"$f":"AN201+(AO201*0.66)+(AP201*0.33)","v":{"v":0,"d":"0%"}}]
[null,null,"ENTRETENIR SA SANTÉ ",{"$f":"COUNTA(D203:D205)*10","v":0},{"$f":"COUNTA(E203:E205)*10","v":0},0,0,0,0,0,0,0,0,0,0,0,0,0,0,0,0,0,0,0,0,0,0,0,0,0,0,0,0,0,0,0]
[null,null,"Évaluer la quantité et la qualité de son activité physique quotidienne dans et hors l’école.",{"$nulls":36},{"$f":"COUNTIF($D203:$AJ203,$AU$1)/$AV$1","v":{"v":0,"d":"0%"}},{"$f":"COUNTIF($D203:$AJ203,$AU$2)/$AV$1","v":{"v":0,"d":"0%"}},{"$f":"COUNTIF($D203:$AJ203,$AU$3)/$AV$1","v":{"v":0,"d":"0%"}},{"$f":"COUNTIF($D203:$AJ203,$AU$4)/$AV$1","v":{"v":0,"d":"0%"}},{"$f":"COUNTIF(D203:$AJ203,\"NE\")/$AV$1","v":{"v":0,"d":"0%"}},{"$f":"AN203+(AO203*0.66)+(AP203*0.33)","v":{"v":0,"d":"0%"}}]
[null,null,"Connaitre et appliquer des principes d’une bonne hygiène de vie.",{"$nulls":36},{"$f":"COUNTIF($D204:$AJ204,$AU$1)/$AV$1","v":{"v":0,"d":"0%"}},{"$f":"COUNTIF($D204:$AJ204,$AU$2)/$AV$1","v":{"v":0,"d":"0%"}},{"$f":"COUNTIF($D204:$AJ204,$AU$3)/$AV$1","v":{"v":0,"d":"0%"}},{"$f":"COUNTIF($D204:$AJ204,$AU$4)/$AV$1","v":{"v":0,"d":"0%"}},{"$f":"COUNTIF(D204:$AJ204,\"NE\")/$AV$1","v":{"v":0,"d":"0%"}},{"$f":"AN204+(AO204*0.66)+(AP204*0.33)","v":{"v":0,"d":"0%"}}]
[null,null,"Adapter l’intensité de son engagement physique à ses possibilités pour ne pas se mettre en danger.",{"$nulls":36},{"$f":"COUNTIF($D205:$AJ205,$AU$1)/$AV$1","v":{"v":0,"d":"0%"}},{"$f":"COUNTIF($D205:$AJ205,$AU$2)/$AV$1","v":{"v":0,"d":"0%"}},{"$f":"COUNTIF($D205:$AJ205,$AU$3)/$AV$1","v":{"v":0,"d":"0%"}},{"$f":"COUNTIF($D205:$AJ205,$AU$4)/$AV$1","v":{"v":0,"d":"0%"}},{"$f":"COUNTIF(D205:$AJ205,\"NE\")/$AV$1","v":{"v":0,"d":"0%"}},{"$f":"AN205+(AO205*0.66)+(AP205*0.33)","v":{"v":0,"d":"0%"}}]
[null,null,"S’APPROPRIER UNE CULTURE PHYSIQUE SPORTIVE ET ARTISTIQUE ",{"$f":"COUNTA(D207:D208)*10","v":0},{"$f":"COUNTA(E207:E208)*10","v":0},0,0,0,0,0,0,0,0,0,0,0,0,0,0,0,0,0,0,0,0,0,0,0,0,0,0,0,0,0,0,0]
[null,null,"Savoir situer des performances à l’échelle de la performance humaine.",{"$nulls":36},{"$f":"COUNTIF($D207:$AJ207,$AU$1)/$AV$1","v":{"v":0,"d":"0%"}},{"$f":"COUNTIF($D207:$AJ207,$AU$2)/$AV$1","v":{"v":0,"d":"0%"}},{"$f":"COUNTIF($D207:$AJ207,$AU$3)/$AV$1","v":{"v":0,"d":"0%"}},{"$f":"COUNTIF($D207:$AJ207,$AU$4)/$AV$1","v":{"v":0,"d":"0%"}},{"$f":"COUNTIF(D207:$AJ207,\"NE\")/$AV$1","v":{"v":0,"d":"0%"}},{"$f":"AN207+(AO207*0.66)+(AP207*0.33)","v":{"v":0,"d":"0%"}}]
[null,null,"Comprendre et respecter l’environnement des pratiques physiques et sportives.",{"$nulls":36},{"$f":"COUNTIF($D208:$AJ208,$AU$1)/$AV$1","v":{"v":0,"d":"0%"}},{"$f":"COUNTIF($D208:$AJ208,$AU$2)/$AV$1","v":{"v":0,"d":"0%"}},{"$f":"COUNTIF($D208:$AJ208,$AU$3)/$AV$1","v":{"v":0,"d":"0%"}},{"$f":"COUNTIF($D208:$AJ208,$AU$4)/$AV$1","v":{"v":0,"d":"0%"}},{"$f":"COUNTIF(D208:$AJ208,\"NE\")/$AV$1","v":{"v":0,"d":"0%"}},{"$f":"AN208+(AO208*0.66)+(AP208*0.33)","v":{"v":0,"d":"0%"}}]
[null,"EMC","ENSEIGNEMENT CIVIQUE ET MORAL",{"$f":"COUNTA(D210:D215)*10","v":0},{"$f":"COUNTA(E210:E215)*10","v":0},0,0,0,0,0,0,0,0,0,0,0,0,0,0,0,0,0,0,0,0,0,0,0,0,0,0,0,0,0,0,0]
[null,null," Identifier et partager des émotions, des sentiments dans des situations et à propos d'objets diversifiés.",{"$nulls":36},{"$f":"COUNTIF($D210:$AJ210,$AU$1)/$AV$1","v":{"v":0,"d":"0%"}},{"$f":"COUNTIF($D210:$AJ210,$AU$2)/$AV$1","v":{"v":0,"d":"0%"}},{"$f":"COUNTIF($D210:$AJ210,$AU$3)/$AV$1","v":{"v":0,"d":"0%"}},{"$f":"COUNTIF($D210:$AJ210,$AU$4)/$AV$1","v":{"v":0,"d":"0%"}},{"$f":"COUNTIF(D210:$AJ210,\"NE\")/$AV$1","v":{"v":0,"d":"0%"}},{"$f":"AN210+(AO210*0.66)+(AP210*0.33)","v":{"v":0,"d":"0%"}}]
[null,null,"Se situer et s'exprimer en respectant les codes de la communication orale, les règles de l'échange et le statut de l'interlocuteur.",{"$nulls":36},{"v":0,"d":"0%"},{"v":0,"d":"0%"},{"v":0,"d":"0%"},{"v":0,"d":"0%"},{"$f":"COUNTIF(D211:$AJ211,\"NE\")/$AV$1","v":{"v":0,"d":"0%"}},{"v":0,"d":"0%"}]
[null,null,"Prendre soin de soi et des autres.",{"$nulls":36},{"v":0,"d":"0%"},{"v":0,"d":"0%"},{"v":0,"d":"0%"},{"v":0,"d":"0%"},{"$f":"COUNTIF(D212:$AJ212,\"NE\")/$AV$1","v":{"v":0,"d":"0%"}},{"v":0,"d":"0%"}]
[null,null,"Accepter les différences. ",{"$nulls":36},{"v":0,"d":"0%"},{"v":0,"d":"0%"},{"v":0,"d":"0%"},{"v":0,"d":"0%"},{"$f":"COUNTIF(D213:$AJ213,\"NE\")/$AV$1","v":{"v":0,"d":"0%"}},{"v":0,"d":"0%"}]
[null,null,"Identifier les symboles de la République présents dans l'école. ",{"$nulls":36},{"v":0,"d":"0%"},{"v":0,"d":"0%"},{"v":0,"d":"0%"},{"v":0,"d":"0%"},{"$f":"COUNTIF(D214:$AJ214,\"NE\")/$AV$1","v":{"v":0,"d":"0%"}},{"v":0,"d":"0%"}]
[null,null,"Apprendre à coopérer. ",{"$nulls":36},{"v":0,"d":"0%"},{"v":0,"d":"0%"},{"v":0,"d":"0%"},{"v":0,"d":"0%"},{"$f":"COUNTIF(D215:$AJ215,\"NE\")/$AV$1","v":{"v":0,"d":"0%"}},{"v":0,"d":"0%"}]

{"sheet":"Formules","index":5,"n_rows":806,"n_cols":37,"rows_kept":806,"hidden":true}
["notes"]
["appreciations",null,{"$f":"IF(INDEX(appreciations1,Nenfant,1)=\"\",0,INDEX(appreciations1,Nenfant,1))","v":{"$error":"#NAME?"}},{"$f":"IF(INDEX(appreciations2,Nenfant,1)=\"\",0,INDEX(appreciations2,Nenfant,1))","v":{"$error":"#NAME?"}},{"$f":"IF(INDEX(appreciations3,Nenfant,1)=\"\",0,INDEX(appreciations3,Nenfant,1))","v":{"$error":"#NAME?"}},{"$f":"IF(INDEX(appreciations4,Nenfant,1)=\"\",0,INDEX(appreciations4,Nenfant,1))","v":{"$error":"#NAME?"}},{"$f":"IF(INDEX(appreciations5,Nenfant,1)=\"\",0,INDEX(appreciations5,Nenfant,1))","v":{"$error":"#NAME?"}}]
["absences",null,{"$f":"IF(INDEX(absences1,Nenfant,1)=\"\",0,INDEX(absences1,Nenfant,1))","v":{"$error":"#NAME?"}},{"$f":"IF(INDEX(absences2,Nenfant,1)=\"\",0,INDEX(absences2,Nenfant,1))","v":{"$error":"#NAME?"}},{"$f":"IF(INDEX(absences3,Nenfant,1)=\"\",0,INDEX(absences3,Nenfant,1))","v":{"$error":"#NAME?"}},{"$f":"IF(INDEX(absences4,Nenfant,1)=\"\",0,INDEX(absences4,Nenfant,1))","v":{"$error":"#NAME?"}},{"$f":"IF(INDEX(absences5,Nenfant,1)=\"\",0,INDEX(absences5,Nenfant,1))","v":{"$error":"#NAME?"}}]
[]
[5,null,"A",1,"A",{"$f":"Renseignements!I20","v":0}]
[6,null,"B",2,"AR",{"$f":"Renseignements!J20","v":0}]
[7,null,"C",3,"ECA",{"$f":"Renseignements!K20","v":0}]
[8,null,"D",4,"NA",{"$f":"Renseignements!L20","v":0}]
[9,null,"NE","NE","NE",{"$f":"Renseignements!M20","v":0}]
[10]
[11]
[12]
[13]
[14,{"$nulls":3},{"$f":"IF(G14<>0,G14,(IF(F14<>0,F14,0)))","v":0},{"$nulls":3},{"$f":"COUNTIF($G15:G18,\"X\")","v":0},{"$f":"COUNTIF($H15:$H18,\"X\")","v":0},{"$f":"COUNTIF($I15:$I18,\"X\")","v":0},{"$f":"COUNTIF($J15:$J18,\"X\")","v":0},null,{"$f":"COUNTIF($G15:L18,\"X\")","v":0},{"$f":"COUNTIF($H15:$H18,\"X\")","v":0},{"$f":"COUNTIF($I15:$I18,\"X\")","v":0},{"$f":"COUNTIF($J15:$J18,\"X\")","v":0},null,{"$f":"COUNTIF($G15:Q18,\"X\")","v":0},{"$f":"COUNTIF($H15:$H18,\"X\")","v":0},{"$f":"COUNTIF($I15:$I18,\"X\")","v":0},{"$f":"COUNTIF($J15:$J18,\"X\")","v":0},null,{"$f":"COUNTIF($G15:V18,\"X\")","v":0},{"$f":"COUNTIF($H15:$H18,\"X\")","v":0},{"$f":"COUNTIF($I15:$I18,\"X\")","v":0},{"$f":"COUNTIF(AA15:AA18,\"X\")","v":0},{"$f":"Programmation!M5","v":0},{"$f":"COUNTIF($G15:AA18,\"X\")","v":0},{"$f":"COUNTIF($H15:$H18,\"X\")","v":0},{"$f":"COUNTIF($I15:$I18,\"X\")","v":0},{"$f":"COUNTIF($J15:$J18,\"X\")","v":0},null,{"$f":"COUNTIF($G15:AF18,\"X\")","v":0},{"$f":"COUNTIF($H15:$H18,\"X\")","v":0},{"$f":"COUNTIF($I15:$I18,\"X\")","v":0},{"$f":"COUNTIF($J15:$J18,\"X\")","v":0}]
[15,{"$nulls":7},{"$f":"IF(INDEX(periode1,NEVAL,Nenfant)=\"D\",\"X\",\"\")","v":{"$error":"#NAME?"}},{"$f":"IF(INDEX(periode1,NEVAL,Nenfant)=\"C\",\"X\",\"\")","v":{"$error":"#NAME?"}},{"$f":"IF(INDEX(periode1,NEVAL,Nenfant)=\"B\",\"X\",\"\")","v":{"$error":"#NAME?"}},{"$f":"IF(INDEX(periode1,NEVAL,Nenfant)=\"A\",\"X\",\"\")","v":{"$error":"#NAME?"}},null,{"$f":"IF(INDEX(periode2,NEVAL,Nenfant)=\"D\",\"X\",\"\")","v":{"$error":"#NAME?"}},{"$f":"IF(INDEX(periode2,NEVAL,Nenfant)=\"C\",\"X\",\"\")","v":{"$error":"#NAME?"}},{"$f":"IF(INDEX(periode2,NEVAL,Nenfant)=\"B\",\"X\",\"\")","v":{"$error":"#NAME?"}},{"$f":"IF(INDEX(periode2,NEVAL,Nenfant)=\"A\",\"X\",\"\")","v":{"$error":"#NAME?"}},null,{"$f":"IF(INDEX(periode3,NEVAL,Nenfant)=\"D\",\"X\",\"\")","v":{"$error":"#NAME?"}},{"$f":"IF(INDEX(periode3,NEVAL,Nenfant)=\"C\",\"X\",\"\")","v":{"$error":"#NAME?"}},{"$f":"IF(INDEX(periode3,NEVAL,Nenfant)=\"B\",\"X\",\"\")","v":{"$error":"#NAME?"}},{"$f":"IF(INDEX(periode3,NEVAL,Nenfant)=\"A\",\"X\",\"\")","v":{"$error":"#NAME?"}},null,{"$f":"IF(INDEX(periode4,NEVAL,Nenfant)=\"D\",\"X\",\"\")","v":{"$error":"#NAME?"}},{"$f":"IF(INDEX(periode4,NEVAL,Nenfant)=\"C\",\"X\",\"\")","v":{"$error":"#NAME?"}},{"$f":"IF(INDEX(periode4,NEVAL,Nenfant)=\"B\",\"X\",\"\")","v":{"$error":"#NAME?"}},{"$f":"IF(INDEX(periode4,NEVAL,Nenfant)=\"A\",\"X\",\"\")","v":{"$error":"#NAME?"}},null,{"$f":"IF(INDEX(periode5,NEVAL,Nenfant)=\"D\",\"X\",\"\")","v":{"$error":"#NAME?"}},{"$f":"IF(INDEX(periode5,NEVAL,Nenfant)=\"C\",\"X\",\"\")","v":{"$error":"#NAME?"}},{"$f":"IF(INDEX(periode5,NEVAL,Nenfant)=\"B\",\"X\",\"\")","v":{"$error":"#NAME?"}},{"$f":"IF(INDEX(periode5,NEVAL,Nenfant)=\"A\",\"X\",\"\")","v":{"$error":"#NAME?"}},null,{"$f":"IF(INDEX(periode6,NEVAL,Nenfant)=\"D\",\"X\",\"\")","v":{"$error":"#NAME?"}},{"$f":"IF(INDEX(periode6,NEVAL,Nenfant)=\"C\",\"X\",\"\")","v":{"$error":"#NAME?"}},{"$f":"IF(INDEX(periode6,NEVAL,Nenfant)=\"B\",\"X\",\"\")","v":{"$error":"#NAME?"}},{"$f":"IF(INDEX(periode6,NEVAL,Nenfant)=\"A\",\"X\",\"\")","v":{"$error":"#NAME?"}}]
[16,{"$nulls":7},{"$f":"IF(INDEX(periode1,NEVAL,Nenfant)=\"D\",\"X\",\"\")","v":{"$error":"#NAME?"}},{"$f":"IF(INDEX(periode1,NEVAL,Nenfant)=\"C\",\"X\",\"\")","v":{"$error":"#NAME?"}},{"$f":"IF(INDEX(periode1,NEVAL,Nenfant)=\"B\",\"X\",\"\")","v":{"$error":"#NAME?"}},{"$f":"IF(INDEX(periode1,NEVAL,Nenfant)=\"A\",\"X\",\"\")","v":{"$error":"#NAME?"}},null,{"$f":"IF(INDEX(periode2,NEVAL,Nenfant)=\"D\",\"X\",\"\")","v":{"$error":"#NAME?"}},{"$f":"IF(INDEX(periode2,NEVAL,Nenfant)=\"C\",\"X\",\"\")","v":{"$error":"#NAME?"}},{"$f":"IF(INDEX(periode2,NEVAL,Nenfant)=\"B\",\"X\",\"\")","v":{"$error":"#NAME?"}},{"$f":"IF(INDEX(periode2,NEVAL,Nenfant)=\"A\",\"X\",\"\")","v":{"$error":"#NAME?"}},null,{"$f":"IF(INDEX(periode3,NEVAL,Nenfant)=\"D\",\"X\",\"\")","v":{"$error":"#NAME?"}},{"$f":"IF(INDEX(periode3,NEVAL,Nenfant)=\"C\",\"X\",\"\")","v":{"$error":"#NAME?"}},{"$f":"IF(INDEX(periode3,NEVAL,Nenfant)=\"B\",\"X\",\"\")","v":{"$error":"#NAME?"}},{"$f":"IF(INDEX(periode3,NEVAL,Nenfant)=\"A\",\"X\",\"\")","v":{"$error":"#NAME?"}},null,{"$f":"IF(INDEX(periode4,NEVAL,Nenfant)=\"D\",\"X\",\"\")","v":{"$error":"#NAME?"}},{"$f":"IF(INDEX(periode4,NEVAL,Nenfant)=\"C\",\"X\",\"\")","v":{"$error":"#NAME?"}},{"$f":"IF(INDEX(periode4,NEVAL,Nenfant)=\"B\",\"X\",\"\")","v":{"$error":"#NAME?"}},{"$f":"IF(INDEX(periode4,NEVAL,Nenfant)=\"A\",\"X\",\"\")","v":{"$error":"#NAME?"}},null,{"$f":"IF(INDEX(periode5,NEVAL,Nenfant)=\"D\",\"X\",\"\")","v":{"$error":"#NAME?"}},{"$f":"IF(INDEX(periode5,NEVAL,Nenfant)=\"C\",\"X\",\"\")","v":{"$error":"#NAME?"}},{"$f":"IF(INDEX(periode5,NEVAL,Nenfant)=\"B\",\"X\",\"\")","v":{"$error":"#NAME?"}},{"$f":"IF(INDEX(periode5,NEVAL,Nenfant)=\"A\",\"X\",\"\")","v":{"$error":"#NAME?"}},null,{"$f":"IF(INDEX(periode6,NEVAL,Nenfant)=\"D\",\"X\",\"\")","v":{"$error":"#NAME?"}},{"$f":"IF(INDEX(periode6,NEVAL,Nenfant)=\"C\",\"X\",\"\")","v":{"$error":"#NAME?"}},{"$f":"IF(INDEX(periode6,NEVAL,Nenfant)=\"B\",\"X\",\"\")","v":{"$error":"#NAME?"}},{"$f":"IF(INDEX(periode6,NEVAL,Nenfant)=\"A\",\"X\",\"\")","v":{"$error":"#NAME?"}}]
[17,{"$nulls":7},{"$f":"IF(INDEX(periode1,NEVAL,Nenfant)=\"D\",\"X\",\"\")","v":{"$error":"#NAME?"}},{"$f":"IF(INDEX(periode1,NEVAL,Nenfant)=\"C\",\"X\",\"\")","v":{"$error":"#NAME?"}},{"$f":"IF(INDEX(periode1,NEVAL,Nenfant)=\"B\",\"X\",\"\")","v":{"$error":"#NAME?"}},{"$f":"IF(INDEX(periode1,NEVAL,Nenfant)=\"A\",\"X\",\"\")","v":{"$error":"#NAME?"}},null,{"$f":"IF(INDEX(periode2,NEVAL,Nenfant)=\"D\",\"X\",\"\")","v":{"$error":"#NAME?"}},{"$f":"IF(INDEX(periode2,NEVAL,Nenfant)=\"C\",\"X\",\"\")","v":{"$error":"#NAME?"}},{"$f":"IF(INDEX(periode2,NEVAL,Nenfant)=\"B\",\"X\",\"\")","v":{"$error":"#NAME?"}},{"$f":"IF(INDEX(periode2,NEVAL,Nenfant)=\"A\",\"X\",\"\")","v":{"$error":"#NAME?"}},null,{"$f":"IF(INDEX(periode3,NEVAL,Nenfant)=\"D\",\"X\",\"\")","v":{"$error":"#NAME?"}},{"$f":"IF(INDEX(periode3,NEVAL,Nenfant)=\"C\",\"X\",\"\")","v":{"$error":"#NAME?"}},{"$f":"IF(INDEX(periode3,NEVAL,Nenfant)=\"B\",\"X\",\"\")","v":{"$error":"#NAME?"}},{"$f":"IF(INDEX(periode3,NEVAL,Nenfant)=\"A\",\"X\",\"\")","v":{"$error":"#NAME?"}},null,{"$f":"IF(INDEX(periode4,NEVAL,Nenfant)=\"D\",\"X\",\"\")","v":{"$error":"#NAME?"}},{"$f":"IF(INDEX(periode4,NEVAL,Nenfant)=\"C\",\"X\",\"\")","v":{"$error":"#NAME?"}},{"$f":"IF(INDEX(periode4,NEVAL,Nenfant)=\"B\",\"X\",\"\")","v":{"$error":"#NAME?"}},{"$f":"IF(INDEX(periode4,NEVAL,Nenfant)=\"A\",\"X\",\"\")","v":{"$error":"#NAME?"}},null,{"$f":"IF(INDEX(periode5,NEVAL,Nenfant)=\"D\",\"X\",\"\")","v":{"$error":"#NAME?"}},{"$f":"IF(INDEX(periode5,NEVAL,Nenfant)=\"C\",\"X\",\"\")","v":{"$error":"#NAME?"}},{"$f":"IF(INDEX(periode5,NEVAL,Nenfant)=\"B\",\"X\",\"\")","v":{"$error":"#NAME?"}},{"$f":"IF(INDEX(periode5,NEVAL,Nenfant)=\"A\",\"X\",\"\")","v":{"$error":"#NAME?"}},null,{"$f":"IF(INDEX(periode6,NEVAL,Nenfant)=\"D\",\"X\",\"\")","v":{"$error":"#NAME?"}},{"$f":"IF(INDEX(periode6,NEVAL,Nenfant)=\"C\",\"X\",\"\")","v":{"$error":"#NAME?"}},{"$f":"IF(INDEX(periode6,NEVAL,Nenfant)=\"B\",\"X\",\"\")","v":{"$error":"#NAME?"}},{"$f":"IF(INDEX(periode6,NEVAL,Nenfant)=\"A\",\"X\",\"\")","v":{"$error":"#NAME?"}}]
[18,{"$nulls":7},{"$f":"IF(INDEX(periode1,NEVAL,Nenfant)=\"D\",\"X\",\"\")","v":{"$error":"#NAME?"}},{"$f":"IF(INDEX(periode1,NEVAL,Nenfant)=\"C\",\"X\",\"\")","v":{"$error":"#NAME?"}},{"$f":"IF(INDEX(periode1,NEVAL,Nenfant)=\"B\",\"X\",\"\")","v":{"$error":"#NAME?"}},{"$f":"IF(INDEX(periode1,NEVAL,Nenfant)=\"A\",\"X\",\"\")","v":{"$error":"#NAME?"}},null,{"$f":"IF(INDEX(periode2,NEVAL,Nenfant)=\"D\",\"X\",\"\")","v":{"$error":"#NAME?"}},{"$f":"IF(INDEX(periode2,NEVAL,Nenfant)=\"C\",\"X\",\"\")","v":{"$error":"#NAME?"}},{"$f":"IF(INDEX(periode2,NEVAL,Nenfant)=\"B\",\"X\",\"\")","v":{"$error":"#NAME?"}},{"$f":"IF(INDEX(periode2,NEVAL,Nenfant)=\"A\",\"X\",\"\")","v":{"$error":"#NAME?"}},null,{"$f":"IF(INDEX(periode3,NEVAL,Nenfant)=\"D\",\"X\",\"\")","v":{"$error":"#NAME?"}},{"$f":"IF(INDEX(periode3,NEVAL,Nenfant)=\"C\",\"X\",\"\")","v":{"$error":"#NAME?"}},{"$f":"IF(INDEX(periode3,NEVAL,Nenfant)=\"B\",\"X\",\"\")","v":{"$error":"#NAME?"}},{"$f":"IF(INDEX(periode3,NEVAL,Nenfant)=\"A\",\"X\",\"\")","v":{"$error":"#NAME?"}},null,{"$f":"IF(INDEX(periode4,NEVAL,Nenfant)=\"D\",\"X\",\"\")","v":{"$error":"#NAME?"}},{"$f":"IF(INDEX(periode4,NEVAL,Nenfant)=\"C\",\"X\",\"\")","v":{"$error":"#NAME?"}},{"$f":"IF(INDEX(periode4,NEVAL,Nenfant)=\"B\",\"X\",\"\")","v":{"$error":"#NAME?"}},{"$f":"IF(INDEX(periode4,NEVAL,Nenfant)=\"A\",\"X\",\"\")","v":{"$error":"#NAME?"}},null,{"$f":"IF(INDEX(periode5,NEVAL,Nenfant)=\"D\",\"X\",\"\")","v":{"$error":"#NAME?"}},{"$f":"IF(INDEX(periode5,NEVAL,Nenfant)=\"C\",\"X\",\"\")","v":{"$error":"#NAME?"}},{"$f":"IF(INDEX(periode5,NEVAL,Nenfant)=\"B\",\"X\",\"\")","v":{"$error":"#NAME?"}},{"$f":"IF(INDEX(periode5,NEVAL,Nenfant)=\"A\",\"X\",\"\")","v":{"$error":"#NAME?"}},null,{"$f":"IF(INDEX(periode6,NEVAL,Nenfant)=\"D\",\"X\",\"\")","v":{"$error":"#NAME?"}},{"$f":"IF(INDEX(periode6,NEVAL,Nenfant)=\"C\",\"X\",\"\")","v":{"$error":"#NAME?"}},{"$f":"IF(INDEX(periode6,NEVAL,Nenfant)=\"B\",\"X\",\"\")","v":{"$error":"#NAME?"}},{"$f":"IF(INDEX(periode6,NEVAL,Nenfant)=\"A\",\"X\",\"\")","v":{"$error":"#NAME?"}}]
[19,{"$nulls":7},{"$f":"COUNTIF($G20:$G24,\"X\")","v":0},{"$f":"COUNTIF($H20:$H24,\"X\")","v":0},{"$f":"COUNTIF($I20:$I23,\"X\")","v":0},{"$f":"COUNTIF($J20:$J23,\"X\")","v":0},null,{"$f":"COUNTIF($G20:$G24,\"X\")","v":0},{"$f":"COUNTIF($H20:$H24,\"X\")","v":0},{"$f":"COUNTIF($I20:$I23,\"X\")","v":0},{"$f":"COUNTIF($J20:$J23,\"X\")","v":0},null,{"$f":"COUNTIF($G20:$G24,\"X\")","v":0},{"$f":"COUNTIF($H20:$H24,\"X\")","v":0},{"$f":"COUNTIF($I20:$I23,\"X\")","v":0},{"$f":"COUNTIF($J20:$J23,\"X\")","v":0},null,{"$f":"COUNTIF($G20:$G24,\"X\")","v":0},{"$f":"COUNTIF($H20:$H24,\"X\")","v":0},{"$f":"COUNTIF($I20:$I23,\"X\")","v":0},{"$f":"COUNTIF(AA20:AA23,\"X\")","v":0},null,{"$f":"COUNTIF($G20:$G24,\"X\")","v":0},{"$f":"COUNTIF($H20:$H24,\"X\")","v":0},{"$f":"COUNTIF($I20:$I23,\"X\")","v":0},{"$f":"COUNTIF($J20:$J23,\"X\")","v":0},null,{"$f":"COUNTIF($G20:$G24,\"X\")","v":0},{"$f":"COUNTIF($H20:$H24,\"X\")","v":0},{"$f":"COUNTIF($I20:$I23,\"X\")","v":0},{"$f":"COUNTIF($J20:$J23,\"X\")","v":0}]
[20,{"$nulls":7},{"$f":"IF(INDEX(periode1,NEVAL,Nenfant)=\"D\",\"X\",\"\")","v":{"$error":"#NAME?"}},{"$f":"IF(INDEX(periode1,NEVAL,Nenfant)=\"C\",\"X\",\"\")","v":{"$error":"#NAME?"}},{"$f":"IF(INDEX(periode1,NEVAL,Nenfant)=\"B\",\"X\",\"\")","v":{"$error":"#NAME?"}},{"$f":"IF(INDEX(periode1,NEVAL,Nenfant)=\"A\",\"X\",\"\")","v":{"$error":"#NAME?"}},null,{"$f":"IF(INDEX(periode2,NEVAL,Nenfant)=\"D\",\"X\",\"\")","v":{"$error":"#NAME?"}},{"$f":"IF(INDEX(periode2,NEVAL,Nenfant)=\"C\",\"X\",\"\")","v":{"$error":"#NAME?"}},{"$f":"IF(INDEX(periode2,NEVAL,Nenfant)=\"B\",\"X\",\"\")","v":{"$error":"#NAME?"}},{"$f":"IF(INDEX(periode2,NEVAL,Nenfant)=\"A\",\"X\",\"\")","v":{"$error":"#NAME?"}},null,{"$f":"IF(INDEX(periode3,NEVAL,Nenfant)=\"D\",\"X\",\"\")","v":{"$error":"#NAME?"}},{"$f":"IF(INDEX(periode3,NEVAL,Nenfant)=\"C\",\"X\",\"\")","v":{"$error":"#NAME?"}},{"$f":"IF(INDEX(periode3,NEVAL,Nenfant)=\"B\",\"X\",\"\")","v":{"$error":"#NAME?"}},{"$f":"IF(INDEX(periode3,NEVAL,Nenfant)=\"A\",\"X\",\"\")","v":{"$error":"#NAME?"}},null,{"$f":"IF(INDEX(periode4,NEVAL,Nenfant)=\"D\",\"X\",\"\")","v":{"$error":"#NAME?"}},{"$f":"IF(INDEX(periode4,NEVAL,Nenfant)=\"C\",\"X\",\"\")","v":{"$error":"#NAME?"}},{"$f":"IF(INDEX(periode4,NEVAL,Nenfant)=\"B\",\"X\",\"\")","v":{"$error":"#NAME?"}},{"$f":"IF(INDEX(periode4,NEVAL,Nenfant)=\"A\",\"X\",\"\")","v":{"$error":"#NAME?"}},null,{"$f":"IF(INDEX(periode5,NEVAL,Nenfant)=\"D\",\"X\",\"\")","v":{"$error":"#NAME?"}},{"$f":"IF(INDEX(periode5,NEVAL,Nenfant)=\"C\",\"X\",\"\")","v":{"$error":"#NAME?"}},{"$f":"IF(INDEX(periode5,NEVAL,Nenfant)=\"B\",\"X\",\"\")","v":{"$error":"#NAME?"}},{"$f":"IF(INDEX(periode5,NEVAL,Nenfant)=\"A\",\"X\",\"\")","v":{"$error":"#NAME?"}},null,{"$f":"IF(INDEX(periode6,NEVAL,Nenfant)=\"D\",\"X\",\"\")","v":{"$error":"#NAME?"}},{"$f":"IF(INDEX(periode6,NEVAL,Nenfant)=\"C\",\"X\",\"\")","v":{"$error":"#NAME?"}},{"$f":"IF(INDEX(periode6,NEVAL,Nenfant)=\"B\",\"X\",\"\")","v":{"$error":"#NAME?"}},{"$f":"IF(INDEX(periode6,NEVAL,Nenfant)=\"A\",\"X\",\"\")","v":{"$error":"#NAME?"}}]
[21,{"$nulls":7},{"$f":"IF(INDEX(periode1,NEVAL,Nenfant)=\"D\",\"X\",\"\")","v":{"$error":"#NAME?"}},{"$f":"IF(INDEX(periode1,NEVAL,Nenfant)=\"C\",\"X\",\"\")","v":{"$error":"#NAME?"}},{"$f":"IF(INDEX(periode1,NEVAL,Nenfant)=\"B\",\"X\",\"\")","v":{"$error":"#NAME?"}},{"$f":"IF(INDEX(periode1,NEVAL,Nenfant)=\"A\",\"X\",\"\")","v":{"$error":"#NAME?"}},null,{"$f":"IF(INDEX(periode2,NEVAL,Nenfant)=\"D\",\"X\",\"\")","v":{"$error":"#NAME?"}},{"$f":"IF(INDEX(periode2,NEVAL,Nenfant)=\"C\",\"X\",\"\")","v":{"$error":"#NAME?"}},{"$f":"IF(INDEX(periode2,NEVAL,Nenfant)=\"B\",\"X\",\"\")","v":{"$error":"#NAME?"}},{"$f":"IF(INDEX(periode2,NEVAL,Nenfant)=\"A\",\"X\",\"\")","v":{"$error":"#NAME?"}},null,{"$f":"IF(INDEX(periode3,NEVAL,Nenfant)=\"D\",\"X\",\"\")","v":{"$error":"#NAME?"}},{"$f":"IF(INDEX(periode3,NEVAL,Nenfant)=\"C\",\"X\",\"\")","v":{"$error":"#NAME?"}},{"$f":"IF(INDEX(periode3,NEVAL,Nenfant)=\"B\",\"X\",\"\")","v":{"$error":"#NAME?"}},{"$f":"IF(INDEX(periode3,NEVAL,Nenfant)=\"A\",\"X\",\"\")","v":{"$error":"#NAME?"}},null,{"$f":"IF(INDEX(periode4,NEVAL,Nenfant)=\"D\",\"X\",\"\")","v":{"$error":"#NAME?"}},{"$f":"IF(INDEX(periode4,NEVAL,Nenfant)=\"C\",\"X\",\"\")","v":{"$error":"#NAME?"}},{"$f":"IF(INDEX(periode4,NEVAL,Nenfant)=\"B\",\"X\",\"\")","v":{"$error":"#NAME?"}},{"$f":"IF(INDEX(periode4,NEVAL,Nenfant)=\"A\",\"X\",\"\")","v":{"$error":"#NAME?"}},null,{"$f":"IF(INDEX(periode5,NEVAL,Nenfant)=\"D\",\"X\",\"\")","v":{"$error":"#NAME?"}},{"$f":"IF(INDEX(periode5,NEVAL,Nenfant)=\"C\",\"X\",\"\")","v":{"$error":"#NAME?"}},{"$f":"IF(INDEX(periode5,NEVAL,Nenfant)=\"B\",\"X\",\"\")","v":{"$error":"#NAME?"}},{"$f":"IF(INDEX(periode5,NEVAL,Nenfant)=\"A\",\"X\",\"\")","v":{"$error":"#NAME?"}},null,{"$f":"IF(INDEX(periode6,NEVAL,Nenfant)=\"D\",\"X\",\"\")","v":{"$error":"#NAME?"}},{"$f":"IF(INDEX(periode6,NEVAL,Nenfant)=\"C\",\"X\",\"\")","v":{"$error":"#NAME?"}},{"$f":"IF(INDEX(periode6,NEVAL,Nenfant)=\"B\",\"X\",\"\")","v":{"$error":"#NAME?"}},{"$f":"IF(INDEX(periode6,NEVAL,Nenfant)=\"A\",\"X\",\"\")","v":{"$error":"#NAME?"}}]
[22,{"$nulls":7},{"$f":"IF(INDEX(periode1,NEVAL,Nenfant)=\"D\",\"X\",\"\")","v":{"$error":"#NAME?"}},{"$f":"IF(INDEX(periode1,NEVAL,Nenfant)=\"C\",\"X\",\"\")","v":{"$error":"#NAME?"}},{"$f":"IF(INDEX(periode1,NEVAL,Nenfant)=\"B\",\"X\",\"\")","v":{"$error":"#NAME?"}},{"$f":"IF(INDEX(periode1,NEVAL,Nenfant)=\"A\",\"X\",\"\")","v":{"$error":"#NAME?"}},null,{"$f":"IF(INDEX(periode2,NEVAL,Nenfant)=\"D\",\"X\",\"\")","v":{"$error":"#NAME?"}},{"$f":"IF(INDEX(periode2,NEVAL,Nenfant)=\"C\",\"X\",\"\")","v":{"$error":"#NAME?"}},{"$f":"IF(INDEX(periode2,NEVAL,Nenfant)=\"B\",\"X\",\"\")","v":{"$error":"#NAME?"}},{"$f":"IF(INDEX(periode2,NEVAL,Nenfant)=\"A\",\"X\",\"\")","v":{"$error":"#NAME?"}},null,{"$f":"IF(INDEX(periode3,NEVAL,Nenfant)=\"D\",\"X\",\"\")","v":{"$error":"#NAME?"}},{"$f":"IF(INDEX(periode3,NEVAL,Nenfant)=\"C\",\"X\",\"\")","v":{"$error":"#NAME?"}},{"$f":"IF(INDEX(periode3,NEVAL,Nenfant)=\"B\",\"X\",\"\")","v":{"$error":"#NAME?"}},{"$f":"IF(INDEX(periode3,NEVAL,Nenfant)=\"A\",\"X\",\"\")","v":{"$error":"#NAME?"}},null,{"$f":"IF(INDEX(periode4,NEVAL,Nenfant)=\"D\",\"X\",\"\")","v":{"$error":"#NAME?"}},{"$f":"IF(INDEX(periode4,NEVAL,Nenfant)=\"C\",\"X\",\"\")","v":{"$error":"#NAME?"}},{"$f":"IF(INDEX(periode4,NEVAL,Nenfant)=\"B\",\"X\",\"\")","v":{"$error":"#NAME?"}},{"$f":"IF(INDEX(periode4,NEVAL,Nenfant)=\"A\",\"X\",\"\")","v":{"$error":"#NAME?"}},null,{"$f":"IF(INDEX(periode5,NEVAL,Nenfant)=\"D\",\"X\",\"\")","v":{"$error":"#NAME?"}},{"$f":"IF(INDEX(periode5,NEVAL,Nenfant)=\"C\",\"X\",\"\")","v":{"$error":"#NAME?"}},{"$f":"IF(INDEX(periode5,NEVAL,Nenfant)=\"B\",\"X\",\"\")","v":{"$error":"#NAME?"}},{"$f":"IF(INDEX(periode5,NEVAL,Nenfant)=\"A\",\"X\",\"\")","v":{"$error":"#NAME?"}},null,{"$f":"IF(INDEX(periode6,NEVAL,Nenfant)=\"D\",\"X\",\"\")","v":{"$error":"#NAME?"}},{"$f":"IF(INDEX(periode6,NEVAL,Nenfant)=\"C\",\"X\",\"\")","v":{"$error":"#NAME?"}},{"$f":"IF(INDEX(periode6,NEVAL,Nenfant)=\"B\",\"X\",\"\")","v":{"$error":"#NAME?"}},{"$f":"IF(INDEX(periode6,NEVAL,Nenfant)=\"A\",\"X\",\"\")","v":{"$error":"#NAME?"}}]
[23,{"$nulls":7},{"$f":"IF(INDEX(periode1,NEVAL,Nenfant)=\"D\",\"X\",\"\")","v":{"$error":"#NAME?"}},{"$f":"IF(INDEX(periode1,NEVAL,Nenfant)=\"C\",\"X\",\"\")","v":{"$error":"#NAME?"}},{"$f":"IF(INDEX(periode1,NEVAL,Nenfant)=\"B\",\"X\",\"\")","v":{"$error":"#NAME?"}},{"$f":"IF(INDEX(periode1,NEVAL,Nenfant)=\"A\",\"X\",\"\")","v":{"$error":"#NAME?"}},null,{"$f":"IF(INDEX(periode2,NEVAL,Nenfant)=\"D\",\"X\",\"\")","v":{"$error":"#NAME?"}},{"$f":"IF(INDEX(periode2,NEVAL,Nenfant)=\"C\",\"X\",\"\")","v":{"$error":"#NAME?"}},{"$f":"IF(INDEX(periode2,NEVAL,Nenfant)=\"B\",\"X\",\"\")","v":{"$error":"#NAME?"}},{"$f":"IF(INDEX(periode2,NEVAL,Nenfant)=\"A\",\"X\",\"\")","v":{"$error":"#NAME?"}},null,{"$f":"IF(INDEX(periode3,NEVAL,Nenfant)=\"D\",\"X\",\"\")","v":{"$error":"#NAME?"}},{"$f":"IF(INDEX(periode3,NEVAL,Nenfant)=\"C\",\"X\",\"\")","v":{"$error":"#NAME?"}},{"$f":"IF(INDEX(periode3,NEVAL,Nenfant)=\"B\",\"X\",\"\")","v":{"$error":"#NAME?"}},{"$f":"IF(INDEX(periode3,NEVAL,Nenfant)=\"A\",\"X\",\"\")","v":{"$error":"#NAME?"}},null,{"$f":"IF(INDEX(periode4,NEVAL,Nenfant)=\"D\",\"X\",\"\")","v":{"$error":"#NAME?"}},{"$f":"IF(INDEX(periode4,NEVAL,Nenfant)=\"C\",\"X\",\"\")","v":{"$error":"#NAME?"}},{"$f":"IF(INDEX(periode4,NEVAL,Nenfant)=\"B\",\"X\",\"\")","v":{"$error":"#NAME?"}},{"$f":"IF(INDEX(periode4,NEVAL,Nenfant)=\"A\",\"X\",\"\")","v":{"$error":"#NAME?"}},null,{"$f":"IF(INDEX(periode5,NEVAL,Nenfant)=\"D\",\"X\",\"\")","v":{"$error":"#NAME?"}},{"$f":"IF(INDEX(periode5,NEVAL,Nenfant)=\"C\",\"X\",\"\")","v":{"$error":"#NAME?"}},{"$f":"IF(INDEX(periode5,NEVAL,Nenfant)=\"B\",\"X\",\"\")","v":{"$error":"#NAME?"}},{"$f":"IF(INDEX(periode5,NEVAL,Nenfant)=\"A\",\"X\",\"\")","v":{"$error":"#NAME?"}},null,{"$f":"IF(INDEX(periode6,NEVAL,Nenfant)=\"D\",\"X\",\"\")","v":{"$error":"#NAME?"}},{"$f":"IF(INDEX(periode6,NEVAL,Nenfant)=\"C\",\"X\",\"\")","v":{"$error":"#NAME?"}},{"$f":"IF(INDEX(periode6,NEVAL,Nenfant)=\"B\",\"X\",\"\")","v":{"$error":"#NAME?"}},{"$f":"IF(INDEX(periode6,NEVAL,Nenfant)=\"A\",\"X\",\"\")","v":{"$error":"#NAME?"}}]
[24,{"$nulls":7},{"$f":"COUNTIF($G26:$G28,\"X\")","v":0},{"$f":"COUNTIF($H26:$H28,\"X\")","v":0},{"$f":"COUNTIF($I25:$I30,\"X\")","v":0},{"$f":"COUNTIF($J25:$J30,\"X\")","v":0},null,{"$f":"COUNTIF($G26:$G28,\"X\")","v":0},{"$f":"COUNTIF($H26:$H28,\"X\")","v":0},{"$f":"COUNTIF($I25:$I30,\"X\")","v":0},{"$f":"COUNTIF($J25:$J30,\"X\")","v":0},null,{"$f":"COUNTIF($G26:$G28,\"X\")","v":0},{"$f":"COUNTIF($H26:$H28,\"X\")","v":0},{"$f":"COUNTIF($I25:$I30,\"X\")","v":0},{"$f":"COUNTIF($J25:$J30,\"X\")","v":0},null,{"$f":"COUNTIF($G26:$G28,\"X\")","v":0},{"$f":"COUNTIF($H26:$H28,\"X\")","v":0},{"$f":"COUNTIF($I25:$I30,\"X\")","v":0},{"$f":"COUNTIF(AA25:AA30,\"X\")","v":0},null,{"$f":"COUNTIF($G26:$G28,\"X\")","v":0},{"$f":"COUNTIF($H26:$H28,\"X\")","v":0},{"$f":"COUNTIF($I25:$I30,\"X\")","v":0},{"$f":"COUNTIF($J25:$J30,\"X\")","v":0},null,{"$f":"COUNTIF($G26:$G28,\"X\")","v":0},{"$f":"COUNTIF($H26:$H28,\"X\")","v":0},{"$f":"COUNTIF($I25:$I30,\"X\")","v":0},{"$f":"COUNTIF($J25:$J30,\"X\")","v":0}]
[25,{"$nulls":7},{"$f":"IF(INDEX(periode1,NEVAL,Nenfant)=\"D\",\"X\",\"\")","v":{"$error":"#NAME?"}},{"$f":"IF(INDEX(periode1,NEVAL,Nenfant)=\"C\",\"X\",\"\")","v":{"$error":"#NAME?"}},{"$f":"IF(INDEX(periode1,NEVAL,Nenfant)=\"B\",\"X\",\"\")","v":{"$error":"#NAME?"}},{"$f":"IF(INDEX(periode1,NEVAL,Nenfant)=\"A\",\"X\",\"\")","v":{"$error":"#NAME?"}},null,{"$f":"IF(INDEX(periode2,NEVAL,Nenfant)=\"D\",\"X\",\"\")","v":{"$error":"#NAME?"}},{"$f":"IF(INDEX(periode2,NEVAL,Nenfant)=\"C\",\"X\",\"\")","v":{"$error":"#NAME?"}},{"$f":"IF(INDEX(periode2,NEVAL,Nenfant)=\"B\",\"X\",\"\")","v":{"$error":"#NAME?"}},{"$f":"IF(INDEX(periode2,NEVAL,Nenfant)=\"A\",\"X\",\"\")","v":{"$error":"#NAME?"}},null,{"$f":"IF(INDEX(periode3,NEVAL,Nenfant)=\"D\",\"X\",\"\")","v":{"$error":"#NAME?"}},{"$f":"IF(INDEX(periode3,NEVAL,Nenfant)=\"C\",\"X\",\"\")","v":{"$error":"#NAME?"}},{"$f":"IF(INDEX(periode3,NEVAL,Nenfant)=\"B\",\"X\",\"\")","v":{"$error":"#NAME?"}},{"$f":"IF(INDEX(periode3,NEVAL,Nenfant)=\"A\",\"X\",\"\")","v":{"$error":"#NAME?"}},null,{"$f":"IF(INDEX(periode4,NEVAL,Nenfant)=\"D\",\"X\",\"\")","v":{"$error":"#NAME?"}},{"$f":"IF(INDEX(periode4,NEVAL,Nenfant)=\"C\",\"X\",\"\")","v":{"$error":"#NAME?"}},{"$f":"IF(INDEX(periode4,NEVAL,Nenfant)=\"B\",\"X\",\"\")","v":{"$error":"#NAME?"}},{"$f":"IF(INDEX(periode4,NEVAL,Nenfant)=\"A\",\"X\",\"\")","v":{"$error":"#NAME?"}},null,{"$f":"IF(INDEX(periode5,NEVAL,Nenfant)=\"D\",\"X\",\"\")","v":{"$error":"#NAME?"}},{"$f":"IF(INDEX(periode5,NEVAL,Nenfant)=\"C\",\"X\",\"\")","v":{"$error":"#NAME?"}},{"$f":"IF(INDEX(periode5,NEVAL,Nenfant)=\"B\",\"X\",\"\")","v":{"$error":"#NAME?"}},{"$f":"IF(INDEX(periode5,NEVAL,Nenfant)=\"A\",\"X\",\"\")","v":{"$error":"#NAME?"}},null,{"$f":"IF(INDEX(periode6,NEVAL,Nenfant)=\"D\",\"X\",\"\")","v":{"$error":"#NAME?"}},{"$f":"IF(INDEX(periode6,NEVAL,Nenfant)=\"C\",\"X\",\"\")","v":{"$error":"#NAME?"}},{"$f":"IF(INDEX(periode6,NEVAL,Nenfant)=\"B\",\"X\",\"\")","v":{"$error":"#NAME?"}},{"$f":"IF(INDEX(periode6,NEVAL,Nenfant)=\"A\",\"X\",\"\")","v":{"$error":"#NAME?"}}]
[26,{"$nulls":7},{"$error":"#NAME?"},{"$error":"#NAME?"},{"$error":"#NAME?"},{"$error":"#NAME?"},null,{"$error":"#NAME?"},{"$error":"#NAME?"},{"$error":"#NAME?"},{"$error":"#NAME?"},null,{"$error":"#NAME?"},{"$error":"#NAME?"},{"$error":"#NAME?"},{"$error":"#NAME?"},null,{"$error":"#NAME?"},{"$error":"#NAME?"},{"$error":"#NAME?"},{"$error":"#NAME?"},null,{"$error":"#NAME?"},{"$error":"#NAME?"},{"$error":"#NAME?"},{"$error":"#NAME?"},null,{"$error":"#NAME?"},{"$error":"#NAME?"},{"$error":"#NAME?"},{"$error":"#NAME?"}]
[27,{"$nulls":7},{"$error":"#NAME?"},{"$error":"#NAME?"},{"$error":"#NAME?"},{"$error":"#NAME?"},null,{"$error":"#NAME?"},{"$error":"#NAME?"},{"$error":"#NAME?"},{"$error":"#NAME?"},null,{"$error":"#NAME?"},{"$error":"#NAME?"},{"$error":"#NAME?"},{"$error":"#NAME?"},null,{"$error":"#NAME?"},{"$error":"#NAME?"},{"$error":"#NAME?"},{"$error":"#NAME?"},null,{"$error":"#NAME?"},{"$error":"#NAME?"},{"$error":"#NAME?"},{"$error":"#NAME?"},null,{"$error":"#NAME?"},{"$error":"#NAME?"},{"$error":"#NAME?"},{"$error":"#NAME?"}]
[28,{"$nulls":7},{"$error":"#NAME?"},{"$error":"#NAME?"},{"$error":"#NAME?"},{"$error":"#NAME?"},null,{"$error":"#NAME?"},{"$error":"#NAME?"},{"$error":"#NAME?"},{"$error":"#NAME?"},null,{"$error":"#NAME?"},{"$error":"#NAME?"},{"$error":"#NAME?"},{"$error":"#NAME?"},null,{"$error":"#NAME?"},{"$error":"#NAME?"},{"$error":"#NAME?"},{"$error":"#NAME?"},null,{"$error":"#NAME?"},{"$error":"#NAME?"},{"$error":"#NAME?"},{"$error":"#NAME?"},null,{"$error":"#NAME?"},{"$error":"#NAME?"},{"$error":"#NAME?"},{"$error":"#NAME?"}]
[29,{"$nulls":7},{"$error":"#NAME?"},{"$error":"#NAME?"},{"$error":"#NAME?"},{"$error":"#NAME?"},null,{"$error":"#NAME?"},{"$error":"#NAME?"},{"$error":"#NAME?"},{"$error":"#NAME?"},null,{"$error":"#NAME?"},{"$error":"#NAME?"},{"$error":"#NAME?"},{"$error":"#NAME?"},null,{"$error":"#NAME?"},{"$error":"#NAME?"},{"$error":"#NAME?"},{"$error":"#NAME?"},null,{"$error":"#NAME?"},{"$error":"#NAME?"},{"$error":"#NAME?"},{"$error":"#NAME?"},null,{"$error":"#NAME?"},{"$error":"#NAME?"},{"$error":"#NAME?"},{"$error":"#NAME?"}]
[30,{"$nulls":7},{"$error":"#NAME?"},{"$error":"#NAME?"},{"$error":"#NAME?"},{"$error":"#NAME?"},null,{"$error":"#NAME?"},{"$error":"#NAME?"},{"$error":"#NAME?"},{"$error":"#NAME?"},null,{"$error":"#NAME?"},{"$error":"#NAME?"},{"$error":"#NAME?"},{"$error":"#NAME?"},null,{"$error":"#NAME?"},{"$error":"#NAME?"},{"$error":"#NAME?"},{"$error":"#NAME?"},null,{"$error":"#NAME?"},{"$error":"#NAME?"},{"$error":"#NAME?"},{"$error":"#NAME?"},null,{"$error":"#NAME?"},{"$error":"#NAME?"},{"$error":"#NAME?"},{"$error":"#NAME?"}]
[{"$f":"A30+1","v":31},{"$nulls":7},{"$f":"NB.S($G30:$G37,\"X\")","v":{"$error":"#NAME?"}},{"$f":"COUNTIF($H30:$H37,\"X\")","v":0},{"$f":"COUNTIF($I32:$I36,\"X\")","v":0},{"$f":"COUNTIF($J32:$J36,\"X\")","v":0},null,{"$f":"NB.S($G30:$G37,\"X\")","v":{"$error":"#NAME?"}},{"$f":"COUNTIF($H30:$H37,\"X\")","v":0},{"$f":"COUNTIF($I32:$I36,\"X\")","v":0},{"$f":"COUNTIF($J32:$J36,\"X\")","v":0},null,{"$f":"NB.S($G30:$G37,\"X\")","v":{"$error":"#NAME?"}},{"$f":"COUNTIF($H30:$H37,\"X\")","v":0},{"$f":"COUNTIF($I32:$I36,\"X\")","v":0},{"$f":"COUNTIF($J32:$J36,\"X\")","v":0},null,{"$f":"NB.S($G30:$G37,\"X\")","v":{"$error":"#NAME?"}},{"$f":"COUNTIF($H30:$H37,\"X\")","v":0},{"$f":"COUNTIF($I32:$I36,\"X\")","v":0},{"$f":"COUNTIF(AA32:AA36,\"X\")","v":0},null,{"$f":"NB.S($G30:$G37,\"X\")","v":{"$error":"#NAME?"}},{"$f":"COUNTIF($H30:$H37,\"X\")","v":0},{"$f":"COUNTIF($I32:$I36,\"X\")","v":0},{"$f":"COUNTIF($J32:$J36,\"X\")","v":0},null,{"$f":"NB.S($G30:$G37,\"X\")","v":{"$error":"#NAME?"}},{"$f":"COUNTIF($H30:$H37,\"X\")","v":0},{"$f":"COUNTIF($I32:$I36,\"X\")","v":0},{"$f":"COUNTIF($J32:$J36,\"X\")","v":0}]
[32,{"$nulls":7},{"$f":"IF(INDEX(periode1,NEVAL,Nenfant)=\"D\",\"X\",\"\")","v":{"$error":"#NAME?"}},{"$f":"IF(INDEX(periode1,NEVAL,Nenfant)=\"C\",\"X\",\"\")","v":{"$error":"#NAME?"}},{"$f":"IF(INDEX(periode1,NEVAL,Nenfant)=\"B\",\"X\",\"\")","v":{"$error":"#NAME?"}},{"$f":"IF(INDEX(periode1,NEVAL,Nenfant)=\"A\",\"X\",\"\")","v":{"$error":"#NAME?"}},null,{"$f":"IF(INDEX(periode2,NEVAL,Nenfant)=\"D\",\"X\",\"\")","v":{"$error":"#NAME?"}},{"$f":"IF(INDEX(periode2,NEVAL,Nenfant)=\"C\",\"X\",\"\")","v":{"$error":"#NAME?"}},{"$f":"IF(INDEX(periode2,NEVAL,Nenfant)=\"B\",\"X\",\"\")","v":{"$error":"#NAME?"}},{"$f":"IF(INDEX(periode2,NEVAL,Nenfant)=\"A\",\"X\",\"\")","v":{"$error":"#NAME?"}},null,{"$f":"IF(INDEX(periode3,NEVAL,Nenfant)=\"D\",\"X\",\"\")","v":{"$error":"#NAME?"}},{"$f":"IF(INDEX(periode3,NEVAL,Nenfant)=\"C\",\"X\",\"\")","v":{"$error":"#NAME?"}},{"$f":"IF(INDEX(periode3,NEVAL,Nenfant)=\"B\",\"X\",\"\")","v":{"$error":"#NAME?"}},{"$f":"IF(INDEX(periode3,NEVAL,Nenfant)=\"A\",\"X\",\"\")","v":{"$error":"#NAME?"}},null,{"$f":"IF(INDEX(periode4,NEVAL,Nenfant)=\"D\",\"X\",\"\")","v":{"$error":"#NAME?"}},{"$f":"IF(INDEX(periode4,NEVAL,Nenfant)=\"C\",\"X\",\"\")","v":{"$error":"#NAME?"}},{"$f":"IF(INDEX(periode4,NEVAL,Nenfant)=\"B\",\"X\",\"\")","v":{"$error":"#NAME?"}},{"$f":"IF(INDEX(periode4,NEVAL,Nenfant)=\"A\",\"X\",\"\")","v":{"$error":"#NAME?"}},null,{"$f":"IF(INDEX(periode5,NEVAL,Nenfant)=\"D\",\"X\",\"\")","v":{"$error":"#NAME?"}},{"$f":"IF(INDEX(periode5,NEVAL,Nenfant)=\"C\",\"X\",\"\")","v":{"$error":"#NAME?"}},{"$f":"IF(INDEX(periode5,NEVAL,Nenfant)=\"B\",\"X\",\"\")","v":{"$error":"#NAME?"}},{"$f":"IF(INDEX(periode5,NEVAL,Nenfant)=\"A\",\"X\",\"\")","v":{"$error":"#NAME?"}},null,{"$f":"IF(INDEX(periode6,NEVAL,Nenfant)=\"D\",\"X\",\"\")","v":{"$error":"#NAME?"}},{"$f":"IF(INDEX(periode6,NEVAL,Nenfant)=\"C\",\"X\",\"\")","v":{"$error":"#NAME?"}},{"$f":"IF(INDEX(periode6,NEVAL,Nenfant)=\"B\",\"X\",\"\")","v":{"$error":"#NAME?"}},{"$f":"IF(INDEX(periode6,NEVAL,Nenfant)=\"A\",\"X\",\"\")","v":{"$error":"#NAME?"}}]
[33,{"$nulls":7},{"$f":"IF(INDEX(periode1,NEVAL,Nenfant)=\"D\",\"X\",\"\")","v":{"$error":"#NAME?"}},{"$f":"IF(INDEX(periode1,NEVAL,Nenfant)=\"C\",\"X\",\"\")","v":{"$error":"#NAME?"}},{"$f":"IF(INDEX(periode1,NEVAL,Nenfant)=\"B\",\"X\",\"\")","v":{"$error":"#NAME?"}},{"$f":"IF(INDEX(periode1,NEVAL,Nenfant)=\"A\",\"X\",\"\")","v":{"$error":"#NAME?"}},null,{"$f":"IF(INDEX(periode2,NEVAL,Nenfant)=\"D\",\"X\",\"\")","v":{"$error":"#NAME?"}},{"$f":"IF(INDEX(periode2,NEVAL,Nenfant)=\"C\",\"X\",\"\")","v":{"$error":"#NAME?"}},{"$f":"IF(INDEX(periode2,NEVAL,Nenfant)=\"B\",\"X\",\"\")","v":{"$error":"#NAME?"}},{"$f":"IF(INDEX(periode2,NEVAL,Nenfant)=\"A\",\"X\",\"\")","v":{"$error":"#NAME?"}},null,{"$f":"IF(INDEX(periode3,NEVAL,Nenfant)=\"D\",\"X\",\"\")","v":{"$error":"#NAME?"}},{"$f":"IF(INDEX(periode3,NEVAL,Nenfant)=\"C\",\"X\",\"\")","v":{"$error":"#NAME?"}},{"$f":"IF(INDEX(periode3,NEVAL,Nenfant)=\"B\",\"X\",\"\")","v":{"$error":"#NAME?"}},{"$f":"IF(INDEX(periode3,NEVAL,Nenfant)=\"A\",\"X\",\"\")","v":{"$error":"#NAME?"}},null,{"$f":"IF(INDEX(periode4,NEVAL,Nenfant)=\"D\",\"X\",\"\")","v":{"$error":"#NAME?"}},{"$f":"IF(INDEX(periode4,NEVAL,Nenfant)=\"C\",\"X\",\"\")","v":{"$error":"#NAME?"}},{"$f":"IF(INDEX(periode4,NEVAL,Nenfant)=\"B\",\"X\",\"\")","v":{"$error":"#NAME?"}},{"$f":"IF(INDEX(periode4,NEVAL,Nenfant)=\"A\",\"X\",\"\")","v":{"$error":"#NAME?"}},null,{"$f":"IF(INDEX(periode5,NEVAL,Nenfant)=\"D\",\"X\",\"\")","v":{"$error":"#NAME?"}},{"$f":"IF(INDEX(periode5,NEVAL,Nenfant)=\"C\",\"X\",\"\")","v":{"$error":"#NAME?"}},{"$f":"IF(INDEX(periode5,NEVAL,Nenfant)=\"B\",\"X\",\"\")","v":{"$error":"#NAME?"}},{"$f":"IF(INDEX(periode5,NEVAL,Nenfant)=\"A\",\"X\",\"\")","v":{"$error":"#NAME?"}},null,{"$f":"IF(INDEX(periode6,NEVAL,Nenfant)=\"D\",\"X\",\"\")","v":{"$error":"#NAME?"}},{"$f":"IF(INDEX(periode6,NEVAL,Nenfant)=\"C\",\"X\",\"\")","v":{"$error":"#NAME?"}},{"$f":"IF(INDEX(periode6,NEVAL,Nenfant)=\"B\",\"X\",\"\")","v":{"$error":"#NAME?"}},{"$f":"IF(INDEX(periode6,NEVAL,Nenfant)=\"A\",\"X\",\"\")","v":{"$error":"#NAME?"}}]
[34,{"$nulls":7},{"$f":"IF(INDEX(periode1,NEVAL,Nenfant)=\"D\",\"X\",\"\")","v":{"$error":"#NAME?"}},{"$f":"IF(INDEX(periode1,NEVAL,Nenfant)=\"C\",\"X\",\"\")","v":{"$error":"#NAME?"}},{"$f":"IF(INDEX(periode1,NEVAL,Nenfant)=\"B\",\"X\",\"\")","v":{"$error":"#NAME?"}},{"$f":"IF(INDEX(periode1,NEVAL,Nenfant)=\"A\",\"X\",\"\")","v":{"$error":"#NAME?"}},null,{"$f":"IF(INDEX(periode2,NEVAL,Nenfant)=\"D\",\"X\",\"\")","v":{"$error":"#NAME?"}},{"$f":"IF(INDEX(periode2,NEVAL,Nenfant)=\"C\",\"X\",\"\")","v":{"$error":"#NAME?"}},{"$f":"IF(INDEX(periode2,NEVAL,Nenfant)=\"B\",\"X\",\"\")","v":{"$error":"#NAME?"}},{"$f":"IF(INDEX(periode2,NEVAL,Nenfant)=\"A\",\"X\",\"\")","v":{"$error":"#NAME?"}},null,{"$f":"IF(INDEX(periode3,NEVAL,Nenfant)=\"D\",\"X\",\"\")","v":{"$error":"#NAME?"}},{"$f":"IF(INDEX(periode3,NEVAL,Nenfant)=\"C\",\"X\",\"\")","v":{"$error":"#NAME?"}},{"$f":"IF(INDEX(periode3,NEVAL,Nenfant)=\"B\",\"X\",\"\")","v":{"$error":"#NAME?"}},{"$f":"IF(INDEX(periode3,NEVAL,Nenfant)=\"A\",\"X\",\"\")","v":{"$error":"#NAME?"}},null,{"$f":"IF(INDEX(periode4,NEVAL,Nenfant)=\"D\",\"X\",\"\")","v":{"$error":"#NAME?"}},{"$f":"IF(INDEX(periode4,NEVAL,Nenfant)=\"C\",\"X\",\"\")","v":{"$error":"#NAME?"}},{"$f":"IF(INDEX(periode4,NEVAL,Nenfant)=\"B\",\"X\",\"\")","v":{"$error":"#NAME?"}},{"$f":"IF(INDEX(periode4,NEVAL,Nenfant)=\"A\",\"X\",\"\")","v":{"$error":"#NAME?"}},null,{"$f":"IF(INDEX(periode5,NEVAL,Nenfant)=\"D\",\"X\",\"\")","v":{"$error":"#NAME?"}},{"$f":"IF(INDEX(periode5,NEVAL,Nenfant)=\"C\",\"X\",\"\")","v":{"$error":"#NAME?"}},{"$f":"IF(INDEX(periode5,NEVAL,Nenfant)=\"B\",\"X\",\"\")","v":{"$error":"#NAME?"}},{"$f":"IF(INDEX(periode5,NEVAL,Nenfant)=\"A\",\"X\",\"\")","v":{"$error":"#NAME?"}},null,{"$f":"IF(INDEX(periode6,NEVAL,Nenfant)=\"D\",\"X\",\"\")","v":{"$error":"#NAME?"}},{"$f":"IF(INDEX(periode6,NEVAL,Nenfant)=\"C\",\"X\",\"\")","v":{"$error":"#NAME?"}},{"$f":"IF(INDEX(periode6,NEVAL,Nenfant)=\"B\",\"X\",\"\")","v":{"$error":"#NAME?"}},{"$f":"IF(INDEX(periode6,NEVAL,Nenfant)=\"A\",\"X\",\"\")","v":{"$error":"#NAME?"}}]
[35,{"$nulls":7},{"$f":"IF(INDEX(periode1,NEVAL,Nenfant)=\"D\",\"X\",\"\")","v":{"$error":"#NAME?"}},{"$f":"IF(INDEX(periode1,NEVAL,Nenfant)=\"C\",\"X\",\"\")","v":{"$error":"#NAME?"}},{"$f":"IF(INDEX(periode1,NEVAL,Nenfant)=\"B\",\"X\",\"\")","v":{"$error":"#NAME?"}},{"$f":"IF(INDEX(periode1,NEVAL,Nenfant)=\"A\",\"X\",\"\")","v":{"$error":"#NAME?"}},null,{"$f":"IF(INDEX(periode2,NEVAL,Nenfant)=\"D\",\"X\",\"\")","v":{"$error":"#NAME?"}},{"$f":"IF(INDEX(periode2,NEVAL,Nenfant)=\"C\",\"X\",\"\")","v":{"$error":"#NAME?"}},{"$f":"IF(INDEX(periode2,NEVAL,Nenfant)=\"B\",\"X\",\"\")","v":{"$error":"#NAME?"}},{"$f":"IF(INDEX(periode2,NEVAL,Nenfant)=\"A\",\"X\",\"\")","v":{"$error":"#NAME?"}},null,{"$f":"IF(INDEX(periode3,NEVAL,Nenfant)=\"D\",\"X\",\"\")","v":{"$error":"#NAME?"}},{"$f":"IF(INDEX(periode3,NEVAL,Nenfant)=\"C\",\"X\",\"\")","v":{"$error":"#NAME?"}},{"$f":"IF(INDEX(periode3,NEVAL,Nenfant)=\"B\",\"X\",\"\")","v":{"$error":"#NAME?"}},{"$f":"IF(INDEX(periode3,NEVAL,Nenfant)=\"A\",\"X\",\"\")","v":{"$error":"#NAME?"}},null,{"$f":"IF(INDEX(periode4,NEVAL,Nenfant)=\"D\",\"X\",\"\")","v":{"$error":"#NAME?"}},{"$f":"IF(INDEX(periode4,NEVAL,Nenfant)=\"C\",\"X\",\"\")","v":{"$error":"#NAME?"}},{"$f":"IF(INDEX(periode4,NEVAL,Nenfant)=\"B\",\"X\",\"\")","v":{"$error":"#NAME?"}},{"$f":"IF(INDEX(periode4,NEVAL,Nenfant)=\"A\",\"X\",\"\")","v":{"$error":"#NAME?"}},null,{"$f":"IF(INDEX(periode5,NEVAL,Nenfant)=\"D\",\"X\",\"\")","v":{"$error":"#NAME?"}},{"$f":"IF(INDEX(periode5,NEVAL,Nenfant)=\"C\",\"X\",\"\")","v":{"$error":"#NAME?"}},{"$f":"IF(INDEX(periode5,NEVAL,Nenfant)=\"B\",\"X\",\"\")","v":{"$error":"#NAME?"}},{"$f":"IF(INDEX(periode5,NEVAL,Nenfant)=\"A\",\"X\",\"\")","v":{"$error":"#NAME?"}},null,{"$f":"IF(INDEX(periode6,NEVAL,Nenfant)=\"D\",\"X\",\"\")","v":{"$error":"#NAME?"}},{"$f":"IF(INDEX(periode6,NEVAL,Nenfant)=\"C\",\"X\",\"\")","v":{"$error":"#NAME?"}},{"$f":"IF(INDEX(periode6,NEVAL,Nenfant)=\"B\",\"X\",\"\")","v":{"$error":"#NAME?"}},{"$f":"IF(INDEX(periode6,NEVAL,Nenfant)=\"A\",\"X\",\"\")","v":{"$error":"#NAME?"}}]
[36,{"$nulls":7},{"$f":"IF(INDEX(periode1,NEVAL,Nenfant)=\"D\",\"X\",\"\")","v":{"$error":"#NAME?"}},{"$f":"IF(INDEX(periode1,NEVAL,Nenfant)=\"C\",\"X\",\"\")","v":{"$error":"#NAME?"}},{"$f":"IF(INDEX(periode1,NEVAL,Nenfant)=\"B\",\"X\",\"\")","v":{"$error":"#NAME?"}},{"$f":"IF(INDEX(periode1,NEVAL,Nenfant)=\"A\",\"X\",\"\")","v":{"$error":"#NAME?"}},null,{"$f":"IF(INDEX(periode2,NEVAL,Nenfant)=\"D\",\"X\",\"\")","v":{"$error":"#NAME?"}},{"$f":"IF(INDEX(periode2,NEVAL,Nenfant)=\"C\",\"X\",\"\")","v":{"$error":"#NAME?"}},{"$f":"IF(INDEX(periode2,NEVAL,Nenfant)=\"B\",\"X\",\"\")","v":{"$error":"#NAME?"}},{"$f":"IF(INDEX(periode2,NEVAL,Nenfant)=\"A\",\"X\",\"\")","v":{"$error":"#NAME?"}},null,{"$f":"IF(INDEX(periode3,NEVAL,Nenfant)=\"D\",\"X\",\"\")","v":{"$error":"#NAME?"}},{"$f":"IF(INDEX(periode3,NEVAL,Nenfant)=\"C\",\"X\",\"\")","v":{"$error":"#NAME?"}},{"$f":"IF(INDEX(periode3,NEVAL,Nenfant)=\"B\",\"X\",\"\")","v":{"$error":"#NAME?"}},{"$f":"IF(INDEX(periode3,NEVAL,Nenfant)=\"A\",\"X\",\"\")","v":{"$error":"#NAME?"}},null,{"$f":"IF(INDEX(periode4,NEVAL,Nenfant)=\"D\",\"X\",\"\")","v":{"$error":"#NAME?"}},{"$f":"IF(INDEX(periode4,NEVAL,Nenfant)=\"C\",\"X\",\"\")","v":{"$error":"#NAME?"}},{"$f":"IF(INDEX(periode4,NEVAL,Nenfant)=\"B\",\"X\",\"\")","v":{"$error":"#NAME?"}},{"$f":"IF(INDEX(periode4,NEVAL,Nenfant)=\"A\",\"X\",\"\")","v":{"$error":"#NAME?"}},null,{"$f":"IF(INDEX(periode5,NEVAL,Nenfant)=\"D\",\"X\",\"\")","v":{"$error":"#NAME?"}},{"$f":"IF(INDEX(periode5,NEVAL,Nenfant)=\"C\",\"X\",\"\")","v":{"$error":"#NAME?"}},{"$f":"IF(INDEX(periode5,NEVAL,Nenfant)=\"B\",\"X\",\"\")","v":{"$error":"#NAME?"}},{"$f":"IF(INDEX(periode5,NEVAL,Nenfant)=\"A\",\"X\",\"\")","v":{"$error":"#NAME?"}},null,{"$f":"IF(INDEX(periode6,NEVAL,Nenfant)=\"D\",\"X\",\"\")","v":{"$error":"#NAME?"}},{"$f":"IF(INDEX(periode6,NEVAL,Nenfant)=\"C\",\"X\",\"\")","v":{"$error":"#NAME?"}},{"$f":"IF(INDEX(periode6,NEVAL,Nenfant)=\"B\",\"X\",\"\")","v":{"$error":"#NAME?"}},{"$f":"IF(INDEX(periode6,NEVAL,Nenfant)=\"A\",\"X\",\"\")","v":{"$error":"#NAME?"}}]
[37,{"$nulls":7},{"$f":"COUNTIF($G39:$G42,\"X\")","v":0},{"$f":"COUNTIF($H39:$H42,\"X\")","v":0},{"$f":"COUNTIF($I38:$I40,\"X\")","v":0},{"$f":"COUNTIF($J38:$J40,\"X\")","v":0},null,{"$f":"COUNTIF($G39:$G42,\"X\")","v":0},{"$f":"COUNTIF($H39:$H42,\"X\")","v":0},{"$f":"COUNTIF($I38:$I40,\"X\")","v":0},{"$f":"COUNTIF($J38:$J40,\"X\")","v":0},null,{"$f":"COUNTIF($G39:$G42,\"X\")","v":0},{"$f":"COUNTIF($H39:$H42,\"X\")","v":0},{"$f":"COUNTIF($I38:$I40,\"X\")","v":0},{"$f":"COUNTIF($J38:$J40,\"X\")","v":0},null,{"$f":"COUNTIF($G39:$G42,\"X\")","v":0},{"$f":"COUNTIF($H39:$H42,\"X\")","v":0},{"$f":"COUNTIF($I38:$I40,\"X\")","v":0},{"$f":"COUNTIF(AA38:AA40,\"X\")","v":0},null,{"$f":"COUNTIF($G39:$G42,\"X\")","v":0},{"$f":"COUNTIF($H39:$H42,\"X\")","v":0},{"$f":"COUNTIF($I38:$I40,\"X\")","v":0},{"$f":"COUNTIF($J38:$J40,\"X\")","v":0},null,{"$f":"COUNTIF($G39:$G42,\"X\")","v":0},{"$f":"COUNTIF($H39:$H42,\"X\")","v":0},{"$f":"COUNTIF($I38:$I40,\"X\")","v":0},{"$f":"COUNTIF($J38:$J40,\"X\")","v":0}]
[38,{"$nulls":7},{"$f":"IF(INDEX(periode1,NEVAL,Nenfant)=\"D\",\"X\",\"\")","v":{"$error":"#NAME?"}},{"$f":"IF(INDEX(periode1,NEVAL,Nenfant)=\"C\",\"X\",\"\")","v":{"$error":"#NAME?"}},{"$f":"IF(INDEX(periode1,NEVAL,Nenfant)=\"B\",\"X\",\"\")","v":{"$error":"#NAME?"}},{"$f":"IF(INDEX(periode1,NEVAL,Nenfant)=\"A\",\"X\",\"\")","v":{"$error":"#NAME?"}},null,{"$f":"IF(INDEX(periode2,NEVAL,Nenfant)=\"D\",\"X\",\"\")","v":{"$error":"#NAME?"}},{"$f":"IF(INDEX(periode2,NEVAL,Nenfant)=\"C\",\"X\",\"\")","v":{"$error":"#NAME?"}},{"$f":"IF(INDEX(periode2,NEVAL,Nenfant)=\"B\",\"X\",\"\")","v":{"$error":"#NAME?"}},{"$f":"IF(INDEX(periode2,NEVAL,Nenfant)=\"A\",\"X\",\"\")","v":{"$error":"#NAME?"}},null,{"$f":"IF(INDEX(periode3,NEVAL,Nenfant)=\"D\",\"X\",\"\")","v":{"$error":"#NAME?"}},{"$f":"IF(INDEX(periode3,NEVAL,Nenfant)=\"C\",\"X\",\"\")","v":{"$error":"#NAME?"}},{"$f":"IF(INDEX(periode3,NEVAL,Nenfant)=\"B\",\"X\",\"\")","v":{"$error":"#NAME?"}},{"$f":"IF(INDEX(periode3,NEVAL,Nenfant)=\"A\",\"X\",\"\")","v":{"$error":"#NAME?"}},null,{"$f":"IF(INDEX(periode4,NEVAL,Nenfant)=\"D\",\"X\",\"\")","v":{"$error":"#NAME?"}},{"$f":"IF(INDEX(periode4,NEVAL,Nenfant)=\"C\",\"X\",\"\")","v":{"$error":"#NAME?"}},{"$f":"IF(INDEX(periode4,NEVAL,Nenfant)=\"B\",\"X\",\"\")","v":{"$error":"#NAME?"}},{"$f":"IF(INDEX(periode4,NEVAL,Nenfant)=\"A\",\"X\",\"\")","v":{"$error":"#NAME?"}},null,{"$f":"IF(INDEX(periode5,NEVAL,Nenfant)=\"D\",\"X\",\"\")","v":{"$error":"#NAME?"}},{"$f":"IF(INDEX(periode5,NEVAL,Nenfant)=\"C\",\"X\",\"\")","v":{"$error":"#NAME?"}},{"$f":"IF(INDEX(periode5,NEVAL,Nenfant)=\"B\",\"X\",\"\")","v":{"$error":"#NAME?"}},{"$f":"IF(INDEX(periode5,NEVAL,Nenfant)=\"A\",\"X\",\"\")","v":{"$error":"#NAME?"}},null,{"$f":"IF(INDEX(periode6,NEVAL,Nenfant)=\"D\",\"X\",\"\")","v":{"$error":"#NAME?"}},{"$f":"IF(INDEX(periode6,NEVAL,Nenfant)=\"C\",\"X\",\"\")","v":{"$error":"#NAME?"}},{"$f":"IF(INDEX(periode6,NEVAL,Nenfant)=\"B\",\"X\",\"\")","v":{"$error":"#NAME?"}},{"$f":"IF(INDEX(periode6,NEVAL,Nenfant)=\"A\",\"X\",\"\")","v":{"$error":"#NAME?"}}]
[39,{"$nulls":7},{"$f":"IF(INDEX(periode1,NEVAL,Nenfant)=\"D\",\"X\",\"\")","v":{"$error":"#NAME?"}},{"$f":"IF(INDEX(periode1,NEVAL,Nenfant)=\"C\",\"X\",\"\")","v":{"$error":"#NAME?"}},{"$f":"IF(INDEX(periode1,NEVAL,Nenfant)=\"B\",\"X\",\"\")","v":{"$error":"#NAME?"}},{"$f":"IF(INDEX(periode1,NEVAL,Nenfant)=\"A\",\"X\",\"\")","v":{"$error":"#NAME?"}},null,{"$f":"IF(INDEX(periode2,NEVAL,Nenfant)=\"D\",\"X\",\"\")","v":{"$error":"#NAME?"}},{"$f":"IF(INDEX(periode2,NEVAL,Nenfant)=\"C\",\"X\",\"\")","v":{"$error":"#NAME?"}},{"$f":"IF(INDEX(periode2,NEVAL,Nenfant)=\"B\",\"X\",\"\")","v":{"$error":"#NAME?"}},{"$f":"IF(INDEX(periode2,NEVAL,Nenfant)=\"A\",\"X\",\"\")","v":{"$error":"#NAME?"}},null,{"$f":"IF(INDEX(periode3,NEVAL,Nenfant)=\"D\",\"X\",\"\")","v":{"$error":"#NAME?"}},{"$f":"IF(INDEX(periode3,NEVAL,Nenfant)=\"C\",\"X\",\"\")","v":{"$error":"#NAME?"}},{"$f":"IF(INDEX(periode3,NEVAL,Nenfant)=\"B\",\"X\",\"\")","v":{"$error":"#NAME?"}},{"$f":"IF(INDEX(periode3,NEVAL,Nenfant)=\"A\",\"X\",\"\")","v":{"$error":"#NAME?"}},null,{"$f":"IF(INDEX(periode4,NEVAL,Nenfant)=\"D\",\"X\",\"\")","v":{"$error":"#NAME?"}},{"$f":"IF(INDEX(periode4,NEVAL,Nenfant)=\"C\",\"X\",\"\")","v":{"$error":"#NAME?"}},{"$f":"IF(INDEX(periode4,NEVAL,Nenfant)=\"B\",\"X\",\"\")","v":{"$error":"#NAME?"}},{"$f":"IF(INDEX(periode4,NEVAL,Nenfant)=\"A\",\"X\",\"\")","v":{"$error":"#NAME?"}},null,{"$f":"IF(INDEX(periode5,NEVAL,Nenfant)=\"D\",\"X\",\"\")","v":{"$error":"#NAME?"}},{"$f":"IF(INDEX(periode5,NEVAL,Nenfant)=\"C\",\"X\",\"\")","v":{"$error":"#NAME?"}},{"$f":"IF(INDEX(periode5,NEVAL,Nenfant)=\"B\",\"X\",\"\")","v":{"$error":"#NAME?"}},{"$f":"IF(INDEX(periode5,NEVAL,Nenfant)=\"A\",\"X\",\"\")","v":{"$error":"#NAME?"}},null,{"$f":"IF(INDEX(periode6,NEVAL,Nenfant)=\"D\",\"X\",\"\")","v":{"$error":"#NAME?"}},{"$f":"IF(INDEX(periode6,NEVAL,Nenfant)=\"C\",\"X\",\"\")","v":{"$error":"#NAME?"}},{"$f":"IF(INDEX(periode6,NEVAL,Nenfant)=\"B\",\"X\",\"\")","v":{"$error":"#NAME?"}},{"$f":"IF(INDEX(periode6,NEVAL,Nenfant)=\"A\",\"X\",\"\")","v":{"$error":"#NAME?"}}]
[40,{"$nulls":7},{"$f":"IF(INDEX(periode1,NEVAL,Nenfant)=\"D\",\"X\",\"\")","v":{"$error":"#NAME?"}},{"$f":"IF(INDEX(periode1,NEVAL,Nenfant)=\"C\",\"X\",\"\")","v":{"$error":"#NAME?"}},{"$f":"IF(INDEX(periode1,NEVAL,Nenfant)=\"B\",\"X\",\"\")","v":{"$error":"#NAME?"}},{"$f":"IF(INDEX(periode1,NEVAL,Nenfant)=\"A\",\"X\",\"\")","v":{"$error":"#NAME?"}},null,{"$f":"IF(INDEX(periode2,NEVAL,Nenfant)=\"D\",\"X\",\"\")","v":{"$error":"#NAME?"}},{"$f":"IF(INDEX(periode2,NEVAL,Nenfant)=\"C\",\"X\",\"\")","v":{"$error":"#NAME?"}},{"$f":"IF(INDEX(periode2,NEVAL,Nenfant)=\"B\",\"X\",\"\")","v":{"$error":"#NAME?"}},{"$f":"IF(INDEX(periode2,NEVAL,Nenfant)=\"A\",\"X\",\"\")","v":{"$error":"#NAME?"}},null,{"$f":"IF(INDEX(periode3,NEVAL,Nenfant)=\"D\",\"X\",\"\")","v":{"$error":"#NAME?"}},{"$f":"IF(INDEX(periode3,NEVAL,Nenfant)=\"C\",\"X\",\"\")","v":{"$error":"#NAME?"}},{"$f":"IF(INDEX(periode3,NEVAL,Nenfant)=\"B\",\"X\",\"\")","v":{"$error":"#NAME?"}},{"$f":"IF(INDEX(periode3,NEVAL,Nenfant)=\"A\",\"X\",\"\")","v":{"$error":"#NAME?"}},null,{"$f":"IF(INDEX(periode4,NEVAL,Nenfant)=\"D\",\"X\",\"\")","v":{"$error":"#NAME?"}},{"$f":"IF(INDEX(periode4,NEVAL,Nenfant)=\"C\",\"X\",\"\")","v":{"$error":"#NAME?"}},{"$f":"IF(INDEX(periode4,NEVAL,Nenfant)=\"B\",\"X\",\"\")","v":{"$error":"#NAME?"}},{"$f":"IF(INDEX(periode4,NEVAL,Nenfant)=\"A\",\"X\",\"\")","v":{"$error":"#NAME?"}},null,{"$f":"IF(INDEX(periode5,NEVAL,Nenfant)=\"D\",\"X\",\"\")","v":{"$error":"#NAME?"}},{"$f":"IF(INDEX(periode5,NEVAL,Nenfant)=\"C\",\"X\",\"\")","v":{"$error":"#NAME?"}},{"$f":"IF(INDEX(periode5,NEVAL,Nenfant)=\"B\",\"X\",\"\")","v":{"$error":"#NAME?"}},{"$f":"IF(INDEX(periode5,NEVAL,Nenfant)=\"A\",\"X\",\"\")","v":{"$error":"#NAME?"}},null,{"$f":"IF(INDEX(periode6,NEVAL,Nenfant)=\"D\",\"X\",\"\")","v":{"$error":"#NAME?"}},{"$f":"IF(INDEX(periode6,NEVAL,Nenfant)=\"C\",\"X\",\"\")","v":{"$error":"#NAME?"}},{"$f":"IF(INDEX(periode6,NEVAL,Nenfant)=\"B\",\"X\",\"\")","v":{"$error":"#NAME?"}},{"$f":"IF(INDEX(periode6,NEVAL,Nenfant)=\"A\",\"X\",\"\")","v":{"$error":"#NAME?"}}]
[41,{"$nulls":7},{"$f":"COUNTIF($G44:$G52,\"X\")","v":0},{"$f":"COUNTIF($H44:$H52,\"X\")","v":0},{"$f":"COUNTIF($I42:$I44,\"X\")","v":0},{"$f":"COUNTIF($J42:$J44,\"X\")","v":0},null,{"$f":"COUNTIF($G44:$G52,\"X\")","v":0},{"$f":"COUNTIF($H44:$H52,\"X\")","v":0},{"$f":"COUNTIF($I42:$I44,\"X\")","v":0},{"$f":"COUNTIF($J42:$J44,\"X\")","v":0},null,{"$f":"COUNTIF($G44:$G52,\"X\")","v":0},{"$f":"COUNTIF($H44:$H52,\"X\")","v":0},{"$f":"COUNTIF($I42:$I44,\"X\")","v":0},{"$f":"COUNTIF($J42:$J44,\"X\")","v":0},null,{"$f":"COUNTIF($G44:$G52,\"X\")","v":0},{"$f":"COUNTIF($H44:$H52,\"X\")","v":0},{"$f":"COUNTIF($I42:$I44,\"X\")","v":0},{"$f":"COUNTIF(AA42:AA44,\"X\")","v":0},null,{"$f":"COUNTIF($G44:$G52,\"X\")","v":0},{"$f":"COUNTIF($H44:$H52,\"X\")","v":0},{"$f":"COUNTIF($I42:$I44,\"X\")","v":0},{"$f":"COUNTIF($J42:$J44,\"X\")","v":0},null,{"$f":"COUNTIF($G44:$G52,\"X\")","v":0},{"$f":"COUNTIF($H44:$H52,\"X\")","v":0},{"$f":"COUNTIF($I42:$I44,\"X\")","v":0},{"$f":"COUNTIF($J42:$J44,\"X\")","v":0}]
[42,{"$nulls":7},{"$f":"IF(INDEX(periode1,NEVAL,Nenfant)=\"D\",\"X\",\"\")","v":{"$error":"#NAME?"}},{"$f":"IF(INDEX(periode1,NEVAL,Nenfant)=\"C\",\"X\",\"\")","v":{"$error":"#NAME?"}},{"$f":"IF(INDEX(periode1,NEVAL,Nenfant)=\"B\",\"X\",\"\")","v":{"$error":"#NAME?"}},{"$f":"IF(INDEX(periode1,NEVAL,Nenfant)=\"A\",\"X\",\"\")","v":{"$error":"#NAME?"}},null,{"$f":"IF(INDEX(periode2,NEVAL,Nenfant)=\"D\",\"X\",\"\")","v":{"$error":"#NAME?"}},{"$f":"IF(INDEX(periode2,NEVAL,Nenfant)=\"C\",\"X\",\"\")","v":{"$error":"#NAME?"}},{"$f":"IF(INDEX(periode2,NEVAL,Nenfant)=\"B\",\"X\",\"\")","v":{"$error":"#NAME?"}},{"$f":"IF(INDEX(periode2,NEVAL,Nenfant)=\"A\",\"X\",\"\")","v":{"$error":"#NAME?"}},null,{"$f":"IF(INDEX(periode3,NEVAL,Nenfant)=\"D\",\"X\",\"\")","v":{"$error":"#NAME?"}},{"$f":"IF(INDEX(periode3,NEVAL,Nenfant)=\"C\",\"X\",\"\")","v":{"$error":"#NAME?"}},{"$f":"IF(INDEX(periode3,NEVAL,Nenfant)=\"B\",\"X\",\"\")","v":{"$error":"#NAME?"}},{"$f":"IF(INDEX(periode3,NEVAL,Nenfant)=\"A\",\"X\",\"\")","v":{"$error":"#NAME?"}},null,{"$f":"IF(INDEX(periode4,NEVAL,Nenfant)=\"D\",\"X\",\"\")","v":{"$error":"#NAME?"}},{"$f":"IF(INDEX(periode4,NEVAL,Nenfant)=\"C\",\"X\",\"\")","v":{"$error":"#NAME?"}},{"$f":"IF(INDEX(periode4,NEVAL,Nenfant)=\"B\",\"X\",\"\")","v":{"$error":"#NAME?"}},{"$f":"IF(INDEX(periode4,NEVAL,Nenfant)=\"A\",\"X\",\"\")","v":{"$error":"#NAME?"}},null,{"$f":"IF(INDEX(periode5,NEVAL,Nenfant)=\"D\",\"X\",\"\")","v":{"$error":"#NAME?"}},{"$f":"IF(INDEX(periode5,NEVAL,Nenfant)=\"C\",\"X\",\"\")","v":{"$error":"#NAME?"}},{"$f":"IF(INDEX(periode5,NEVAL,Nenfant)=\"B\",\"X\",\"\")","v":{"$error":"#NAME?"}},{"$f":"IF(INDEX(periode5,NEVAL,Nenfant)=\"A\",\"X\",\"\")","v":{"$error":"#NAME?"}},null,{"$f":"IF(INDEX(periode6,NEVAL,Nenfant)=\"D\",\"X\",\"\")","v":{"$error":"#NAME?"}},{"$f":"IF(INDEX(periode6,NEVAL,Nenfant)=\"C\",\"X\",\"\")","v":{"$error":"#NAME?"}},{"$f":"IF(INDEX(periode6,NEVAL,Nenfant)=\"B\",\"X\",\"\")","v":{"$error":"#NAME?"}},{"$f":"IF(INDEX(periode6,NEVAL,Nenfant)=\"A\",\"X\",\"\")","v":{"$error":"#NAME?"}}]
[43,{"$nulls":7},{"$f":"IF(INDEX(periode1,NEVAL,Nenfant)=\"D\",\"X\",\"\")","v":{"$error":"#NAME?"}},{"$f":"IF(INDEX(periode1,NEVAL,Nenfant)=\"C\",\"X\",\"\")","v":{"$error":"#NAME?"}},{"$f":"IF(INDEX(periode1,NEVAL,Nenfant)=\"B\",\"X\",\"\")","v":{"$error":"#NAME?"}},{"$f":"IF(INDEX(periode1,NEVAL,Nenfant)=\"A\",\"X\",\"\")","v":{"$error":"#NAME?"}},null,{"$f":"IF(INDEX(periode2,NEVAL,Nenfant)=\"D\",\"X\",\"\")","v":{"$error":"#NAME?"}},{"$f":"IF(INDEX(periode2,NEVAL,Nenfant)=\"C\",\"X\",\"\")","v":{"$error":"#NAME?"}},{"$f":"IF(INDEX(periode2,NEVAL,Nenfant)=\"B\",\"X\",\"\")","v":{"$error":"#NAME?"}},{"$f":"IF(INDEX(periode2,NEVAL,Nenfant)=\"A\",\"X\",\"\")","v":{"$error":"#NAME?"}},null,{"$f":"IF(INDEX(periode3,NEVAL,Nenfant)=\"D\",\"X\",\"\")","v":{"$error":"#NAME?"}},{"$f":"IF(INDEX(periode3,NEVAL,Nenfant)=\"C\",\"X\",\"\")","v":{"$error":"#NAME?"}},{"$f":"IF(INDEX(periode3,NEVAL,Nenfant)=\"B\",\"X\",\"\")","v":{"$error":"#NAME?"}},{"$f":"IF(INDEX(periode3,NEVAL,Nenfant)=\"A\",\"X\",\"\")","v":{"$error":"#NAME?"}},null,{"$f":"IF(INDEX(periode4,NEVAL,Nenfant)=\"D\",\"X\",\"\")","v":{"$error":"#NAME?"}},{"$f":"IF(INDEX(periode4,NEVAL,Nenfant)=\"C\",\"X\",\"\")","v":{"$error":"#NAME?"}},{"$f":"IF(INDEX(periode4,NEVAL,Nenfant)=\"B\",\"X\",\"\")","v":{"$error":"#NAME?"}},{"$f":"IF(INDEX(periode4,NEVAL,Nenfant)=\"A\",\"X\",\"\")","v":{"$error":"#NAME?"}},null,{"$f":"IF(INDEX(periode5,NEVAL,Nenfant)=\"D\",\"X\",\"\")","v":{"$error":"#NAME?"}},{"$f":"IF(INDEX(periode5,NEVAL,Nenfant)=\"C\",\"X\",\"\")","v":{"$error":"#NAME?"}},{"$f":"IF(INDEX(periode5,NEVAL,Nenfant)=\"B\",\"X\",\"\")","v":{"$error":"#NAME?"}},{"$f":"IF(INDEX(periode5,NEVAL,Nenfant)=\"A\",\"X\",\"\")","v":{"$error":"#NAME?"}},null,{"$f":"IF(INDEX(periode6,NEVAL,Nenfant)=\"D\",\"X\",\"\")","v":{"$error":"#NAME?"}},{"$f":"IF(INDEX(periode6,NEVAL,Nenfant)=\"C\",\"X\",\"\")","v":{"$error":"#NAME?"}},{"$f":"IF(INDEX(periode6,NEVAL,Nenfant)=\"B\",\"X\",\"\")","v":{"$error":"#NAME?"}},{"$f":"IF(INDEX(periode6,NEVAL,Nenfant)=\"A\",\"X\",\"\")","v":{"$error":"#NAME?"}}]
[44,{"$nulls":7},{"$f":"IF(INDEX(periode1,NEVAL,Nenfant)=\"D\",\"X\",\"\")","v":{"$error":"#NAME?"}},{"$f":"IF(INDEX(periode1,NEVAL,Nenfant)=\"C\",\"X\",\"\")","v":{"$error":"#NAME?"}},{"$f":"IF(INDEX(periode1,NEVAL,Nenfant)=\"B\",\"X\",\"\")","v":{"$error":"#NAME?"}},{"$f":"IF(INDEX(periode1,NEVAL,Nenfant)=\"A\",\"X\",\"\")","v":{"$error":"#NAME?"}},null,{"$f":"IF(INDEX(periode2,NEVAL,Nenfant)=\"D\",\"X\",\"\")","v":{"$error":"#NAME?"}},{"$f":"IF(INDEX(periode2,NEVAL,Nenfant)=\"C\",\"X\",\"\")","v":{"$error":"#NAME?"}},{"$f":"IF(INDEX(periode2,NEVAL,Nenfant)=\"B\",\"X\",\"\")","v":{"$error":"#NAME?"}},{"$f":"IF(INDEX(periode2,NEVAL,Nenfant)=\"A\",\"X\",\"\")","v":{"$error":"#NAME?"}},null,{"$f":"IF(INDEX(periode3,NEVAL,Nenfant)=\"D\",\"X\",\"\")","v":{"$error":"#NAME?"}},{"$f":"IF(INDEX(periode3,NEVAL,Nenfant)=\"C\",\"X\",\"\")","v":{"$error":"#NAME?"}},{"$f":"IF(INDEX(periode3,NEVAL,Nenfant)=\"B\",\"X\",\"\")","v":{"$error":"#NAME?"}},{"$f":"IF(INDEX(periode3,NEVAL,Nenfant)=\"A\",\"X\",\"\")","v":{"$error":"#NAME?"}},null,{"$f":"IF(INDEX(periode4,NEVAL,Nenfant)=\"D\",\"X\",\"\")","v":{"$error":"#NAME?"}},{"$f":"IF(INDEX(periode4,NEVAL,Nenfant)=\"C\",\"X\",\"\")","v":{"$error":"#NAME?"}},{"$f":"IF(INDEX(periode4,NEVAL,Nenfant)=\"B\",\"X\",\"\")","v":{"$error":"#NAME?"}},{"$f":"IF(INDEX(periode4,NEVAL,Nenfant)=\"A\",\"X\",\"\")","v":{"$error":"#NAME?"}},null,{"$f":"IF(INDEX(periode5,NEVAL,Nenfant)=\"D\",\"X\",\"\")","v":{"$error":"#NAME?"}},{"$f":"IF(INDEX(periode5,NEVAL,Nenfant)=\"C\",\"X\",\"\")","v":{"$error":"#NAME?"}},{"$f":"IF(INDEX(periode5,NEVAL,Nenfant)=\"B\",\"X\",\"\")","v":{"$error":"#NAME?"}},{"$f":"IF(INDEX(periode5,NEVAL,Nenfant)=\"A\",\"X\",\"\")","v":{"$error":"#NAME?"}},null,{"$f":"IF(INDEX(periode6,NEVAL,Nenfant)=\"D\",\"X\",\"\")","v":{"$error":"#NAME?"}},{"$f":"IF(INDEX(periode6,NEVAL,Nenfant)=\"C\",\"X\",\"\")","v":{"$error":"#NAME?"}},{"$f":"IF(INDEX(periode6,NEVAL,Nenfant)=\"B\",\"X\",\"\")","v":{"$error":"#NAME?"}},{"$f":"IF(INDEX(periode6,NEVAL,Nenfant)=\"A\",\"X\",\"\")","v":{"$error":"#NAME?"}}]
[45,{"$nulls":7},{"$f":"NB.S($G44:$G51,\"X\")","v":{"$error":"#NAME?"}},{"$f":"COUNTIF($H44:$H51,\"X\")","v":0},{"$f":"COUNTIF($I46:$I50,\"X\")","v":0},{"$f":"COUNTIF($J46:$J50,\"X\")","v":0},null,{"$f":"NB.S($G44:$G51,\"X\")","v":{"$error":"#NAME?"}},{"$f":"COUNTIF($H44:$H51,\"X\")","v":0},{"$f":"COUNTIF($I46:$I50,\"X\")","v":0},{"$f":"COUNTIF($J46:$J50,\"X\")","v":0},null,{"$f":"NB.S($G44:$G51,\"X\")","v":{"$error":"#NAME?"}},{"$f":"COUNTIF($H44:$H51,\"X\")","v":0},{"$f":"COUNTIF($I46:$I50,\"X\")","v":0},{"$f":"COUNTIF($J46:$J50,\"X\")","v":0},null,{"$f":"NB.S($G44:$G51,\"X\")","v":{"$error":"#NAME?"}},{"$f":"COUNTIF($H44:$H51,\"X\")","v":0},{"$f":"COUNTIF($I46:$I50,\"X\")","v":0},{"$f":"COUNTIF(AA46:AA50,\"X\")","v":0},null,{"$f":"NB.S($G44:$G51,\"X\")","v":{"$error":"#NAME?"}},{"$f":"COUNTIF($H44:$H51,\"X\")","v":0},{"$f":"COUNTIF($I46:$I50,\"X\")","v":0},{"$f":"COUNTIF($J46:$J50,\"X\")","v":0},null,{"$f":"NB.S($G44:$G51,\"X\")","v":{"$error":"#NAME?"}},{"$f":"COUNTIF($H44:$H51,\"X\")","v":0},{"$f":"COUNTIF($I46:$I50,\"X\")","v":0},{"$f":"COUNTIF($J46:$J50,\"X\")","v":0}]
[{"$nulls":8},{"$f":"IF(INDEX(periode1,NEVAL,Nenfant)=\"D\",\"X\",\"\")","v":{"$error":"#NAME?"}},{"$f":"IF(INDEX(periode1,NEVAL,Nenfant)=\"C\",\"X\",\"\")","v":{"$error":"#NAME?"}},{"$f":"IF(INDEX(periode1,NEVAL,Nenfant)=\"B\",\"X\",\"\")","v":{"$error":"#NAME?"}},{"$f":"IF(INDEX(periode1,NEVAL,Nenfant)=\"A\",\"X\",\"\")","v":{"$error":"#NAME?"}},null,{"$f":"IF(INDEX(periode2,NEVAL,Nenfant)=\"D\",\"X\",\"\")","v":{"$error":"#NAME?"}},{"$f":"IF(INDEX(periode2,NEVAL,Nenfant)=\"C\",\"X\",\"\")","v":{"$error":"#NAME?"}},{"$f":"IF(INDEX(periode2,NEVAL,Nenfant)=\"B\",\"X\",\"\")","v":{"$error":"#NAME?"}},{"$f":"IF(INDEX(periode2,NEVAL,Nenfant)=\"A\",\"X\",\"\")","v":{"$error":"#NAME?"}},null,{"$f":"IF(INDEX(periode3,NEVAL,Nenfant)=\"D\",\"X\",\"\")","v":{"$error":"#NAME?"}},{"$f":"IF(INDEX(periode3,NEVAL,Nenfant)=\"C\",\"X\",\"\")","v":{"$error":"#NAME?"}},{"$f":"IF(INDEX(periode3,NEVAL,Nenfant)=\"B\",\"X\",\"\")","v":{"$error":"#NAME?"}},{"$f":"IF(INDEX(periode3,NEVAL,Nenfant)=\"A\",\"X\",\"\")","v":{"$error":"#NAME?"}},null,{"$f":"IF(INDEX(periode4,NEVAL,Nenfant)=\"D\",\"X\",\"\")","v":{"$error":"#NAME?"}},{"$f":"IF(INDEX(periode4,NEVAL,Nenfant)=\"C\",\"X\",\"\")","v":{"$error":"#NAME?"}},{"$f":"IF(INDEX(periode4,NEVAL,Nenfant)=\"B\",\"X\",\"\")","v":{"$error":"#NAME?"}},{"$f":"IF(INDEX(periode4,NEVAL,Nenfant)=\"A\",\"X\",\"\")","v":{"$error":"#NAME?"}},null,{"$f":"IF(INDEX(periode5,NEVAL,Nenfant)=\"D\",\"X\",\"\")","v":{"$error":"#NAME?"}},{"$f":"IF(INDEX(periode5,NEVAL,Nenfant)=\"C\",\"X\",\"\")","v":{"$error":"#NAME?"}},{"$f":"IF(INDEX(periode5,NEVAL,Nenfant)=\"B\",\"X\",\"\")","v":{"$error":"#NAME?"}},{"$f":"IF(INDEX(periode5,NEVAL,Nenfant)=\"A\",\"X\",\"\")","v":{"$error":"#NAME?"}},null,{"$f":"IF(INDEX(periode6,NEVAL,Nenfant)=\"D\",\"X\",\"\")","v":{"$error":"#NAME?"}},{"$f":"IF(INDEX(periode6,NEVAL,Nenfant)=\"C\",\"X\",\"\")","v":{"$error":"#NAME?"}},{"$f":"IF(INDEX(periode6,NEVAL,Nenfant)=\"B\",\"X\",\"\")","v":{"$error":"#NAME?"}},{"$f":"IF(INDEX(periode6,NEVAL,Nenfant)=\"A\",\"X\",\"\")","v":{"$error":"#NAME?"}}]
[{"$nulls":8},{"$f":"IF(INDEX(periode1,NEVAL,Nenfant)=\"D\",\"X\",\"\")","v":{"$error":"#NAME?"}},{"$f":"IF(INDEX(periode1,NEVAL,Nenfant)=\"C\",\"X\",\"\")","v":{"$error":"#NAME?"}},{"$f":"IF(INDEX(periode1,NEVAL,Nenfant)=\"B\",\"X\",\"\")","v":{"$error":"#NAME?"}},{"$f":"IF(INDEX(periode1,NEVAL,Nenfant)=\"A\",\"X\",\"\")","v":{"$error":"#NAME?"}},null,{"$f":"IF(INDEX(periode2,NEVAL,Nenfant)=\"D\",\"X\",\"\")","v":{"$error":"#NAME?"}},{"$f":"IF(INDEX(periode2,NEVAL,Nenfant)=\"C\",\"X\",\"\")","v":{"$error":"#NAME?"}},{"$f":"IF(INDEX(periode2,NEVAL,Nenfant)=\"B\",\"X\",\"\")","v":{"$error":"#NAME?"}},{"$f":"IF(INDEX(periode2,NEVAL,Nenfant)=\"A\",\"X\",\"\")","v":{"$error":"#NAME?"}},null,{"$f":"IF(INDEX(periode3,NEVAL,Nenfant)=\"D\",\"X\",\"\")","v":{"$error":"#NAME?"}},{"$f":"IF(INDEX(periode3,NEVAL,Nenfant)=\"C\",\"X\",\"\")","v":{"$error":"#NAME?"}},{"$f":"IF(INDEX(periode3,NEVAL,Nenfant)=\"B\",\"X\",\"\")","v":{"$error":"#NAME?"}},{"$f":"IF(INDEX(periode3,NEVAL,Nenfant)=\"A\",\"X\",\"\")","v":{"$error":"#NAME?"}},null,{"$f":"IF(INDEX(periode4,NEVAL,Nenfant)=\"D\",\"X\",\"\")","v":{"$error":"#NAME?"}},{"$f":"IF(INDEX(periode4,NEVAL,Nenfant)=\"C\",\"X\",\"\")","v":{"$error":"#NAME?"}},{"$f":"IF(INDEX(periode4,NEVAL,Nenfant)=\"B\",\"X\",\"\")","v":{"$error":"#NAME?"}},{"$f":"IF(INDEX(periode4,NEVAL,Nenfant)=\"A\",\"X\",\"\")","v":{"$error":"#NAME?"}},null,{"$f":"IF(INDEX(periode5,NEVAL,Nenfant)=\"D\",\"X\",\"\")","v":{"$error":"#NAME?"}},{"$f":"IF(INDEX(periode5,NEVAL,Nenfant)=\"C\",\"X\",\"\")","v":{"$error":"#NAME?"}},{"$f":"IF(INDEX(periode5,NEVAL,Nenfant)=\"B\",\"X\",\"\")","v":{"$error":"#NAME?"}},{"$f":"IF(INDEX(periode5,NEVAL,Nenfant)=\"A\",\"X\",\"\")","v":{"$error":"#NAME?"}},null,{"$f":"IF(INDEX(periode6,NEVAL,Nenfant)=\"D\",\"X\",\"\")","v":{"$error":"#NAME?"}},{"$f":"IF(INDEX(periode6,NEVAL,Nenfant)=\"C\",\"X\",\"\")","v":{"$error":"#NAME?"}},{"$f":"IF(INDEX(periode6,NEVAL,Nenfant)=\"B\",\"X\",\"\")","v":{"$error":"#NAME?"}},{"$f":"IF(INDEX(periode6,NEVAL,Nenfant)=\"A\",\"X\",\"\")","v":{"$error":"#NAME?"}}]
[{"$nulls":8},{"$f":"IF(INDEX(periode1,NEVAL,Nenfant)=\"D\",\"X\",\"\")","v":{"$error":"#NAME?"}},{"$f":"IF(INDEX(periode1,NEVAL,Nenfant)=\"C\",\"X\",\"\")","v":{"$error":"#NAME?"}},{"$f":"IF(INDEX(periode1,NEVAL,Nenfant)=\"B\",\"X\",\"\")","v":{"$error":"#NAME?"}},{"$f":"IF(INDEX(periode1,NEVAL,Nenfant)=\"A\",\"X\",\"\")","v":{"$error":"#NAME?"}},null,{"$f":"IF(INDEX(periode2,NEVAL,Nenfant)=\"D\",\"X\",\"\")","v":{"$error":"#NAME?"}},{"$f":"IF(INDEX(periode2,NEVAL,Nenfant)=\"C\",\"X\",\"\")","v":{"$error":"#NAME?"}},{"$f":"IF(INDEX(periode2,NEVAL,Nenfant)=\"B\",\"X\",\"\")","v":{"$error":"#NAME?"}},{"$f":"IF(INDEX(periode2,NEVAL,Nenfant)=\"A\",\"X\",\"\")","v":{"$error":"#NAME?"}},null,{"$f":"IF(INDEX(periode3,NEVAL,Nenfant)=\"D\",\"X\",\"\")","v":{"$error":"#NAME?"}},{"$f":"IF(INDEX(periode3,NEVAL,Nenfant)=\"C\",\"X\",\"\")","v":{"$error":"#NAME?"}},{"$f":"IF(INDEX(periode3,NEVAL,Nenfant)=\"B\",\"X\",\"\")","v":{"$error":"#NAME?"}},{"$f":"IF(INDEX(periode3,NEVAL,Nenfant)=\"A\",\"X\",\"\")","v":{"$error":"#NAME?"}},null,{"$f":"IF(INDEX(periode4,NEVAL,Nenfant)=\"D\",\"X\",\"\")","v":{"$error":"#NAME?"}},{"$f":"IF(INDEX(periode4,NEVAL,Nenfant)=\"C\",\"X\",\"\")","v":{"$error":"#NAME?"}},{"$f":"IF(INDEX(periode4,NEVAL,Nenfant)=\"B\",\"X\",\"\")","v":{"$error":"#NAME?"}},{"$f":"IF(INDEX(periode4,NEVAL,Nenfant)=\"A\",\"X\",\"\")","v":{"$error":"#NAME?"}},null,{"$f":"IF(INDEX(periode5,NEVAL,Nenfant)=\"D\",\"X\",\"\")","v":{"$error":"#NAME?"}},{"$f":"IF(INDEX(periode5,NEVAL,Nenfant)=\"C\",\"X\",\"\")","v":{"$error":"#NAME?"}},{"$f":"IF(INDEX(periode5,NEVAL,Nenfant)=\"B\",\"X\",\"\")","v":{"$error":"#NAME?"}},{"$f":"IF(INDEX(periode5,NEVAL,Nenfant)=\"A\",\"X\",\"\")","v":{"$error":"#NAME?"}},null,{"$f":"IF(INDEX(periode6,NEVAL,Nenfant)=\"D\",\"X\",\"\")","v":{"$error":"#NAME?"}},{"$f":"IF(INDEX(periode6,NEVAL,Nenfant)=\"C\",\"X\",\"\")","v":{"$error":"#NAME?"}},{"$f":"IF(INDEX(periode6,NEVAL,Nenfant)=\"B\",\"X\",\"\")","v":{"$error":"#NAME?"}},{"$f":"IF(INDEX(periode6,NEVAL,Nenfant)=\"A\",\"X\",\"\")","v":{"$error":"#NAME?"}}]
[{"$nulls":8},{"$f":"IF(INDEX(periode1,NEVAL,Nenfant)=\"D\",\"X\",\"\")","v":{"$error":"#NAME?"}},{"$f":"IF(INDEX(periode1,NEVAL,Nenfant)=\"C\",\"X\",\"\")","v":{"$error":"#NAME?"}},{"$f":"IF(INDEX(periode1,NEVAL,Nenfant)=\"B\",\"X\",\"\")","v":{"$error":"#NAME?"}},{"$f":"IF(INDEX(periode1,NEVAL,Nenfant)=\"A\",\"X\",\"\")","v":{"$error":"#NAME?"}},null,{"$f":"IF(INDEX(periode2,NEVAL,Nenfant)=\"D\",\"X\",\"\")","v":{"$error":"#NAME?"}},{"$f":"IF(INDEX(periode2,NEVAL,Nenfant)=\"C\",\"X\",\"\")","v":{"$error":"#NAME?"}},{"$f":"IF(INDEX(periode2,NEVAL,Nenfant)=\"B\",\"X\",\"\")","v":{"$error":"#NAME?"}},{"$f":"IF(INDEX(periode2,NEVAL,Nenfant)=\"A\",\"X\",\"\")","v":{"$error":"#NAME?"}},null,{"$f":"IF(INDEX(periode3,NEVAL,Nenfant)=\"D\",\"X\",\"\")","v":{"$error":"#NAME?"}},{"$f":"IF(INDEX(periode3,NEVAL,Nenfant)=\"C\",\"X\",\"\")","v":{"$error":"#NAME?"}},{"$f":"IF(INDEX(periode3,NEVAL,Nenfant)=\"B\",\"X\",\"\")","v":{"$error":"#NAME?"}},{"$f":"IF(INDEX(periode3,NEVAL,Nenfant)=\"A\",\"X\",\"\")","v":{"$error":"#NAME?"}},null,{"$f":"IF(INDEX(periode4,NEVAL,Nenfant)=\"D\",\"X\",\"\")","v":{"$error":"#NAME?"}},{"$f":"IF(INDEX(periode4,NEVAL,Nenfant)=\"C\",\"X\",\"\")","v":{"$error":"#NAME?"}},{"$f":"IF(INDEX(periode4,NEVAL,Nenfant)=\"B\",\"X\",\"\")","v":{"$error":"#NAME?"}},{"$f":"IF(INDEX(periode4,NEVAL,Nenfant)=\"A\",\"X\",\"\")","v":{"$error":"#NAME?"}},null,{"$f":"IF(INDEX(periode5,NEVAL,Nenfant)=\"D\",\"X\",\"\")","v":{"$error":"#NAME?"}},{"$f":"IF(INDEX(periode5,NEVAL,Nenfant)=\"C\",\"X\",\"\")","v":{"$error":"#NAME?"}},{"$f":"IF(INDEX(periode5,NEVAL,Nenfant)=\"B\",\"X\",\"\")","v":{"$error":"#NAME?"}},{"$f":"IF(INDEX(periode5,NEVAL,Nenfant)=\"A\",\"X\",\"\")","v":{"$error":"#NAME?"}},null,{"$f":"IF(INDEX(periode6,NEVAL,Nenfant)=\"D\",\"X\",\"\")","v":{"$error":"#NAME?"}},{"$f":"IF(INDEX(periode6,NEVAL,Nenfant)=\"C\",\"X\",\"\")","v":{"$error":"#NAME?"}},{"$f":"IF(INDEX(periode6,NEVAL,Nenfant)=\"B\",\"X\",\"\")","v":{"$error":"#NAME?"}},{"$f":"IF(INDEX(periode6,NEVAL,Nenfant)=\"A\",\"X\",\"\")","v":{"$error":"#NAME?"}}]
[{"$nulls":8},{"$f":"IF(INDEX(periode1,NEVAL,Nenfant)=\"D\",\"X\",\"\")","v":{"$error":"#NAME?"}},{"$f":"IF(INDEX(periode1,NEVAL,Nenfant)=\"C\",\"X\",\"\")","v":{"$error":"#NAME?"}},{"$f":"IF(INDEX(periode1,NEVAL,Nenfant)=\"B\",\"X\",\"\")","v":{"$error":"#NAME?"}},{"$f":"IF(INDEX(periode1,NEVAL,Nenfant)=\"A\",\"X\",\"\")","v":{"$error":"#NAME?"}},null,{"$f":"IF(INDEX(periode2,NEVAL,Nenfant)=\"D\",\"X\",\"\")","v":{"$error":"#NAME?"}},{"$f":"IF(INDEX(periode2,NEVAL,Nenfant)=\"C\",\"X\",\"\")","v":{"$error":"#NAME?"}},{"$f":"IF(INDEX(periode2,NEVAL,Nenfant)=\"B\",\"X\",\"\")","v":{"$error":"#NAME?"}},{"$f":"IF(INDEX(periode2,NEVAL,Nenfant)=\"A\",\"X\",\"\")","v":{"$error":"#NAME?"}},null,{"$f":"IF(INDEX(periode3,NEVAL,Nenfant)=\"D\",\"X\",\"\")","v":{"$error":"#NAME?"}},{"$f":"IF(INDEX(periode3,NEVAL,Nenfant)=\"C\",\"X\",\"\")","v":{"$error":"#NAME?"}},{"$f":"IF(INDEX(periode3,NEVAL,Nenfant)=\"B\",\"X\",\"\")","v":{"$error":"#NAME?"}},{"$f":"IF(INDEX(periode3,NEVAL,Nenfant)=\"A\",\"X\",\"\")","v":{"$error":"#NAME?"}},null,{"$f":"IF(INDEX(periode4,NEVAL,Nenfant)=\"D\",\"X\",\"\")","v":{"$error":"#NAME?"}},{"$f":"IF(INDEX(periode4,NEVAL,Nenfant)=\"C\",\"X\",\"\")","v":{"$error":"#NAME?"}},{"$f":"IF(INDEX(periode4,NEVAL,Nenfant)=\"B\",\"X\",\"\")","v":{"$error":"#NAME?"}},{"$f":"IF(INDEX(periode4,NEVAL,Nenfant)=\"A\",\"X\",\"\")","v":{"$error":"#NAME?"}},null,{"$f":"IF(INDEX(periode5,NEVAL,Nenfant)=\"D\",\"X\",\"\")","v":{"$error":"#NAME?"}},{"$f":"IF(INDEX(periode5,NEVAL,Nenfant)=\"C\",\"X\",\"\")","v":{"$error":"#NAME?"}},{"$f":"IF(INDEX(periode5,NEVAL,Nenfant)=\"B\",\"X\",\"\")","v":{"$error":"#NAME?"}},{"$f":"IF(INDEX(periode5,NEVAL,Nenfant)=\"A\",\"X\",\"\")","v":{"$error":"#NAME?"}},null,{"$f":"IF(INDEX(periode6,NEVAL,Nenfant)=\"D\",\"X\",\"\")","v":{"$error":"#NAME?"}},{"$f":"IF(INDEX(periode6,NEVAL,Nenfant)=\"C\",\"X\",\"\")","v":{"$error":"#NAME?"}},{"$f":"IF(INDEX(periode6,NEVAL,Nenfant)=\"B\",\"X\",\"\")","v":{"$error":"#NAME?"}},{"$f":"IF(INDEX(periode6,NEVAL,Nenfant)=\"A\",\"X\",\"\")","v":{"$error":"#NAME?"}}]
[]
[46,{"$nulls":7},{"$f":"IF(INDEX(periode1,NEVAL,Nenfant)=\"D\",\"X\",\"\")","v":{"$error":"#NAME?"}},{"$f":"IF(INDEX(periode1,NEVAL,Nenfant)=\"C\",\"X\",\"\")","v":{"$error":"#NAME?"}},{"$f":"IF(INDEX(periode1,NEVAL,Nenfant)=\"B\",\"X\",\"\")","v":{"$error":"#NAME?"}},{"$f":"IF(INDEX(periode1,NEVAL,Nenfant)=\"A\",\"X\",\"\")","v":{"$error":"#NAME?"}},null,{"$f":"IF(INDEX(periode2,NEVAL,Nenfant)=\"D\",\"X\",\"\")","v":{"$error":"#NAME?"}},{"$f":"IF(INDEX(periode2,NEVAL,Nenfant)=\"C\",\"X\",\"\")","v":{"$error":"#NAME?"}},{"$f":"IF(INDEX(periode2,NEVAL,Nenfant)=\"B\",\"X\",\"\")","v":{"$error":"#NAME?"}},{"$f":"IF(INDEX(periode2,NEVAL,Nenfant)=\"A\",\"X\",\"\")","v":{"$error":"#NAME?"}},null,{"$f":"IF(INDEX(periode3,NEVAL,Nenfant)=\"D\",\"X\",\"\")","v":{"$error":"#NAME?"}},{"$f":"IF(INDEX(periode3,NEVAL,Nenfant)=\"C\",\"X\",\"\")","v":{"$error":"#NAME?"}},{"$f":"IF(INDEX(periode3,NEVAL,Nenfant)=\"B\",\"X\",\"\")","v":{"$error":"#NAME?"}},{"$f":"IF(INDEX(periode3,NEVAL,Nenfant)=\"A\",\"X\",\"\")","v":{"$error":"#NAME?"}},null,{"$f":"IF(INDEX(periode4,NEVAL,Nenfant)=\"D\",\"X\",\"\")","v":{"$error":"#NAME?"}},{"$f":"IF(INDEX(periode4,NEVAL,Nenfant)=\"C\",\"X\",\"\")","v":{"$error":"#NAME?"}},{"$f":"IF(INDEX(periode4,NEVAL,Nenfant)=\"B\",\"X\",\"\")","v":{"$error":"#NAME?"}},{"$f":"IF(INDEX(periode4,NEVAL,Nenfant)=\"A\",\"X\",\"\")","v":{"$error":"#NAME?"}},null,{"$f":"IF(INDEX(periode5,NEVAL,Nenfant)=\"D\",\"X\",\"\")","v":{"$error":"#NAME?"}},{"$f":"IF(INDEX(periode5,NEVAL,Nenfant)=\"C\",\"X\",\"\")","v":{"$error":"#NAME?"}},{"$f":"IF(INDEX(periode5,NEVAL,Nenfant)=\"B\",\"X\",\"\")","v":{"$error":"#NAME?"}},{"$f":"IF(INDEX(periode5,NEVAL,Nenfant)=\"A\",\"X\",\"\")","v":{"$error":"#NAME?"}},null,{"$f":"IF(INDEX(periode6,NEVAL,Nenfant)=\"D\",\"X\",\"\")","v":{"$error":"#NAME?"}},{"$f":"IF(INDEX(periode6,NEVAL,Nenfant)=\"C\",\"X\",\"\")","v":{"$error":"#NAME?"}},{"$f":"IF(INDEX(periode6,NEVAL,Nenfant)=\"B\",\"X\",\"\")","v":{"$error":"#NAME?"}},{"$f":"IF(INDEX(periode6,NEVAL,Nenfant)=\"A\",\"X\",\"\")","v":{"$error":"#NAME?"}}]
[47,{"$nulls":7},{"$f":"IF(INDEX(periode1,NEVAL,Nenfant)=\"D\",\"X\",\"\")","v":{"$error":"#NAME?"}},{"$f":"IF(INDEX(periode1,NEVAL,Nenfant)=\"C\",\"X\",\"\")","v":{"$error":"#NAME?"}},{"$f":"IF(INDEX(periode1,NEVAL,Nenfant)=\"B\",\"X\",\"\")","v":{"$error":"#NAME?"}},{"$f":"IF(INDEX(periode1,NEVAL,Nenfant)=\"A\",\"X\",\"\")","v":{"$error":"#NAME?"}},null,{"$f":"IF(INDEX(periode2,NEVAL,Nenfant)=\"D\",\"X\",\"\")","v":{"$error":"#NAME?"}},{"$f":"IF(INDEX(periode2,NEVAL,Nenfant)=\"C\",\"X\",\"\")","v":{"$error":"#NAME?"}},{"$f":"IF(INDEX(periode2,NEVAL,Nenfant)=\"B\",\"X\",\"\")","v":{"$error":"#NAME?"}},{"$f":"IF(INDEX(periode2,NEVAL,Nenfant)=\"A\",\"X\",\"\")","v":{"$error":"#NAME?"}},null,{"$f":"IF(INDEX(periode3,NEVAL,Nenfant)=\"D\",\"X\",\"\")","v":{"$error":"#NAME?"}},{"$f":"IF(INDEX(periode3,NEVAL,Nenfant)=\"C\",\"X\",\"\")","v":{"$error":"#NAME?"}},{"$f":"IF(INDEX(periode3,NEVAL,Nenfant)=\"B\",\"X\",\"\")","v":{"$error":"#NAME?"}},{"$f":"IF(INDEX(periode3,NEVAL,Nenfant)=\"A\",\"X\",\"\")","v":{"$error":"#NAME?"}},null,{"$f":"IF(INDEX(periode4,NEVAL,Nenfant)=\"D\",\"X\",\"\")","v":{"$error":"#NAME?"}},{"$f":"IF(INDEX(periode4,NEVAL,Nenfant)=\"C\",\"X\",\"\")","v":{"$error":"#NAME?"}},{"$f":"IF(INDEX(periode4,NEVAL,Nenfant)=\"B\",\"X\",\"\")","v":{"$error":"#NAME?"}},{"$f":"IF(INDEX(periode4,NEVAL,Nenfant)=\"A\",\"X\",\"\")","v":{"$error":"#NAME?"}},null,{"$f":"IF(INDEX(periode5,NEVAL,Nenfant)=\"D\",\"X\",\"\")","v":{"$error":"#NAME?"}},{"$f":"IF(INDEX(periode5,NEVAL,Nenfant)=\"C\",\"X\",\"\")","v":{"$error":"#NAME?"}},{"$f":"IF(INDEX(periode5,NEVAL,Nenfant)=\"B\",\"X\",\"\")","v":{"$error":"#NAME?"}},{"$f":"IF(INDEX(periode5,NEVAL,Nenfant)=\"A\",\"X\",\"\")","v":{"$error":"#NAME?"}},null,{"$f":"IF(INDEX(periode6,NEVAL,Nenfant)=\"D\",\"X\",\"\")","v":{"$error":"#NAME?"}},{"$f":"IF(INDEX(periode6,NEVAL,Nenfant)=\"C\",\"X\",\"\")","v":{"$error":"#NAME?"}},{"$f":"IF(INDEX(periode6,NEVAL,Nenfant)=\"B\",\"X\",\"\")","v":{"$error":"#NAME?"}},{"$f":"IF(INDEX(periode6,NEVAL,Nenfant)=\"A\",\"X\",\"\")","v":{"$error":"#NAME?"}}]
[48,{"$nulls":7},{"$f":"IF(INDEX(periode1,NEVAL,Nenfant)=\"D\",\"X\",\"\")","v":{"$error":"#NAME?"}},{"$f":"IF(INDEX(periode1,NEVAL,Nenfant)=\"C\",\"X\",\"\")","v":{"$error":"#NAME?"}},{"$f":"IF(INDEX(periode1,NEVAL,Nenfant)=\"B\",\"X\",\"\")","v":{"$error":"#NAME?"}},{"$f":"IF(INDEX(periode1,NEVAL,Nenfant)=\"A\",\"X\",\"\")","v":{"$error":"#NAME?"}},null,{"$f":"IF(INDEX(periode2,NEVAL,Nenfant)=\"D\",\"X\",\"\")","v":{"$error":"#NAME?"}},{"$f":"IF(INDEX(periode2,NEVAL,Nenfant)=\"C\",\"X\",\"\")","v":{"$error":"#NAME?"}},{"$f":"IF(INDEX(periode2,NEVAL,Nenfant)=\"B\",\"X\",\"\")","v":{"$error":"#NAME?"}},{"$f":"IF(INDEX(periode2,NEVAL,Nenfant)=\"A\",\"X\",\"\")","v":{"$error":"#NAME?"}},null,{"$f":"IF(INDEX(periode3,NEVAL,Nenfant)=\"D\",\"X\",\"\")","v":{"$error":"#NAME?"}},{"$f":"IF(INDEX(periode3,NEVAL,Nenfant)=\"C\",\"X\",\"\")","v":{"$error":"#NAME?"}},{"$f":"IF(INDEX(periode3,NEVAL,Nenfant)=\"B\",\"X\",\"\")","v":{"$error":"#NAME?"}},{"$f":"IF(INDEX(periode3,NEVAL,Nenfant)=\"A\",\"X\",\"\")","v":{"$error":"#NAME?"}},null,{"$f":"IF(INDEX(periode4,NEVAL,Nenfant)=\"D\",\"X\",\"\")","v":{"$error":"#NAME?"}},{"$f":"IF(INDEX(periode4,NEVAL,Nenfant)=\"C\",\"X\",\"\")","v":{"$error":"#NAME?"}},{"$f":"IF(INDEX(periode4,NEVAL,Nenfant)=\"B\",\"X\",\"\")","v":{"$error":"#NAME?"}},{"$f":"IF(INDEX(periode4,NEVAL,Nenfant)=\"A\",\"X\",\"\")","v":{"$error":"#NAME?"}},null,{"$f":"IF(INDEX(periode5,NEVAL,Nenfant)=\"D\",\"X\",\"\")","v":{"$error":"#NAME?"}},{"$f":"IF(INDEX(periode5,NEVAL,Nenfant)=\"C\",\"X\",\"\")","v":{"$error":"#NAME?"}},{"$f":"IF(INDEX(periode5,NEVAL,Nenfant)=\"B\",\"X\",\"\")","v":{"$error":"#NAME?"}},{"$f":"IF(INDEX(periode5,NEVAL,Nenfant)=\"A\",\"X\",\"\")","v":{"$error":"#NAME?"}},null,{"$f":"IF(INDEX(periode6,NEVAL,Nenfant)=\"D\",\"X\",\"\")","v":{"$error":"#NAME?"}},{"$f":"IF(INDEX(periode6,NEVAL,Nenfant)=\"C\",\"X\",\"\")","v":{"$error":"#NAME?"}},{"$f":"IF(INDEX(periode6,NEVAL,Nenfant)=\"B\",\"X\",\"\")","v":{"$error":"#NAME?"}},{"$f":"IF(INDEX(periode6,NEVAL,Nenfant)=\"A\",\"X\",\"\")","v":{"$error":"#NAME?"}}]
[49,{"$nulls":7},{"$f":"IF(INDEX(periode1,NEVAL,Nenfant)=\"D\",\"X\",\"\")","v":{"$error":"#NAME?"}},{"$f":"IF(INDEX(periode1,NEVAL,Nenfant)=\"C\",\"X\",\"\")","v":{"$error":"#NAME?"}},{"$f":"IF(INDEX(periode1,NEVAL,Nenfant)=\"B\",\"X\",\"\")","v":{"$error":"#NAME?"}},{"$f":"IF(INDEX(periode1,NEVAL,Nenfant)=\"A\",\"X\",\"\")","v":{"$error":"#NAME?"}},null,{"$f":"IF(INDEX(periode2,NEVAL,Nenfant)=\"D\",\"X\",\"\")","v":{"$error":"#NAME?"}},{"$f":"IF(INDEX(periode2,NEVAL,Nenfant)=\"C\",\"X\",\"\")","v":{"$error":"#NAME?"}},{"$f":"IF(INDEX(periode2,NEVAL,Nenfant)=\"B\",\"X\",\"\")","v":{"$error":"#NAME?"}},{"$f":"IF(INDEX(periode2,NEVAL,Nenfant)=\"A\",\"X\",\"\")","v":{"$error":"#NAME?"}},null,{"$f":"IF(INDEX(periode3,NEVAL,Nenfant)=\"D\",\"X\",\"\")","v":{"$error":"#NAME?"}},{"$f":"IF(INDEX(periode3,NEVAL,Nenfant)=\"C\",\"X\",\"\")","v":{"$error":"#NAME?"}},{"$f":"IF(INDEX(periode3,NEVAL,Nenfant)=\"B\",\"X\",\"\")","v":{"$error":"#NAME?"}},{"$f":"IF(INDEX(periode3,NEVAL,Nenfant)=\"A\",\"X\",\"\")","v":{"$error":"#NAME?"}},null,{"$f":"IF(INDEX(periode4,NEVAL,Nenfant)=\"D\",\"X\",\"\")","v":{"$error":"#NAME?"}},{"$f":"IF(INDEX(periode4,NEVAL,Nenfant)=\"C\",\"X\",\"\")","v":{"$error":"#NAME?"}},{"$f":"IF(INDEX(periode4,NEVAL,Nenfant)=\"B\",\"X\",\"\")","v":{"$error":"#NAME?"}},{"$f":"IF(INDEX(periode4,NEVAL,Nenfant)=\"A\",\"X\",\"\")","v":{"$error":"#NAME?"}},null,{"$f":"IF(INDEX(periode5,NEVAL,Nenfant)=\"D\",\"X\",\"\")","v":{"$error":"#NAME?"}},{"$f":"IF(INDEX(periode5,NEVAL,Nenfant)=\"C\",\"X\",\"\")","v":{"$error":"#NAME?"}},{"$f":"IF(INDEX(periode5,NEVAL,Nenfant)=\"B\",\"X\",\"\")","v":{"$error":"#NAME?"}},{"$f":"IF(INDEX(periode5,NEVAL,Nenfant)=\"A\",\"X\",\"\")","v":{"$error":"#NAME?"}},null,{"$f":"IF(INDEX(periode6,NEVAL,Nenfant)=\"D\",\"X\",\"\")","v":{"$error":"#NAME?"}},{"$f":"IF(INDEX(periode6,NEVAL,Nenfant)=\"C\",\"X\",\"\")","v":{"$error":"#NAME?"}},{"$f":"IF(INDEX(periode6,NEVAL,Nenfant)=\"B\",\"X\",\"\")","v":{"$error":"#NAME?"}},{"$f":"IF(INDEX(periode6,NEVAL,Nenfant)=\"A\",\"X\",\"\")","v":{"$error":"#NAME?"}}]
[50,{"$nulls":7},{"$f":"COUNTIF($G58:$G59,\"X\")","v":0},{"$f":"COUNTIF($H58:$H59,\"X\")","v":0},{"$f":"COUNTIF($I57:$I60,\"X\")","v":0},{"$f":"COUNTIF($J57:$J60,\"X\")","v":0},null,{"$f":"COUNTIF($G58:$G59,\"X\")","v":0},{"$f":"COUNTIF($H58:$H59,\"X\")","v":0},{"$f":"COUNTIF($I57:$I60,\"X\")","v":0},{"$f":"COUNTIF($J57:$J60,\"X\")","v":0},null,{"$f":"COUNTIF($G58:$G59,\"X\")","v":0},{"$f":"COUNTIF($H58:$H59,\"X\")","v":0},{"$f":"COUNTIF($I57:$I60,\"X\")","v":0},{"$f":"COUNTIF($J57:$J60,\"X\")","v":0},null,{"$f":"COUNTIF($G58:$G59,\"X\")","v":0},{"$f":"COUNTIF($H58:$H59,\"X\")","v":0},{"$f":"COUNTIF($I57:$I60,\"X\")","v":0},{"$f":"COUNTIF(AA57:AA60,\"X\")","v":0},null,{"$f":"COUNTIF($G58:$G59,\"X\")","v":0},{"$f":"COUNTIF($H58:$H59,\"X\")","v":0},{"$f":"COUNTIF($I57:$I60,\"X\")","v":0},{"$f":"COUNTIF($J57:$J60,\"X\")","v":0},null,{"$f":"COUNTIF($G58:$G59,\"X\")","v":0},{"$f":"COUNTIF($H58:$H59,\"X\")","v":0},{"$f":"COUNTIF($I57:$I60,\"X\")","v":0},{"$f":"COUNTIF($J57:$J60,\"X\")","v":0}]
[51,{"$nulls":7},{"$f":"IF(INDEX(periode1,NEVAL,Nenfant)=\"D\",\"X\",\"\")","v":{"$error":"#NAME?"}},{"$f":"IF(INDEX(periode1,NEVAL,Nenfant)=\"C\",\"X\",\"\")","v":{"$error":"#NAME?"}},{"$f":"IF(INDEX(periode1,NEVAL,Nenfant)=\"B\",\"X\",\"\")","v":{"$error":"#NAME?"}},{"$f":"IF(INDEX(periode1,NEVAL,Nenfant)=\"A\",\"X\",\"\")","v":{"$error":"#NAME?"}},null,{"$f":"IF(INDEX(periode2,NEVAL,Nenfant)=\"D\",\"X\",\"\")","v":{"$error":"#NAME?"}},{"$f":"IF(INDEX(periode2,NEVAL,Nenfant)=\"C\",\"X\",\"\")","v":{"$error":"#NAME?"}},{"$f":"IF(INDEX(periode2,NEVAL,Nenfant)=\"B\",\"X\",\"\")","v":{"$error":"#NAME?"}},{"$f":"IF(INDEX(periode2,NEVAL,Nenfant)=\"A\",\"X\",\"\")","v":{"$error":"#NAME?"}},null,{"$f":"IF(INDEX(periode3,NEVAL,Nenfant)=\"D\",\"X\",\"\")","v":{"$error":"#NAME?"}},{"$f":"IF(INDEX(periode3,NEVAL,Nenfant)=\"C\",\"X\",\"\")","v":{"$error":"#NAME?"}},{"$f":"IF(INDEX(periode3,NEVAL,Nenfant)=\"B\",\"X\",\"\")","v":{"$error":"#NAME?"}},{"$f":"IF(INDEX(periode3,NEVAL,Nenfant)=\"A\",\"X\",\"\")","v":{"$error":"#NAME?"}},null,{"$f":"IF(INDEX(periode4,NEVAL,Nenfant)=\"D\",\"X\",\"\")","v":{"$error":"#NAME?"}},{"$f":"IF(INDEX(periode4,NEVAL,Nenfant)=\"C\",\"X\",\"\")","v":{"$error":"#NAME?"}},{"$f":"IF(INDEX(periode4,NEVAL,Nenfant)=\"B\",\"X\",\"\")","v":{"$error":"#NAME?"}},{"$f":"IF(INDEX(periode4,NEVAL,Nenfant)=\"A\",\"X\",\"\")","v":{"$error":"#NAME?"}},null,{"$f":"IF(INDEX(periode5,NEVAL,Nenfant)=\"D\",\"X\",\"\")","v":{"$error":"#NAME?"}},{"$f":"IF(INDEX(periode5,NEVAL,Nenfant)=\"C\",\"X\",\"\")","v":{"$error":"#NAME?"}},{"$f":"IF(INDEX(periode5,NEVAL,Nenfant)=\"B\",\"X\",\"\")","v":{"$error":"#NAME?"}},{"$f":"IF(INDEX(periode5,NEVAL,Nenfant)=\"A\",\"X\",\"\")","v":{"$error":"#NAME?"}},null,{"$f":"IF(INDEX(periode6,NEVAL,Nenfant)=\"D\",\"X\",\"\")","v":{"$error":"#NAME?"}},{"$f":"IF(INDEX(periode6,NEVAL,Nenfant)=\"C\",\"X\",\"\")","v":{"$error":"#NAME?"}},{"$f":"IF(INDEX(periode6,NEVAL,Nenfant)=\"B\",\"X\",\"\")","v":{"$error":"#NAME?"}},{"$f":"IF(INDEX(periode6,NEVAL,Nenfant)=\"A\",\"X\",\"\")","v":{"$error":"#NAME?"}}]
[52,{"$nulls":7},{"$f":"IF(INDEX(periode1,NEVAL,Nenfant)=\"D\",\"X\",\"\")","v":{"$error":"#NAME?"}},{"$f":"IF(INDEX(periode1,NEVAL,Nenfant)=\"C\",\"X\",\"\")","v":{"$error":"#NAME?"}},{"$f":"IF(INDEX(periode1,NEVAL,Nenfant)=\"B\",\"X\",\"\")","v":{"$error":"#NAME?"}},{"$f":"IF(INDEX(periode1,NEVAL,Nenfant)=\"A\",\"X\",\"\")","v":{"$error":"#NAME?"}},null,{"$f":"IF(INDEX(periode2,NEVAL,Nenfant)=\"D\",\"X\",\"\")","v":{"$error":"#NAME?"}},{"$f":"IF(INDEX(periode2,NEVAL,Nenfant)=\"C\",\"X\",\"\")","v":{"$error":"#NAME?"}},{"$f":"IF(INDEX(periode2,NEVAL,Nenfant)=\"B\",\"X\",\"\")","v":{"$error":"#NAME?"}},{"$f":"IF(INDEX(periode2,NEVAL,Nenfant)=\"A\",\"X\",\"\")","v":{"$error":"#NAME?"}},null,{"$f":"IF(INDEX(periode3,NEVAL,Nenfant)=\"D\",\"X\",\"\")","v":{"$error":"#NAME?"}},{"$f":"IF(INDEX(periode3,NEVAL,Nenfant)=\"C\",\"X\",\"\")","v":{"$error":"#NAME?"}},{"$f":"IF(INDEX(periode3,NEVAL,Nenfant)=\"B\",\"X\",\"\")","v":{"$error":"#NAME?"}},{"$f":"IF(INDEX(periode3,NEVAL,Nenfant)=\"A\",\"X\",\"\")","v":{"$error":"#NAME?"}},null,{"$f":"IF(INDEX(periode4,NEVAL,Nenfant)=\"D\",\"X\",\"\")","v":{"$error":"#NAME?"}},{"$f":"IF(INDEX(periode4,NEVAL,Nenfant)=\"C\",\"X\",\"\")","v":{"$error":"#NAME?"}},{"$f":"IF(INDEX(periode4,NEVAL,Nenfant)=\"B\",\"X\",\"\")","v":{"$error":"#NAME?"}},{"$f":"IF(INDEX(periode4,NEVAL,Nenfant)=\"A\",\"X\",\"\")","v":{"$error":"#NAME?"}},null,{"$f":"IF(INDEX(periode5,NEVAL,Nenfant)=\"D\",\"X\",\"\")","v":{"$error":"#NAME?"}},{"$f":"IF(INDEX(periode5,NEVAL,Nenfant)=\"C\",\"X\",\"\")","v":{"$error":"#NAME?"}},{"$f":"IF(INDEX(periode5,NEVAL,Nenfant)=\"B\",\"X\",\"\")","v":{"$error":"#NAME?"}},{"$f":"IF(INDEX(periode5,NEVAL,Nenfant)=\"A\",\"X\",\"\")","v":{"$error":"#NAME?"}},null,{"$f":"IF(INDEX(periode6,NEVAL,Nenfant)=\"D\",\"X\",\"\")","v":{"$error":"#NAME?"}},{"$f":"IF(INDEX(periode6,NEVAL,Nenfant)=\"C\",\"X\",\"\")","v":{"$error":"#NAME?"}},{"$f":"IF(INDEX(periode6,NEVAL,Nenfant)=\"B\",\"X\",\"\")","v":{"$error":"#NAME?"}},{"$f":"IF(INDEX(periode6,NEVAL,Nenfant)=\"A\",\"X\",\"\")","v":{"$error":"#NAME?"}}]
[53,{"$nulls":7},{"$f":"IF(INDEX(periode1,NEVAL,Nenfant)=\"D\",\"X\",\"\")","v":{"$error":"#NAME?"}},{"$f":"IF(INDEX(periode1,NEVAL,Nenfant)=\"C\",\"X\",\"\")","v":{"$error":"#NAME?"}},{"$f":"IF(INDEX(periode1,NEVAL,Nenfant)=\"B\",\"X\",\"\")","v":{"$error":"#NAME?"}},{"$f":"IF(INDEX(periode1,NEVAL,Nenfant)=\"A\",\"X\",\"\")","v":{"$error":"#NAME?"}},null,{"$f":"IF(INDEX(periode2,NEVAL,Nenfant)=\"D\",\"X\",\"\")","v":{"$error":"#NAME?"}},{"$f":"IF(INDEX(periode2,NEVAL,Nenfant)=\"C\",\"X\",\"\")","v":{"$error":"#NAME?"}},{"$f":"IF(INDEX(periode2,NEVAL,Nenfant)=\"B\",\"X\",\"\")","v":{"$error":"#NAME?"}},{"$f":"IF(INDEX(periode2,NEVAL,Nenfant)=\"A\",\"X\",\"\")","v":{"$error":"#NAME?"}},null,{"$f":"IF(INDEX(periode3,NEVAL,Nenfant)=\"D\",\"X\",\"\")","v":{"$error":"#NAME?"}},{"$f":"IF(INDEX(periode3,NEVAL,Nenfant)=\"C\",\"X\",\"\")","v":{"$error":"#NAME?"}},{"$f":"IF(INDEX(periode3,NEVAL,Nenfant)=\"B\",\"X\",\"\")","v":{"$error":"#NAME?"}},{"$f":"IF(INDEX(periode3,NEVAL,Nenfant)=\"A\",\"X\",\"\")","v":{"$error":"#NAME?"}},null,{"$f":"IF(INDEX(periode4,NEVAL,Nenfant)=\"D\",\"X\",\"\")","v":{"$error":"#NAME?"}},{"$f":"IF(INDEX(periode4,NEVAL,Nenfant)=\"C\",\"X\",\"\")","v":{"$error":"#NAME?"}},{"$f":"IF(INDEX(periode4,NEVAL,Nenfant)=\"B\",\"X\",\"\")","v":{"$error":"#NAME?"}},{"$f":"IF(INDEX(periode4,NEVAL,Nenfant)=\"A\",\"X\",\"\")","v":{"$error":"#NAME?"}},null,{"$f":"IF(INDEX(periode5,NEVAL,Nenfant)=\"D\",\"X\",\"\")","v":{"$error":"#NAME?"}},{"$f":"IF(INDEX(periode5,NEVAL,Nenfant)=\"C\",\"X\",\"\")","v":{"$error":"#NAME?"}},{"$f":"IF(INDEX(periode5,NEVAL,Nenfant)=\"B\",\"X\",\"\")","v":{"$error":"#NAME?"}},{"$f":"IF(INDEX(periode5,NEVAL,Nenfant)=\"A\",\"X\",\"\")","v":{"$error":"#NAME?"}},null,{"$f":"IF(INDEX(periode6,NEVAL,Nenfant)=\"D\",\"X\",\"\")","v":{"$error":"#NAME?"}},{"$f":"IF(INDEX(periode6,NEVAL,Nenfant)=\"C\",\"X\",\"\")","v":{"$error":"#NAME?"}},{"$f":"IF(INDEX(periode6,NEVAL,Nenfant)=\"B\",\"X\",\"\")","v":{"$error":"#NAME?"}},{"$f":"IF(INDEX(periode6,NEVAL,Nenfant)=\"A\",\"X\",\"\")","v":{"$error":"#NAME?"}}]
[54,{"$nulls":7},{"$f":"IF(INDEX(periode1,NEVAL,Nenfant)=\"D\",\"X\",\"\")","v":{"$error":"#NAME?"}},{"$f":"IF(INDEX(periode1,NEVAL,Nenfant)=\"C\",\"X\",\"\")","v":{"$error":"#NAME?"}},{"$f":"IF(INDEX(periode1,NEVAL,Nenfant)=\"B\",\"X\",\"\")","v":{"$error":"#NAME?"}},{"$f":"IF(INDEX(periode1,NEVAL,Nenfant)=\"A\",\"X\",\"\")","v":{"$error":"#NAME?"}},null,{"$f":"IF(INDEX(periode2,NEVAL,Nenfant)=\"D\",\"X\",\"\")","v":{"$error":"#NAME?"}},{"$f":"IF(INDEX(periode2,NEVAL,Nenfant)=\"C\",\"X\",\"\")","v":{"$error":"#NAME?"}},{"$f":"IF(INDEX(periode2,NEVAL,Nenfant)=\"B\",\"X\",\"\")","v":{"$error":"#NAME?"}},{"$f":"IF(INDEX(periode2,NEVAL,Nenfant)=\"A\",\"X\",\"\")","v":{"$error":"#NAME?"}},null,{"$f":"IF(INDEX(periode3,NEVAL,Nenfant)=\"D\",\"X\",\"\")","v":{"$error":"#NAME?"}},{"$f":"IF(INDEX(periode3,NEVAL,Nenfant)=\"C\",\"X\",\"\")","v":{"$error":"#NAME?"}},{"$f":"IF(INDEX(periode3,NEVAL,Nenfant)=\"B\",\"X\",\"\")","v":{"$error":"#NAME?"}},{"$f":"IF(INDEX(periode3,NEVAL,Nenfant)=\"A\",\"X\",\"\")","v":{"$error":"#NAME?"}},null,{"$f":"IF(INDEX(periode4,NEVAL,Nenfant)=\"D\",\"X\",\"\")","v":{"$error":"#NAME?"}},{"$f":"IF(INDEX(periode4,NEVAL,Nenfant)=\"C\",\"X\",\"\")","v":{"$error":"#NAME?"}},{"$f":"IF(INDEX(periode4,NEVAL,Nenfant)=\"B\",\"X\",\"\")","v":{"$error":"#NAME?"}},{"$f":"IF(INDEX(periode4,NEVAL,Nenfant)=\"A\",\"X\",\"\")","v":{"$error":"#NAME?"}},null,{"$f":"IF(INDEX(periode5,NEVAL,Nenfant)=\"D\",\"X\",\"\")","v":{"$error":"#NAME?"}},{"$f":"IF(INDEX(periode5,NEVAL,Nenfant)=\"C\",\"X\",\"\")","v":{"$error":"#NAME?"}},{"$f":"IF(INDEX(periode5,NEVAL,Nenfant)=\"B\",\"X\",\"\")","v":{"$error":"#NAME?"}},{"$f":"IF(INDEX(periode5,NEVAL,Nenfant)=\"A\",\"X\",\"\")","v":{"$error":"#NAME?"}},null,{"$f":"IF(INDEX(periode6,NEVAL,Nenfant)=\"D\",\"X\",\"\")","v":{"$error":"#NAME?"}},{"$f":"IF(INDEX(periode6,NEVAL,Nenfant)=\"C\",\"X\",\"\")","v":{"$error":"#NAME?"}},{"$f":"IF(INDEX(periode6,NEVAL,Nenfant)=\"B\",\"X\",\"\")","v":{"$error":"#NAME?"}},{"$f":"IF(INDEX(periode6,NEVAL,Nenfant)=\"A\",\"X\",\"\")","v":{"$error":"#NAME?"}}]
[55,{"$nulls":7},{"$f":"COUNTIF($G61:$G63,\"X\")","v":0},{"$f":"COUNTIF($H61:$H63,\"X\")","v":0},{"$f":"COUNTIF($I62:$I63,\"X\")","v":0},{"$f":"COUNTIF($J62:$J63,\"X\")","v":0},null,{"$f":"COUNTIF($G61:$G63,\"X\")","v":0},{"$f":"COUNTIF($H61:$H63,\"X\")","v":0},{"$f":"COUNTIF($I62:$I63,\"X\")","v":0},{"$f":"COUNTIF($J62:$J63,\"X\")","v":0},null,{"$f":"COUNTIF($G61:$G63,\"X\")","v":0},{"$f":"COUNTIF($H61:$H63,\"X\")","v":0},{"$f":"COUNTIF($I62:$I63,\"X\")","v":0},{"$f":"COUNTIF($J62:$J63,\"X\")","v":0},null,{"$f":"COUNTIF($G61:$G63,\"X\")","v":0},{"$f":"COUNTIF($H61:$H63,\"X\")","v":0},{"$f":"COUNTIF($I62:$I63,\"X\")","v":0},{"$f":"COUNTIF(AA62:AA63,\"X\")","v":0},null,{"$f":"COUNTIF($G61:$G63,\"X\")","v":0},{"$f":"COUNTIF($H61:$H63,\"X\")","v":0},{"$f":"COUNTIF($I62:$I63,\"X\")","v":0},{"$f":"COUNTIF($J62:$J63,\"X\")","v":0},null,{"$f":"COUNTIF($G61:$G63,\"X\")","v":0},{"$f":"COUNTIF($H61:$H63,\"X\")","v":0},{"$f":"COUNTIF($I62:$I63,\"X\")","v":0},{"$f":"COUNTIF($J62:$J63,\"X\")","v":0}]
[56,{"$nulls":7},{"$f":"IF(INDEX(periode1,NEVAL,Nenfant)=\"D\",\"X\",\"\")","v":{"$error":"#NAME?"}},{"$f":"IF(INDEX(periode1,NEVAL,Nenfant)=\"C\",\"X\",\"\")","v":{"$error":"#NAME?"}},{"$f":"IF(INDEX(periode1,NEVAL,Nenfant)=\"B\",\"X\",\"\")","v":{"$error":"#NAME?"}},{"$f":"IF(INDEX(periode1,NEVAL,Nenfant)=\"A\",\"X\",\"\")","v":{"$error":"#NAME?"}},null,{"$f":"IF(INDEX(periode2,NEVAL,Nenfant)=\"D\",\"X\",\"\")","v":{"$error":"#NAME?"}},{"$f":"IF(INDEX(periode2,NEVAL,Nenfant)=\"C\",\"X\",\"\")","v":{"$error":"#NAME?"}},{"$f":"IF(INDEX(periode2,NEVAL,Nenfant)=\"B\",\"X\",\"\")","v":{"$error":"#NAME?"}},{"$f":"IF(INDEX(periode2,NEVAL,Nenfant)=\"A\",\"X\",\"\")","v":{"$error":"#NAME?"}},null,{"$f":"IF(INDEX(periode3,NEVAL,Nenfant)=\"D\",\"X\",\"\")","v":{"$error":"#NAME?"}},{"$f":"IF(INDEX(periode3,NEVAL,Nenfant)=\"C\",\"X\",\"\")","v":{"$error":"#NAME?"}},{"$f":"IF(INDEX(periode3,NEVAL,Nenfant)=\"B\",\"X\",\"\")","v":{"$error":"#NAME?"}},{"$f":"IF(INDEX(periode3,NEVAL,Nenfant)=\"A\",\"X\",\"\")","v":{"$error":"#NAME?"}},null,{"$f":"IF(INDEX(periode4,NEVAL,Nenfant)=\"D\",\"X\",\"\")","v":{"$error":"#NAME?"}},{"$f":"IF(INDEX(periode4,NEVAL,Nenfant)=\"C\",\"X\",\"\")","v":{"$error":"#NAME?"}},{"$f":"IF(INDEX(periode4,NEVAL,Nenfant)=\"B\",\"X\",\"\")","v":{"$error":"#NAME?"}},{"$f":"IF(INDEX(periode4,NEVAL,Nenfant)=\"A\",\"X\",\"\")","v":{"$error":"#NAME?"}},null,{"$f":"IF(INDEX(periode5,NEVAL,Nenfant)=\"D\",\"X\",\"\")","v":{"$error":"#NAME?"}},{"$f":"IF(INDEX(periode5,NEVAL,Nenfant)=\"C\",\"X\",\"\")","v":{"$error":"#NAME?"}},{"$f":"IF(INDEX(periode5,NEVAL,Nenfant)=\"B\",\"X\",\"\")","v":{"$error":"#NAME?"}},{"$f":"IF(INDEX(periode5,NEVAL,Nenfant)=\"A\",\"X\",\"\")","v":{"$error":"#NAME?"}},null,{"$f":"IF(INDEX(periode6,NEVAL,Nenfant)=\"D\",\"X\",\"\")","v":{"$error":"#NAME?"}},{"$f":"IF(INDEX(periode6,NEVAL,Nenfant)=\"C\",\"X\",\"\")","v":{"$error":"#NAME?"}},{"$f":"IF(INDEX(periode6,NEVAL,Nenfant)=\"B\",\"X\",\"\")","v":{"$error":"#NAME?"}},{"$f":"IF(INDEX(periode6,NEVAL,Nenfant)=\"A\",\"X\",\"\")","v":{"$error":"#NAME?"}}]
[57,{"$nulls":7},{"$f":"IF(INDEX(periode1,NEVAL,Nenfant)=\"D\",\"X\",\"\")","v":{"$error":"#NAME?"}},{"$f":"IF(INDEX(periode1,NEVAL,Nenfant)=\"C\",\"X\",\"\")","v":{"$error":"#NAME?"}},{"$f":"IF(INDEX(periode1,NEVAL,Nenfant)=\"B\",\"X\",\"\")","v":{"$error":"#NAME?"}},{"$f":"IF(INDEX(periode1,NEVAL,Nenfant)=\"A\",\"X\",\"\")","v":{"$error":"#NAME?"}},null,{"$f":"IF(INDEX(periode2,NEVAL,Nenfant)=\"D\",\"X\",\"\")","v":{"$error":"#NAME?"}},{"$f":"IF(INDEX(periode2,NEVAL,Nenfant)=\"C\",\"X\",\"\")","v":{"$error":"#NAME?"}},{"$f":"IF(INDEX(periode2,NEVAL,Nenfant)=\"B\",\"X\",\"\")","v":{"$error":"#NAME?"}},{"$f":"IF(INDEX(periode2,NEVAL,Nenfant)=\"A\",\"X\",\"\")","v":{"$error":"#NAME?"}},null,{"$f":"IF(INDEX(periode3,NEVAL,Nenfant)=\"D\",\"X\",\"\")","v":{"$error":"#NAME?"}},{"$f":"IF(INDEX(periode3,NEVAL,Nenfant)=\"C\",\"X\",\"\")","v":{"$error":"#NAME?"}},{"$f":"IF(INDEX(periode3,NEVAL,Nenfant)=\"B\",\"X\",\"\")","v":{"$error":"#NAME?"}},{"$f":"IF(INDEX(periode3,NEVAL,Nenfant)=\"A\",\"X\",\"\")","v":{"$error":"#NAME?"}},null,{"$f":"IF(INDEX(periode4,NEVAL,Nenfant)=\"D\",\"X\",\"\")","v":{"$error":"#NAME?"}},{"$f":"IF(INDEX(periode4,NEVAL,Nenfant)=\"C\",\"X\",\"\")","v":{"$error":"#NAME?"}},{"$f":"IF(INDEX(periode4,NEVAL,Nenfant)=\"B\",\"X\",\"\")","v":{"$error":"#NAME?"}},{"$f":"IF(INDEX(periode4,NEVAL,Nenfant)=\"A\",\"X\",\"\")","v":{"$error":"#NAME?"}},null,{"$f":"IF(INDEX(periode5,NEVAL,Nenfant)=\"D\",\"X\",\"\")","v":{"$error":"#NAME?"}},{"$f":"IF(INDEX(periode5,NEVAL,Nenfant)=\"C\",\"X\",\"\")","v":{"$error":"#NAME?"}},{"$f":"IF(INDEX(periode5,NEVAL,Nenfant)=\"B\",\"X\",\"\")","v":{"$error":"#NAME?"}},{"$f":"IF(INDEX(periode5,NEVAL,Nenfant)=\"A\",\"X\",\"\")","v":{"$error":"#NAME?"}},null,{"$f":"IF(INDEX(periode6,NEVAL,Nenfant)=\"D\",\"X\",\"\")","v":{"$error":"#NAME?"}},{"$f":"IF(INDEX(periode6,NEVAL,Nenfant)=\"C\",\"X\",\"\")","v":{"$error":"#NAME?"}},{"$f":"IF(INDEX(periode6,NEVAL,Nenfant)=\"B\",\"X\",\"\")","v":{"$error":"#NAME?"}},{"$f":"IF(INDEX(periode6,NEVAL,Nenfant)=\"A\",\"X\",\"\")","v":{"$error":"#NAME?"}}]
[58,{"$nulls":7},{"$f":"COUNTIF($G65:$G68,\"X\")","v":0},{"$f":"COUNTIF($H65:$H68,\"X\")","v":0},{"$f":"COUNTIF($I65:$I69,\"X\")","v":0},{"$f":"COUNTIF($J65:$J69,\"X\")","v":0},null,{"$f":"COUNTIF($G65:$G68,\"X\")","v":0},{"$f":"COUNTIF($H65:$H68,\"X\")","v":0},{"$f":"COUNTIF($I65:$I69,\"X\")","v":0},{"$f":"COUNTIF($J65:$J69,\"X\")","v":0},null,{"$f":"COUNTIF($G65:$G68,\"X\")","v":0},{"$f":"COUNTIF($H65:$H68,\"X\")","v":0},{"$f":"COUNTIF($I65:$I69,\"X\")","v":0},{"$f":"COUNTIF($J65:$J69,\"X\")","v":0},null,{"$f":"COUNTIF($G65:$G68,\"X\")","v":0},{"$f":"COUNTIF($H65:$H68,\"X\")","v":0},{"$f":"COUNTIF($I65:$I69,\"X\")","v":0},{"$f":"COUNTIF(AA65:AA69,\"X\")","v":0},null,{"$f":"COUNTIF($G65:$G68,\"X\")","v":0},{"$f":"COUNTIF($H65:$H68,\"X\")","v":0},{"$f":"COUNTIF($I65:$I69,\"X\")","v":0},{"$f":"COUNTIF($J65:$J69,\"X\")","v":0},null,{"$f":"COUNTIF($G65:$G68,\"X\")","v":0},{"$f":"COUNTIF($H65:$H68,\"X\")","v":0},{"$f":"COUNTIF($I65:$I69,\"X\")","v":0},{"$f":"COUNTIF($J65:$J69,\"X\")","v":0}]
[59,{"$nulls":7},{"$f":"IF(INDEX(periode1,NEVAL,Nenfant)=\"D\",\"X\",\"\")","v":{"$error":"#NAME?"}},{"$f":"IF(INDEX(periode1,NEVAL,Nenfant)=\"C\",\"X\",\"\")","v":{"$error":"#NAME?"}},{"$f":"IF(INDEX(periode1,NEVAL,Nenfant)=\"B\",\"X\",\"\")","v":{"$error":"#NAME?"}},{"$f":"IF(INDEX(periode1,NEVAL,Nenfant)=\"A\",\"X\",\"\")","v":{"$error":"#NAME?"}},null,{"$f":"IF(INDEX(periode2,NEVAL,Nenfant)=\"D\",\"X\",\"\")","v":{"$error":"#NAME?"}},{"$f":"IF(INDEX(periode2,NEVAL,Nenfant)=\"C\",\"X\",\"\")","v":{"$error":"#NAME?"}},{"$f":"IF(INDEX(periode2,NEVAL,Nenfant)=\"B\",\"X\",\"\")","v":{"$error":"#NAME?"}},{"$f":"IF(INDEX(periode2,NEVAL,Nenfant)=\"A\",\"X\",\"\")","v":{"$error":"#NAME?"}},null,{"$f":"IF(INDEX(periode3,NEVAL,Nenfant)=\"D\",\"X\",\"\")","v":{"$error":"#NAME?"}},{"$f":"IF(INDEX(periode3,NEVAL,Nenfant)=\"C\",\"X\",\"\")","v":{"$error":"#NAME?"}},{"$f":"IF(INDEX(periode3,NEVAL,Nenfant)=\"B\",\"X\",\"\")","v":{"$error":"#NAME?"}},{"$f":"IF(INDEX(periode3,NEVAL,Nenfant)=\"A\",\"X\",\"\")","v":{"$error":"#NAME?"}},null,{"$f":"IF(INDEX(periode4,NEVAL,Nenfant)=\"D\",\"X\",\"\")","v":{"$error":"#NAME?"}},{"$f":"IF(INDEX(periode4,NEVAL,Nenfant)=\"C\",\"X\",\"\")","v":{"$error":"#NAME?"}},{"$f":"IF(INDEX(periode4,NEVAL,Nenfant)=\"B\",\"X\",\"\")","v":{"$error":"#NAME?"}},{"$f":"IF(INDEX(periode4,NEVAL,Nenfant)=\"A\",\"X\",\"\")","v":{"$error":"#NAME?"}},null,{"$f":"IF(INDEX(periode5,NEVAL,Nenfant)=\"D\",\"X\",\"\")","v":{"$error":"#NAME?"}},{"$f":"IF(INDEX(periode5,NEVAL,Nenfant)=\"C\",\"X\",\"\")","v":{"$error":"#NAME?"}},{"$f":"IF(INDEX(periode5,NEVAL,Nenfant)=\"B\",\"X\",\"\")","v":{"$error":"#NAME?"}},{"$f":"IF(INDEX(periode5,NEVAL,Nenfant)=\"A\",\"X\",\"\")","v":{"$error":"#NAME?"}},null,{"$f":"IF(INDEX(periode6,NEVAL,Nenfant)=\"D\",\"X\",\"\")","v":{"$error":"#NAME?"}},{"$f":"IF(INDEX(periode6,NEVAL,Nenfant)=\"C\",\"X\",\"\")","v":{"$error":"#NAME?"}},{"$f":"IF(INDEX(periode6,NEVAL,Nenfant)=\"B\",\"X\",\"\")","v":{"$error":"#NAME?"}},{"$f":"IF(INDEX(periode6,NEVAL,Nenfant)=\"A\",\"X\",\"\")","v":{"$error":"#NAME?"}}]
[60,{"$nulls":7},{"$f":"IF(INDEX(periode1,NEVAL,Nenfant)=\"D\",\"X\",\"\")","v":{"$error":"#NAME?"}},{"$f":"IF(INDEX(periode1,NEVAL,Nenfant)=\"C\",\"X\",\"\")","v":{"$error":"#NAME?"}},{"$f":"IF(INDEX(periode1,NEVAL,Nenfant)=\"B\",\"X\",\"\")","v":{"$error":"#NAME?"}},{"$f":"IF(INDEX(periode1,NEVAL,Nenfant)=\"A\",\"X\",\"\")","v":{"$error":"#NAME?"}},null,{"$f":"IF(INDEX(periode2,NEVAL,Nenfant)=\"D\",\"X\",\"\")","v":{"$error":"#NAME?"}},{"$f":"IF(INDEX(periode2,NEVAL,Nenfant)=\"C\",\"X\",\"\")","v":{"$error":"#NAME?"}},{"$f":"IF(INDEX(periode2,NEVAL,Nenfant)=\"B\",\"X\",\"\")","v":{"$error":"#NAME?"}},{"$f":"IF(INDEX(periode2,NEVAL,Nenfant)=\"A\",\"X\",\"\")","v":{"$error":"#NAME?"}},null,{"$f":"IF(INDEX(periode3,NEVAL,Nenfant)=\"D\",\"X\",\"\")","v":{"$error":"#NAME?"}},{"$f":"IF(INDEX(periode3,NEVAL,Nenfant)=\"C\",\"X\",\"\")","v":{"$error":"#NAME?"}},{"$f":"IF(INDEX(periode3,NEVAL,Nenfant)=\"B\",\"X\",\"\")","v":{"$error":"#NAME?"}},{"$f":"IF(INDEX(periode3,NEVAL,Nenfant)=\"A\",\"X\",\"\")","v":{"$error":"#NAME?"}},null,{"$f":"IF(INDEX(periode4,NEVAL,Nenfant)=\"D\",\"X\",\"\")","v":{"$error":"#NAME?"}},{"$f":"IF(INDEX(periode4,NEVAL,Nenfant)=\"C\",\"X\",\"\")","v":{"$error":"#NAME?"}},{"$f":"IF(INDEX(periode4,NEVAL,Nenfant)=\"B\",\"X\",\"\")","v":{"$error":"#NAME?"}},{"$f":"IF(INDEX(periode4,NEVAL,Nenfant)=\"A\",\"X\",\"\")","v":{"$error":"#NAME?"}},null,{"$f":"IF(INDEX(periode5,NEVAL,Nenfant)=\"D\",\"X\",\"\")","v":{"$error":"#NAME?"}},{"$f":"IF(INDEX(periode5,NEVAL,Nenfant)=\"C\",\"X\",\"\")","v":{"$error":"#NAME?"}},{"$f":"IF(INDEX(periode5,NEVAL,Nenfant)=\"B\",\"X\",\"\")","v":{"$error":"#NAME?"}},{"$f":"IF(INDEX(periode5,NEVAL,Nenfant)=\"A\",\"X\",\"\")","v":{"$error":"#NAME?"}},null,{"$f":"IF(INDEX(periode6,NEVAL,Nenfant)=\"D\",\"X\",\"\")","v":{"$error":"#NAME?"}},{"$f":"IF(INDEX(periode6,NEVAL,Nenfant)=\"C\",\"X\",\"\")","v":{"$error":"#NAME?"}},{"$f":"IF(INDEX(periode6,NEVAL,Nenfant)=\"B\",\"X\",\"\")","v":{"$error":"#NAME?"}},{"$f":"IF(INDEX(periode6,NEVAL,Nenfant)=\"A\",\"X\",\"\")","v":{"$error":"#NAME?"}}]
[61,{"$nulls":7},{"$f":"IF(INDEX(periode1,NEVAL,Nenfant)=\"D\",\"X\",\"\")","v":{"$error":"#NAME?"}},{"$f":"IF(INDEX(periode1,NEVAL,Nenfant)=\"C\",\"X\",\"\")","v":{"$error":"#NAME?"}},{"$f":"IF(INDEX(periode1,NEVAL,Nenfant)=\"B\",\"X\",\"\")","v":{"$error":"#NAME?"}},{"$f":"IF(INDEX(periode1,NEVAL,Nenfant)=\"A\",\"X\",\"\")","v":{"$error":"#NAME?"}},null,{"$f":"IF(INDEX(periode2,NEVAL,Nenfant)=\"D\",\"X\",\"\")","v":{"$error":"#NAME?"}},{"$f":"IF(INDEX(periode2,NEVAL,Nenfant)=\"C\",\"X\",\"\")","v":{"$error":"#NAME?"}},{"$f":"IF(INDEX(periode2,NEVAL,Nenfant)=\"B\",\"X\",\"\")","v":{"$error":"#NAME?"}},{"$f":"IF(INDEX(periode2,NEVAL,Nenfant)=\"A\",\"X\",\"\")","v":{"$error":"#NAME?"}},null,{"$f":"IF(INDEX(periode3,NEVAL,Nenfant)=\"D\",\"X\",\"\")","v":{"$error":"#NAME?"}},{"$f":"IF(INDEX(periode3,NEVAL,Nenfant)=\"C\",\"X\",\"\")","v":{"$error":"#NAME?"}},{"$f":"IF(INDEX(periode3,NEVAL,Nenfant)=\"B\",\"X\",\"\")","v":{"$error":"#NAME?"}},{"$f":"IF(INDEX(periode3,NEVAL,Nenfant)=\"A\",\"X\",\"\")","v":{"$error":"#NAME?"}},null,{"$f":"IF(INDEX(periode4,NEVAL,Nenfant)=\"D\",\"X\",\"\")","v":{"$error":"#NAME?"}},{"$f":"IF(INDEX(periode4,NEVAL,Nenfant)=\"C\",\"X\",\"\")","v":{"$error":"#NAME?"}},{"$f":"IF(INDEX(periode4,NEVAL,Nenfant)=\"B\",\"X\",\"\")","v":{"$error":"#NAME?"}},{"$f":"IF(INDEX(periode4,NEVAL,Nenfant)=\"A\",\"X\",\"\")","v":{"$error":"#NAME?"}},null,{"$f":"IF(INDEX(periode5,NEVAL,Nenfant)=\"D\",\"X\",\"\")","v":{"$error":"#NAME?"}},{"$f":"IF(INDEX(periode5,NEVAL,Nenfant)=\"C\",\"X\",\"\")","v":{"$error":"#NAME?"}},{"$f":"IF(INDEX(periode5,NEVAL,Nenfant)=\"B\",\"X\",\"\")","v":{"$error":"#NAME?"}},{"$f":"IF(INDEX(periode5,NEVAL,Nenfant)=\"A\",\"X\",\"\")","v":{"$error":"#NAME?"}},null,{"$f":"IF(INDEX(periode6,NEVAL,Nenfant)=\"D\",\"X\",\"\")","v":{"$error":"#NAME?"}},{"$f":"IF(INDEX(periode6,NEVAL,Nenfant)=\"C\",\"X\",\"\")","v":{"$error":"#NAME?"}},{"$f":"IF(INDEX(periode6,NEVAL,Nenfant)=\"B\",\"X\",\"\")","v":{"$error":"#NAME?"}},{"$f":"IF(INDEX(periode6,NEVAL,Nenfant)=\"A\",\"X\",\"\")","v":{"$error":"#NAME?"}}]
[62,{"$nulls":7},{"$f":"IF(INDEX(periode1,NEVAL,Nenfant)=\"D\",\"X\",\"\")","v":{"$error":"#NAME?"}},{"$f":"IF(INDEX(periode1,NEVAL,Nenfant)=\"C\",\"X\",\"\")","v":{"$error":"#NAME?"}},{"$f":"IF(INDEX(periode1,NEVAL,Nenfant)=\"B\",\"X\",\"\")","v":{"$error":"#NAME?"}},{"$f":"IF(INDEX(periode1,NEVAL,Nenfant)=\"A\",\"X\",\"\")","v":{"$error":"#NAME?"}},null,{"$f":"IF(INDEX(periode2,NEVAL,Nenfant)=\"D\",\"X\",\"\")","v":{"$error":"#NAME?"}},{"$f":"IF(INDEX(periode2,NEVAL,Nenfant)=\"C\",\"X\",\"\")","v":{"$error":"#NAME?"}},{"$f":"IF(INDEX(periode2,NEVAL,Nenfant)=\"B\",\"X\",\"\")","v":{"$error":"#NAME?"}},{"$f":"IF(INDEX(periode2,NEVAL,Nenfant)=\"A\",\"X\",\"\")","v":{"$error":"#NAME?"}},null,{"$f":"IF(INDEX(periode3,NEVAL,Nenfant)=\"D\",\"X\",\"\")","v":{"$error":"#NAME?"}},{"$f":"IF(INDEX(periode3,NEVAL,Nenfant)=\"C\",\"X\",\"\")","v":{"$error":"#NAME?"}},{"$f":"IF(INDEX(periode3,NEVAL,Nenfant)=\"B\",\"X\",\"\")","v":{"$error":"#NAME?"}},{"$f":"IF(INDEX(periode3,NEVAL,Nenfant)=\"A\",\"X\",\"\")","v":{"$error":"#NAME?"}},null,{"$f":"IF(INDEX(periode4,NEVAL,Nenfant)=\"D\",\"X\",\"\")","v":{"$error":"#NAME?"}},{"$f":"IF(INDEX(periode4,NEVAL,Nenfant)=\"C\",\"X\",\"\")","v":{"$error":"#NAME?"}},{"$f":"IF(INDEX(periode4,NEVAL,Nenfant)=\"B\",\"X\",\"\")","v":{"$error":"#NAME?"}},{"$f":"IF(INDEX(periode4,NEVAL,Nenfant)=\"A\",\"X\",\"\")","v":{"$error":"#NAME?"}},null,{"$f":"IF(INDEX(periode5,NEVAL,Nenfant)=\"D\",\"X\",\"\")","v":{"$error":"#NAME?"}},{"$f":"IF(INDEX(periode5,NEVAL,Nenfant)=\"C\",\"X\",\"\")","v":{"$error":"#NAME?"}},{"$f":"IF(INDEX(periode5,NEVAL,Nenfant)=\"B\",\"X\",\"\")","v":{"$error":"#NAME?"}},{"$f":"IF(INDEX(periode5,NEVAL,Nenfant)=\"A\",\"X\",\"\")","v":{"$error":"#NAME?"}},null,{"$f":"IF(INDEX(periode6,NEVAL,Nenfant)=\"D\",\"X\",\"\")","v":{"$error":"#NAME?"}},{"$f":"IF(INDEX(periode6,NEVAL,Nenfant)=\"C\",\"X\",\"\")","v":{"$error":"#NAME?"}},{"$f":"IF(INDEX(periode6,NEVAL,Nenfant)=\"B\",\"X\",\"\")","v":{"$error":"#NAME?"}},{"$f":"IF(INDEX(periode6,NEVAL,Nenfant)=\"A\",\"X\",\"\")","v":{"$error":"#NAME?"}}]
[63,{"$nulls":7},{"$f":"IF(INDEX(periode1,NEVAL,Nenfant)=\"D\",\"X\",\"\")","v":{"$error":"#NAME?"}},{"$f":"IF(INDEX(periode1,NEVAL,Nenfant)=\"C\",\"X\",\"\")","v":{"$error":"#NAME?"}},{"$f":"IF(INDEX(periode1,NEVAL,Nenfant)=\"B\",\"X\",\"\")","v":{"$error":"#NAME?"}},{"$f":"IF(INDEX(periode1,NEVAL,Nenfant)=\"A\",\"X\",\"\")","v":{"$error":"#NAME?"}},null,{"$f":"IF(INDEX(periode2,NEVAL,Nenfant)=\"D\",\"X\",\"\")","v":{"$error":"#NAME?"}},{"$f":"IF(INDEX(periode2,NEVAL,Nenfant)=\"C\",\"X\",\"\")","v":{"$error":"#NAME?"}},{"$f":"IF(INDEX(periode2,NEVAL,Nenfant)=\"B\",\"X\",\"\")","v":{"$error":"#NAME?"}},{"$f":"IF(INDEX(periode2,NEVAL,Nenfant)=\"A\",\"X\",\"\")","v":{"$error":"#NAME?"}},null,{"$f":"IF(INDEX(periode3,NEVAL,Nenfant)=\"D\",\"X\",\"\")","v":{"$error":"#NAME?"}},{"$f":"IF(INDEX(periode3,NEVAL,Nenfant)=\"C\",\"X\",\"\")","v":{"$error":"#NAME?"}},{"$f":"IF(INDEX(periode3,NEVAL,Nenfant)=\"B\",\"X\",\"\")","v":{"$error":"#NAME?"}},{"$f":"IF(INDEX(periode3,NEVAL,Nenfant)=\"A\",\"X\",\"\")","v":{"$error":"#NAME?"}},null,{"$f":"IF(INDEX(periode4,NEVAL,Nenfant)=\"D\",\"X\",\"\")","v":{"$error":"#NAME?"}},{"$f":"IF(INDEX(periode4,NEVAL,Nenfant)=\"C\",\"X\",\"\")","v":{"$error":"#NAME?"}},{"$f":"IF(INDEX(periode4,NEVAL,Nenfant)=\"B\",\"X\",\"\")","v":{"$error":"#NAME?"}},{"$f":"IF(INDEX(periode4,NEVAL,Nenfant)=\"A\",\"X\",\"\")","v":{"$error":"#NAME?"}},null,{"$f":"IF(INDEX(periode5,NEVAL,Nenfant)=\"D\",\"X\",\"\")","v":{"$error":"#NAME?"}},{"$f":"IF(INDEX(periode5,NEVAL,Nenfant)=\"C\",\"X\",\"\")","v":{"$error":"#NAME?"}},{"$f":"IF(INDEX(periode5,NEVAL,Nenfant)=\"B\",\"X\",\"\")","v":{"$error":"#NAME?"}},{"$f":"IF(INDEX(periode5,NEVAL,Nenfant)=\"A\",\"X\",\"\")","v":{"$error":"#NAME?"}},null,{"$f":"IF(INDEX(periode6,NEVAL,Nenfant)=\"D\",\"X\",\"\")","v":{"$error":"#NAME?"}},{"$f":"IF(INDEX(periode6,NEVAL,Nenfant)=\"C\",\"X\",\"\")","v":{"$error":"#NAME?"}},{"$f":"IF(INDEX(periode6,NEVAL,Nenfant)=\"B\",\"X\",\"\")","v":{"$error":"#NAME?"}},{"$f":"IF(INDEX(periode6,NEVAL,Nenfant)=\"A\",\"X\",\"\")","v":{"$error":"#NAME?"}}]
[64,{"$nulls":7},{"$f":"COUNTIF($G70,\"X\")","v":0},{"$f":"COUNTIF($H70,\"X\")","v":0},{"$f":"COUNTIF($I76,\"X\")","v":0},{"$f":"COUNTIF($J76,\"X\")","v":0},null,{"$f":"COUNTIF($G70,\"X\")","v":0},{"$f":"COUNTIF($H70,\"X\")","v":0},{"$f":"COUNTIF($I76,\"X\")","v":0},{"$f":"COUNTIF($J76,\"X\")","v":0},null,{"$f":"COUNTIF($G70,\"X\")","v":0},{"$f":"COUNTIF($H70,\"X\")","v":0},{"$f":"COUNTIF($I76,\"X\")","v":0},{"$f":"COUNTIF($J76,\"X\")","v":0},null,{"$f":"COUNTIF($G70,\"X\")","v":0},{"$f":"COUNTIF($H70,\"X\")","v":0},{"$f":"COUNTIF($I76,\"X\")","v":0},{"$f":"COUNTIF(AA76,\"X\")","v":0},null,{"$f":"COUNTIF($G70,\"X\")","v":0},{"$f":"COUNTIF($H70,\"X\")","v":0},{"$f":"COUNTIF($I76,\"X\")","v":0},{"$f":"COUNTIF($J76,\"X\")","v":0},null,{"$f":"COUNTIF($G70,\"X\")","v":0},{"$f":"COUNTIF($H70,\"X\")","v":0},{"$f":"COUNTIF($I76,\"X\")","v":0},{"$f":"COUNTIF($J76,\"X\")","v":0}]
[65,{"$nulls":7},{"$f":"IF(INDEX(periode1,NEVAL,Nenfant)=\"D\",\"X\",\"\")","v":{"$error":"#NAME?"}},{"$f":"IF(INDEX(periode1,NEVAL,Nenfant)=\"C\",\"X\",\"\")","v":{"$error":"#NAME?"}},{"$f":"IF(INDEX(periode1,NEVAL,Nenfant)=\"B\",\"X\",\"\")","v":{"$error":"#NAME?"}},{"$f":"IF(INDEX(periode1,NEVAL,Nenfant)=\"A\",\"X\",\"\")","v":{"$error":"#NAME?"}},null,{"$f":"IF(INDEX(periode2,NEVAL,Nenfant)=\"D\",\"X\",\"\")","v":{"$error":"#NAME?"}},{"$f":"IF(INDEX(periode2,NEVAL,Nenfant)=\"C\",\"X\",\"\")","v":{"$error":"#NAME?"}},{"$f":"IF(INDEX(periode2,NEVAL,Nenfant)=\"B\",\"X\",\"\")","v":{"$error":"#NAME?"}},{"$f":"IF(INDEX(periode2,NEVAL,Nenfant)=\"A\",\"X\",\"\")","v":{"$error":"#NAME?"}},null,{"$f":"IF(INDEX(periode3,NEVAL,Nenfant)=\"D\",\"X\",\"\")","v":{"$error":"#NAME?"}},{"$f":"IF(INDEX(periode3,NEVAL,Nenfant)=\"C\",\"X\",\"\")","v":{"$error":"#NAME?"}},{"$f":"IF(INDEX(periode3,NEVAL,Nenfant)=\"B\",\"X\",\"\")","v":{"$error":"#NAME?"}},{"$f":"IF(INDEX(periode3,NEVAL,Nenfant)=\"A\",\"X\",\"\")","v":{"$error":"#NAME?"}},null,{"$f":"IF(INDEX(periode4,NEVAL,Nenfant)=\"D\",\"X\",\"\")","v":{"$error":"#NAME?"}},{"$f":"IF(INDEX(periode4,NEVAL,Nenfant)=\"C\",\"X\",\"\")","v":{"$error":"#NAME?"}},{"$f":"IF(INDEX(periode4,NEVAL,Nenfant)=\"B\",\"X\",\"\")","v":{"$error":"#NAME?"}},{"$f":"IF(INDEX(periode4,NEVAL,Nenfant)=\"A\",\"X\",\"\")","v":{"$error":"#NAME?"}},null,{"$f":"IF(INDEX(periode5,NEVAL,Nenfant)=\"D\",\"X\",\"\")","v":{"$error":"#NAME?"}},{"$f":"IF(INDEX(periode5,NEVAL,Nenfant)=\"C\",\"X\",\"\")","v":{"$error":"#NAME?"}},{"$f":"IF(INDEX(periode5,NEVAL,Nenfant)=\"B\",\"X\",\"\")","v":{"$error":"#NAME?"}},{"$f":"IF(INDEX(periode5,NEVAL,Nenfant)=\"A\",\"X\",\"\")","v":{"$error":"#NAME?"}},null,{"$f":"IF(INDEX(periode6,NEVAL,Nenfant)=\"D\",\"X\",\"\")","v":{"$error":"#NAME?"}},{"$f":"IF(INDEX(periode6,NEVAL,Nenfant)=\"C\",\"X\",\"\")","v":{"$error":"#NAME?"}},{"$f":"IF(INDEX(periode6,NEVAL,Nenfant)=\"B\",\"X\",\"\")","v":{"$error":"#NAME?"}},{"$f":"IF(INDEX(periode6,NEVAL,Nenfant)=\"A\",\"X\",\"\")","v":{"$error":"#NAME?"}}]
[66,{"$nulls":7},{"$error":"#NAME?"},{"$error":"#NAME?"},{"$error":"#NAME?"},{"$error":"#NAME?"},null,{"$error":"#NAME?"},{"$error":"#NAME?"},{"$error":"#NAME?"},{"$error":"#NAME?"},null,{"$error":"#NAME?"},{"$error":"#NAME?"},{"$error":"#NAME?"},{"$error":"#NAME?"},null,{"$error":"#NAME?"},{"$error":"#NAME?"},{"$error":"#NAME?"},{"$error":"#NAME?"},null,{"$error":"#NAME?"},{"$error":"#NAME?"},{"$error":"#NAME?"},{"$error":"#NAME?"},null,{"$error":"#NAME?"},{"$error":"#NAME?"},{"$error":"#NAME?"},{"$error":"#NAME?"}]
[67,{"$nulls":7},{"$error":"#NAME?"},{"$error":"#NAME?"},{"$error":"#NAME?"},{"$error":"#NAME?"},null,{"$error":"#NAME?"},{"$error":"#NAME?"},{"$error":"#NAME?"},{"$error":"#NAME?"},null,{"$error":"#NAME?"},{"$error":"#NAME?"},{"$error":"#NAME?"},{"$error":"#NAME?"},null,{"$error":"#NAME?"},{"$error":"#NAME?"},{"$error":"#NAME?"},{"$error":"#NAME?"},null,{"$error":"#NAME?"},{"$error":"#NAME?"},{"$error":"#NAME?"},{"$error":"#NAME?"},null,{"$error":"#NAME?"},{"$error":"#NAME?"},{"$error":"#NAME?"},{"$error":"#NAME?"}]
[68,{"$nulls":7},{"$error":"#NAME?"},{"$error":"#NAME?"},{"$error":"#NAME?"},{"$error":"#NAME?"},null,{"$error":"#NAME?"},{"$error":"#NAME?"},{"$error":"#NAME?"},{"$error":"#NAME?"},null,{"$error":"#NAME?"},{"$error":"#NAME?"},{"$error":"#NAME?"},{"$error":"#NAME?"},null,{"$error":"#NAME?"},{"$error":"#NAME?"},{"$error":"#NAME?"},{"$error":"#NAME?"},null,{"$error":"#NAME?"},{"$error":"#NAME?"},{"$error":"#NAME?"},{"$error":"#NAME?"},null,{"$error":"#NAME?"},{"$error":"#NAME?"},{"$error":"#NAME?"},{"$error":"#NAME?"}]
[69,{"$nulls":7},{"$error":"#NAME?"},{"$error":"#NAME?"},{"$error":"#NAME?"},{"$error":"#NAME?"},null,{"$error":"#NAME?"},{"$error":"#NAME?"},{"$error":"#NAME?"},{"$error":"#NAME?"},null,{"$error":"#NAME?"},{"$error":"#NAME?"},{"$error":"#NAME?"},{"$error":"#NAME?"},null,{"$error":"#NAME?"},{"$error":"#NAME?"},{"$error":"#NAME?"},{"$error":"#NAME?"},null,{"$error":"#NAME?"},{"$error":"#NAME?"},{"$error":"#NAME?"},{"$error":"#NAME?"},null,{"$error":"#NAME?"},{"$error":"#NAME?"},{"$error":"#NAME?"},{"$error":"#NAME?"}]
[70,{"$nulls":7},{"$error":"#NAME?"},{"$error":"#NAME?"},{"$error":"#NAME?"},{"$error":"#NAME?"},null,{"$error":"#NAME?"},{"$error":"#NAME?"},{"$error":"#NAME?"},{"$error":"#NAME?"},null,{"$error":"#NAME?"},{"$error":"#NAME?"},{"$error":"#NAME?"},{"$error":"#NAME?"},null,{"$error":"#NAME?"},{"$error":"#NAME?"},{"$error":"#NAME?"},{"$error":"#NAME?"},null,{"$error":"#NAME?"},{"$error":"#NAME?"},{"$error":"#NAME?"},{"$error":"#NAME?"},null,{"$error":"#NAME?"},{"$error":"#NAME?"},{"$error":"#NAME?"},{"$error":"#NAME?"}]
[71,{"$nulls":7},{"$f":"COUNTIF($G72,\"X\")","v":0},{"$f":"COUNTIF($H72,\"X\")","v":0},{"$f":"COUNTIF($I78,\"X\")","v":0},{"$f":"COUNTIF($J78,\"X\")","v":0},null,{"$f":"COUNTIF($G72,\"X\")","v":0},{"$f":"COUNTIF($H72,\"X\")","v":0},{"$f":"COUNTIF($I78,\"X\")","v":0},{"$f":"COUNTIF($J78,\"X\")","v":0},null,{"$f":"COUNTIF($G72,\"X\")","v":0},{"$f":"COUNTIF($H72,\"X\")","v":0},{"$f":"COUNTIF($I78,\"X\")","v":0},{"$f":"COUNTIF($J78,\"X\")","v":0},null,{"$f":"COUNTIF($G72,\"X\")","v":0},{"$f":"COUNTIF($H72,\"X\")","v":0},{"$f":"COUNTIF($I78,\"X\")","v":0},{"$f":"COUNTIF(AA78,\"X\")","v":0},null,{"$f":"COUNTIF($G72,\"X\")","v":0},{"$f":"COUNTIF($H72,\"X\")","v":0},{"$f":"COUNTIF($I78,\"X\")","v":0},{"$f":"COUNTIF($J78,\"X\")","v":0},null,{"$f":"COUNTIF($G72,\"X\")","v":0},{"$f":"COUNTIF($H72,\"X\")","v":0},{"$f":"COUNTIF($I78,\"X\")","v":0},{"$f":"COUNTIF($J78,\"X\")","v":0}]
[72,{"$nulls":7},{"$f":"IF(INDEX(periode1,NEVAL,Nenfant)=\"D\",\"X\",\"\")","v":{"$error":"#NAME?"}},{"$f":"IF(INDEX(periode1,NEVAL,Nenfant)=\"C\",\"X\",\"\")","v":{"$error":"#NAME?"}},{"$f":"IF(INDEX(periode1,NEVAL,Nenfant)=\"B\",\"X\",\"\")","v":{"$error":"#NAME?"}},{"$f":"IF(INDEX(periode1,NEVAL,Nenfant)=\"A\",\"X\",\"\")","v":{"$error":"#NAME?"}},null,{"$f":"IF(INDEX(periode2,NEVAL,Nenfant)=\"D\",\"X\",\"\")","v":{"$error":"#NAME?"}},{"$f":"IF(INDEX(periode2,NEVAL,Nenfant)=\"C\",\"X\",\"\")","v":{"$error":"#NAME?"}},{"$f":"IF(INDEX(periode2,NEVAL,Nenfant)=\"B\",\"X\",\"\")","v":{"$error":"#NAME?"}},{"$f":"IF(INDEX(periode2,NEVAL,Nenfant)=\"A\",\"X\",\"\")","v":{"$error":"#NAME?"}},null,{"$f":"IF(INDEX(periode3,NEVAL,Nenfant)=\"D\",\"X\",\"\")","v":{"$error":"#NAME?"}},{"$f":"IF(INDEX(periode3,NEVAL,Nenfant)=\"C\",\"X\",\"\")","v":{"$error":"#NAME?"}},{"$f":"IF(INDEX(periode3,NEVAL,Nenfant)=\"B\",\"X\",\"\")","v":{"$error":"#NAME?"}},{"$f":"IF(INDEX(periode3,NEVAL,Nenfant)=\"A\",\"X\",\"\")","v":{"$error":"#NAME?"}},null,{"$f":"IF(INDEX(periode4,NEVAL,Nenfant)=\"D\",\"X\",\"\")","v":{"$error":"#NAME?"}},{"$f":"IF(INDEX(periode4,NEVAL,Nenfant)=\"C\",\"X\",\"\")","v":{"$error":"#NAME?"}},{"$f":"IF(INDEX(periode4,NEVAL,Nenfant)=\"B\",\"X\",\"\")","v":{"$error":"#NAME?"}},{"$f":"IF(INDEX(periode4,NEVAL,Nenfant)=\"A\",\"X\",\"\")","v":{"$error":"#NAME?"}},null,{"$f":"IF(INDEX(periode5,NEVAL,Nenfant)=\"D\",\"X\",\"\")","v":{"$error":"#NAME?"}},{"$f":"IF(INDEX(periode5,NEVAL,Nenfant)=\"C\",\"X\",\"\")","v":{"$error":"#NAME?"}},{"$f":"IF(INDEX(periode5,NEVAL,Nenfant)=\"B\",\"X\",\"\")","v":{"$error":"#NAME?"}},{"$f":"IF(INDEX(periode5,NEVAL,Nenfant)=\"A\",\"X\",\"\")","v":{"$error":"#NAME?"}},null,{"$f":"IF(INDEX(periode6,NEVAL,Nenfant)=\"D\",\"X\",\"\")","v":{"$error":"#NAME?"}},{"$f":"IF(INDEX(periode6,NEVAL,Nenfant)=\"C\",\"X\",\"\")","v":{"$error":"#NAME?"}},{"$f":"IF(INDEX(periode6,NEVAL,Nenfant)=\"B\",\"X\",\"\")","v":{"$error":"#NAME?"}},{"$f":"IF(INDEX(periode6,NEVAL,Nenfant)=\"A\",\"X\",\"\")","v":{"$error":"#NAME?"}}]
[73,{"$nulls":7},{"$f":"IF(INDEX(periode1,NEVAL,Nenfant)=\"D\",\"X\",\"\")","v":{"$error":"#NAME?"}},{"$f":"IF(INDEX(periode1,NEVAL,Nenfant)=\"C\",\"X\",\"\")","v":{"$error":"#NAME?"}},{"$f":"IF(INDEX(periode1,NEVAL,Nenfant)=\"B\",\"X\",\"\")","v":{"$error":"#NAME?"}},{"$f":"IF(INDEX(periode1,NEVAL,Nenfant)=\"A\",\"X\",\"\")","v":{"$error":"#NAME?"}},null,{"$f":"IF(INDEX(periode2,NEVAL,Nenfant)=\"D\",\"X\",\"\")","v":{"$error":"#NAME?"}},{"$f":"IF(INDEX(periode2,NEVAL,Nenfant)=\"C\",\"X\",\"\")","v":{"$error":"#NAME?"}},{"$f":"IF(INDEX(periode2,NEVAL,Nenfant)=\"B\",\"X\",\"\")","v":{"$error":"#NAME?"}},{"$f":"IF(INDEX(periode2,NEVAL,Nenfant)=\"A\",\"X\",\"\")","v":{"$error":"#NAME?"}},null,{"$f":"IF(INDEX(periode3,NEVAL,Nenfant)=\"D\",\"X\",\"\")","v":{"$error":"#NAME?"}},{"$f":"IF(INDEX(periode3,NEVAL,Nenfant)=\"C\",\"X\",\"\")","v":{"$error":"#NAME?"}},{"$f":"IF(INDEX(periode3,NEVAL,Nenfant)=\"B\",\"X\",\"\")","v":{"$error":"#NAME?"}},{"$f":"IF(INDEX(periode3,NEVAL,Nenfant)=\"A\",\"X\",\"\")","v":{"$error":"#NAME?"}},null,{"$f":"IF(INDEX(periode4,NEVAL,Nenfant)=\"D\",\"X\",\"\")","v":{"$error":"#NAME?"}},{"$f":"IF(INDEX(periode4,NEVAL,Nenfant)=\"C\",\"X\",\"\")","v":{"$error":"#NAME?"}},{"$f":"IF(INDEX(periode4,NEVAL,Nenfant)=\"B\",\"X\",\"\")","v":{"$error":"#NAME?"}},{"$f":"IF(INDEX(periode4,NEVAL,Nenfant)=\"A\",\"X\",\"\")","v":{"$error":"#NAME?"}},null,{"$f":"IF(INDEX(periode5,NEVAL,Nenfant)=\"D\",\"X\",\"\")","v":{"$error":"#NAME?"}},{"$f":"IF(INDEX(periode5,NEVAL,Nenfant)=\"C\",\"X\",\"\")","v":{"$error":"#NAME?"}},{"$f":"IF(INDEX(periode5,NEVAL,Nenfant)=\"B\",\"X\",\"\")","v":{"$error":"#NAME?"}},{"$f":"IF(INDEX(periode5,NEVAL,Nenfant)=\"A\",\"X\",\"\")","v":{"$error":"#NAME?"}},null,{"$f":"IF(INDEX(periode6,NEVAL,Nenfant)=\"D\",\"X\",\"\")","v":{"$error":"#NAME?"}},{"$f":"IF(INDEX(periode6,NEVAL,Nenfant)=\"C\",\"X\",\"\")","v":{"$error":"#NAME?"}},{"$f":"IF(INDEX(periode6,NEVAL,Nenfant)=\"B\",\"X\",\"\")","v":{"$error":"#NAME?"}},{"$f":"IF(INDEX(periode6,NEVAL,Nenfant)=\"A\",\"X\",\"\")","v":{"$error":"#NAME?"}}]
[74,{"$nulls":7},{"$f":"IF(INDEX(periode1,NEVAL,Nenfant)=\"D\",\"X\",\"\")","v":{"$error":"#NAME?"}},{"$f":"IF(INDEX(periode1,NEVAL,Nenfant)=\"C\",\"X\",\"\")","v":{"$error":"#NAME?"}},{"$f":"IF(INDEX(periode1,NEVAL,Nenfant)=\"B\",\"X\",\"\")","v":{"$error":"#NAME?"}},{"$f":"IF(INDEX(periode1,NEVAL,Nenfant)=\"A\",\"X\",\"\")","v":{"$error":"#NAME?"}},null,{"$f":"IF(INDEX(periode2,NEVAL,Nenfant)=\"D\",\"X\",\"\")","v":{"$error":"#NAME?"}},{"$f":"IF(INDEX(periode2,NEVAL,Nenfant)=\"C\",\"X\",\"\")","v":{"$error":"#NAME?"}},{"$f":"IF(INDEX(periode2,NEVAL,Nenfant)=\"B\",\"X\",\"\")","v":{"$error":"#NAME?"}},{"$f":"IF(INDEX(periode2,NEVAL,Nenfant)=\"A\",\"X\",\"\")","v":{"$error":"#NAME?"}},null,{"$f":"IF(INDEX(periode3,NEVAL,Nenfant)=\"D\",\"X\",\"\")","v":{"$error":"#NAME?"}},{"$f":"IF(INDEX(periode3,NEVAL,Nenfant)=\"C\",\"X\",\"\")","v":{"$error":"#NAME?"}},{"$f":"IF(INDEX(periode3,NEVAL,Nenfant)=\"B\",\"X\",\"\")","v":{"$error":"#NAME?"}},{"$f":"IF(INDEX(periode3,NEVAL,Nenfant)=\"A\",\"X\",\"\")","v":{"$error":"#NAME?"}},null,{"$f":"IF(INDEX(periode4,NEVAL,Nenfant)=\"D\",\"X\",\"\")","v":{"$error":"#NAME?"}},{"$f":"IF(INDEX(periode4,NEVAL,Nenfant)=\"C\",\"X\",\"\")","v":{"$error":"#NAME?"}},{"$f":"IF(INDEX(periode4,NEVAL,Nenfant)=\"B\",\"X\",\"\")","v":{"$error":"#NAME?"}},{"$f":"IF(INDEX(periode4,NEVAL,Nenfant)=\"A\",\"X\",\"\")","v":{"$error":"#NAME?"}},null,{"$f":"IF(INDEX(periode5,NEVAL,Nenfant)=\"D\",\"X\",\"\")","v":{"$error":"#NAME?"}},{"$f":"IF(INDEX(periode5,NEVAL,Nenfant)=\"C\",\"X\",\"\")","v":{"$error":"#NAME?"}},{"$f":"IF(INDEX(periode5,NEVAL,Nenfant)=\"B\",\"X\",\"\")","v":{"$error":"#NAME?"}},{"$f":"IF(INDEX(periode5,NEVAL,Nenfant)=\"A\",\"X\",\"\")","v":{"$error":"#NAME?"}},null,{"$f":"IF(INDEX(periode6,NEVAL,Nenfant)=\"D\",\"X\",\"\")","v":{"$error":"#NAME?"}},{"$f":"IF(INDEX(periode6,NEVAL,Nenfant)=\"C\",\"X\",\"\")","v":{"$error":"#NAME?"}},{"$f":"IF(INDEX(periode6,NEVAL,Nenfant)=\"B\",\"X\",\"\")","v":{"$error":"#NAME?"}},{"$f":"IF(INDEX(periode6,NEVAL,Nenfant)=\"A\",\"X\",\"\")","v":{"$error":"#NAME?"}}]
[75,{"$nulls":7},{"$f":"IF(INDEX(periode1,NEVAL,Nenfant)=\"D\",\"X\",\"\")","v":{"$error":"#NAME?"}},{"$f":"IF(INDEX(periode1,NEVAL,Nenfant)=\"C\",\"X\",\"\")","v":{"$error":"#NAME?"}},{"$f":"IF(INDEX(periode1,NEVAL,Nenfant)=\"B\",\"X\",\"\")","v":{"$error":"#NAME?"}},{"$f":"IF(INDEX(periode1,NEVAL,Nenfant)=\"A\",\"X\",\"\")","v":{"$error":"#NAME?"}},null,{"$f":"IF(INDEX(periode2,NEVAL,Nenfant)=\"D\",\"X\",\"\")","v":{"$error":"#NAME?"}},{"$f":"IF(INDEX(periode2,NEVAL,Nenfant)=\"C\",\"X\",\"\")","v":{"$error":"#NAME?"}},{"$f":"IF(INDEX(periode2,NEVAL,Nenfant)=\"B\",\"X\",\"\")","v":{"$error":"#NAME?"}},{"$f":"IF(INDEX(periode2,NEVAL,Nenfant)=\"A\",\"X\",\"\")","v":{"$error":"#NAME?"}},null,{"$f":"IF(INDEX(periode3,NEVAL,Nenfant)=\"D\",\"X\",\"\")","v":{"$error":"#NAME?"}},{"$f":"IF(INDEX(periode3,NEVAL,Nenfant)=\"C\",\"X\",\"\")","v":{"$error":"#NAME?"}},{"$f":"IF(INDEX(periode3,NEVAL,Nenfant)=\"B\",\"X\",\"\")","v":{"$error":"#NAME?"}},{"$f":"IF(INDEX(periode3,NEVAL,Nenfant)=\"A\",\"X\",\"\")","v":{"$error":"#NAME?"}},null,{"$f":"IF(INDEX(periode4,NEVAL,Nenfant)=\"D\",\"X\",\"\")","v":{"$error":"#NAME?"}},{"$f":"IF(INDEX(periode4,NEVAL,Nenfant)=\"C\",\"X\",\"\")","v":{"$error":"#NAME?"}},{"$f":"IF(INDEX(periode4,NEVAL,Nenfant)=\"B\",\"X\",\"\")","v":{"$error":"#NAME?"}},{"$f":"IF(INDEX(periode4,NEVAL,Nenfant)=\"A\",\"X\",\"\")","v":{"$error":"#NAME?"}},null,{"$f":"IF(INDEX(periode5,NEVAL,Nenfant)=\"D\",\"X\",\"\")","v":{"$error":"#NAME?"}},{"$f":"IF(INDEX(periode5,NEVAL,Nenfant)=\"C\",\"X\",\"\")","v":{"$error":"#NAME?"}},{"$f":"IF(INDEX(periode5,NEVAL,Nenfant)=\"B\",\"X\",\"\")","v":{"$error":"#NAME?"}},{"$f":"IF(INDEX(periode5,NEVAL,Nenfant)=\"A\",\"X\",\"\")","v":{"$error":"#NAME?"}},null,{"$f":"IF(INDEX(periode6,NEVAL,Nenfant)=\"D\",\"X\",\"\")","v":{"$error":"#NAME?"}},{"$f":"IF(INDEX(periode6,NEVAL,Nenfant)=\"C\",\"X\",\"\")","v":{"$error":"#NAME?"}},{"$f":"IF(INDEX(periode6,NEVAL,Nenfant)=\"B\",\"X\",\"\")","v":{"$error":"#NAME?"}},{"$f":"IF(INDEX(periode6,NEVAL,Nenfant)=\"A\",\"X\",\"\")","v":{"$error":"#NAME?"}}]
[76,{"$nulls":7},{"$f":"COUNTIF($G85:$G87,\"X\")","v":0},{"$f":"COUNTIF($H85:$H87,\"X\")","v":0},{"$f":"COUNTIF($I83:$I85,\"X\")","v":0},{"$f":"COUNTIF($J83:$J85,\"X\")","v":0},null,{"$f":"COUNTIF($G85:$G87,\"X\")","v":0},{"$f":"COUNTIF($H85:$H87,\"X\")","v":0},{"$f":"COUNTIF($I83:$I85,\"X\")","v":0},{"$f":"COUNTIF($J83:$J85,\"X\")","v":0},null,{"$f":"COUNTIF($G85:$G87,\"X\")","v":0},{"$f":"COUNTIF($H85:$H87,\"X\")","v":0},{"$f":"COUNTIF($I83:$I85,\"X\")","v":0},{"$f":"COUNTIF($J83:$J85,\"X\")","v":0},null,{"$f":"COUNTIF($G85:$G87,\"X\")","v":0},{"$f":"COUNTIF($H85:$H87,\"X\")","v":0},{"$f":"COUNTIF($I83:$I85,\"X\")","v":0},{"$f":"COUNTIF(AA83:AA85,\"X\")","v":0},null,{"$f":"COUNTIF($G85:$G87,\"X\")","v":0},{"$f":"COUNTIF($H85:$H87,\"X\")","v":0},{"$f":"COUNTIF($I83:$I85,\"X\")","v":0},{"$f":"COUNTIF($J83:$J85,\"X\")","v":0},null,{"$f":"COUNTIF($G85:$G87,\"X\")","v":0},{"$f":"COUNTIF($H85:$H87,\"X\")","v":0},{"$f":"COUNTIF($I83:$I85,\"X\")","v":0},{"$f":"COUNTIF($J83:$J85,\"X\")","v":0}]
[77,{"$nulls":7},{"$f":"IF(INDEX(periode1,NEVAL,Nenfant)=\"D\",\"X\",\"\")","v":{"$error":"#NAME?"}},{"$f":"IF(INDEX(periode1,NEVAL,Nenfant)=\"C\",\"X\",\"\")","v":{"$error":"#NAME?"}},{"$f":"IF(INDEX(periode1,NEVAL,Nenfant)=\"B\",\"X\",\"\")","v":{"$error":"#NAME?"}},{"$f":"IF(INDEX(periode1,NEVAL,Nenfant)=\"A\",\"X\",\"\")","v":{"$error":"#NAME?"}},null,{"$f":"IF(INDEX(periode2,NEVAL,Nenfant)=\"D\",\"X\",\"\")","v":{"$error":"#NAME?"}},{"$f":"IF(INDEX(periode2,NEVAL,Nenfant)=\"C\",\"X\",\"\")","v":{"$error":"#NAME?"}},{"$f":"IF(INDEX(periode2,NEVAL,Nenfant)=\"B\",\"X\",\"\")","v":{"$error":"#NAME?"}},{"$f":"IF(INDEX(periode2,NEVAL,Nenfant)=\"A\",\"X\",\"\")","v":{"$error":"#NAME?"}},null,{"$f":"IF(INDEX(periode3,NEVAL,Nenfant)=\"D\",\"X\",\"\")","v":{"$error":"#NAME?"}},{"$f":"IF(INDEX(periode3,NEVAL,Nenfant)=\"C\",\"X\",\"\")","v":{"$error":"#NAME?"}},{"$f":"IF(INDEX(periode3,NEVAL,Nenfant)=\"B\",\"X\",\"\")","v":{"$error":"#NAME?"}},{"$f":"IF(INDEX(periode3,NEVAL,Nenfant)=\"A\",\"X\",\"\")","v":{"$error":"#NAME?"}},null,{"$f":"IF(INDEX(periode4,NEVAL,Nenfant)=\"D\",\"X\",\"\")","v":{"$error":"#NAME?"}},{"$f":"IF(INDEX(periode4,NEVAL,Nenfant)=\"C\",\"X\",\"\")","v":{"$error":"#NAME?"}},{"$f":"IF(INDEX(periode4,NEVAL,Nenfant)=\"B\",\"X\",\"\")","v":{"$error":"#NAME?"}},{"$f":"IF(INDEX(periode4,NEVAL,Nenfant)=\"A\",\"X\",\"\")","v":{"$error":"#NAME?"}},null,{"$f":"IF(INDEX(periode5,NEVAL,Nenfant)=\"D\",\"X\",\"\")","v":{"$error":"#NAME?"}},{"$f":"IF(INDEX(periode5,NEVAL,Nenfant)=\"C\",\"X\",\"\")","v":{"$error":"#NAME?"}},{"$f":"IF(INDEX(periode5,NEVAL,Nenfant)=\"B\",\"X\",\"\")","v":{"$error":"#NAME?"}},{"$f":"IF(INDEX(periode5,NEVAL,Nenfant)=\"A\",\"X\",\"\")","v":{"$error":"#NAME?"}},null,{"$f":"IF(INDEX(periode6,NEVAL,Nenfant)=\"D\",\"X\",\"\")","v":{"$error":"#NAME?"}},{"$f":"IF(INDEX(periode6,NEVAL,Nenfant)=\"C\",\"X\",\"\")","v":{"$error":"#NAME?"}},{"$f":"IF(INDEX(periode6,NEVAL,Nenfant)=\"B\",\"X\",\"\")","v":{"$error":"#NAME?"}},{"$f":"IF(INDEX(periode6,NEVAL,Nenfant)=\"A\",\"X\",\"\")","v":{"$error":"#NAME?"}}]
[78,{"$nulls":7},{"$f":"IF(INDEX(periode1,NEVAL,Nenfant)=\"D\",\"X\",\"\")","v":{"$error":"#NAME?"}},{"$f":"IF(INDEX(periode1,NEVAL,Nenfant)=\"C\",\"X\",\"\")","v":{"$error":"#NAME?"}},{"$f":"IF(INDEX(periode1,NEVAL,Nenfant)=\"B\",\"X\",\"\")","v":{"$error":"#NAME?"}},{"$f":"IF(INDEX(periode1,NEVAL,Nenfant)=\"A\",\"X\",\"\")","v":{"$error":"#NAME?"}},null,{"$f":"IF(INDEX(periode2,NEVAL,Nenfant)=\"D\",\"X\",\"\")","v":{"$error":"#NAME?"}},{"$f":"IF(INDEX(periode2,NEVAL,Nenfant)=\"C\",\"X\",\"\")","v":{"$error":"#NAME?"}},{"$f":"IF(INDEX(periode2,NEVAL,Nenfant)=\"B\",\"X\",\"\")","v":{"$error":"#NAME?"}},{"$f":"IF(INDEX(periode2,NEVAL,Nenfant)=\"A\",\"X\",\"\")","v":{"$error":"#NAME?"}},null,{"$f":"IF(INDEX(periode3,NEVAL,Nenfant)=\"D\",\"X\",\"\")","v":{"$error":"#NAME?"}},{"$f":"IF(INDEX(periode3,NEVAL,Nenfant)=\"C\",\"X\",\"\")","v":{"$error":"#NAME?"}},{"$f":"IF(INDEX(periode3,NEVAL,Nenfant)=\"B\",\"X\",\"\")","v":{"$error":"#NAME?"}},{"$f":"IF(INDEX(periode3,NEVAL,Nenfant)=\"A\",\"X\",\"\")","v":{"$error":"#NAME?"}},null,{"$f":"IF(INDEX(periode4,NEVAL,Nenfant)=\"D\",\"X\",\"\")","v":{"$error":"#NAME?"}},{"$f":"IF(INDEX(periode4,NEVAL,Nenfant)=\"C\",\"X\",\"\")","v":{"$error":"#NAME?"}},{"$f":"IF(INDEX(periode4,NEVAL,Nenfant)=\"B\",\"X\",\"\")","v":{"$error":"#NAME?"}},{"$f":"IF(INDEX(periode4,NEVAL,Nenfant)=\"A\",\"X\",\"\")","v":{"$error":"#NAME?"}},null,{"$f":"IF(INDEX(periode5,NEVAL,Nenfant)=\"D\",\"X\",\"\")","v":{"$error":"#NAME?"}},{"$f":"IF(INDEX(periode5,NEVAL,Nenfant)=\"C\",\"X\",\"\")","v":{"$error":"#NAME?"}},{"$f":"IF(INDEX(periode5,NEVAL,Nenfant)=\"B\",\"X\",\"\")","v":{"$error":"#NAME?"}},{"$f":"IF(INDEX(periode5,NEVAL,Nenfant)=\"A\",\"X\",\"\")","v":{"$error":"#NAME?"}},null,{"$f":"IF(INDEX(periode6,NEVAL,Nenfant)=\"D\",\"X\",\"\")","v":{"$error":"#NAME?"}},{"$f":"IF(INDEX(periode6,NEVAL,Nenfant)=\"C\",\"X\",\"\")","v":{"$error":"#NAME?"}},{"$f":"IF(INDEX(periode6,NEVAL,Nenfant)=\"B\",\"X\",\"\")","v":{"$error":"#NAME?"}},{"$f":"IF(INDEX(periode6,NEVAL,Nenfant)=\"A\",\"X\",\"\")","v":{"$error":"#NAME?"}}]
[79,{"$nulls":7},{"$f":"IF(INDEX(periode1,NEVAL,Nenfant)=\"D\",\"X\",\"\")","v":{"$error":"#NAME?"}},{"$f":"IF(INDEX(periode1,NEVAL,Nenfant)=\"C\",\"X\",\"\")","v":{"$error":"#NAME?"}},{"$f":"IF(INDEX(periode1,NEVAL,Nenfant)=\"B\",\"X\",\"\")","v":{"$error":"#NAME?"}},{"$f":"IF(INDEX(periode1,NEVAL,Nenfant)=\"A\",\"X\",\"\")","v":{"$error":"#NAME?"}},null,{"$f":"IF(INDEX(periode2,NEVAL,Nenfant)=\"D\",\"X\",\"\")","v":{"$error":"#NAME?"}},{"$f":"IF(INDEX(periode2,NEVAL,Nenfant)=\"C\",\"X\",\"\")","v":{"$error":"#NAME?"}},{"$f":"IF(INDEX(periode2,NEVAL,Nenfant)=\"B\",\"X\",\"\")","v":{"$error":"#NAME?"}},{"$f":"IF(INDEX(periode2,NEVAL,Nenfant)=\"A\",\"X\",\"\")","v":{"$error":"#NAME?"}},null,{"$f":"IF(INDEX(periode3,NEVAL,Nenfant)=\"D\",\"X\",\"\")","v":{"$error":"#NAME?"}},{"$f":"IF(INDEX(periode3,NEVAL,Nenfant)=\"C\",\"X\",\"\")","v":{"$error":"#NAME?"}},{"$f":"IF(INDEX(periode3,NEVAL,Nenfant)=\"B\",\"X\",\"\")","v":{"$error":"#NAME?"}},{"$f":"IF(INDEX(periode3,NEVAL,Nenfant)=\"A\",\"X\",\"\")","v":{"$error":"#NAME?"}},null,{"$f":"IF(INDEX(periode4,NEVAL,Nenfant)=\"D\",\"X\",\"\")","v":{"$error":"#NAME?"}},{"$f":"IF(INDEX(periode4,NEVAL,Nenfant)=\"C\",\"X\",\"\")","v":{"$error":"#NAME?"}},{"$f":"IF(INDEX(periode4,NEVAL,Nenfant)=\"B\",\"X\",\"\")","v":{"$error":"#NAME?"}},{"$f":"IF(INDEX(periode4,NEVAL,Nenfant)=\"A\",\"X\",\"\")","v":{"$error":"#NAME?"}},null,{"$f":"IF(INDEX(periode5,NEVAL,Nenfant)=\"D\",\"X\",\"\")","v":{"$error":"#NAME?"}},{"$f":"IF(INDEX(periode5,NEVAL,Nenfant)=\"C\",\"X\",\"\")","v":{"$error":"#NAME?"}},{"$f":"IF(INDEX(periode5,NEVAL,Nenfant)=\"B\",\"X\",\"\")","v":{"$error":"#NAME?"}},{"$f":"IF(INDEX(periode5,NEVAL,Nenfant)=\"A\",\"X\",\"\")","v":{"$error":"#NAME?"}},null,{"$f":"IF(INDEX(periode6,NEVAL,Nenfant)=\"D\",\"X\",\"\")","v":{"$error":"#NAME?"}},{"$f":"IF(INDEX(periode6,NEVAL,Nenfant)=\"C\",\"X\",\"\")","v":{"$error":"#NAME?"}},{"$f":"IF(INDEX(periode6,NEVAL,Nenfant)=\"B\",\"X\",\"\")","v":{"$error":"#NAME?"}},{"$f":"IF(INDEX(periode6,NEVAL,Nenfant)=\"A\",\"X\",\"\")","v":{"$error":"#NAME?"}}]
[80,{"$nulls":7},{"$f":"COUNTIF($G80:$G83,\"X\")","v":0},{"$f":"COUNTIF($H80:$H83,\"X\")","v":0},{"$f":"COUNTIF($I87:$I90,\"X\")","v":0},{"$f":"COUNTIF($J87:$J90,\"X\")","v":0},null,{"$f":"COUNTIF($G80:$G83,\"X\")","v":0},{"$f":"COUNTIF($H80:$H83,\"X\")","v":0},{"$f":"COUNTIF($I87:$I90,\"X\")","v":0},{"$f":"COUNTIF($J87:$J90,\"X\")","v":0},null,{"$f":"COUNTIF($G80:$G83,\"X\")","v":0},{"$f":"COUNTIF($H80:$H83,\"X\")","v":0},{"$f":"COUNTIF($I87:$I90,\"X\")","v":0},{"$f":"COUNTIF($J87:$J90,\"X\")","v":0},null,{"$f":"COUNTIF($G80:$G83,\"X\")","v":0},{"$f":"COUNTIF($H80:$H83,\"X\")","v":0},{"$f":"COUNTIF($I87:$I90,\"X\")","v":0},{"$f":"COUNTIF(AA87:AA90,\"X\")","v":0},null,{"$f":"COUNTIF($G80:$G83,\"X\")","v":0},{"$f":"COUNTIF($H80:$H83,\"X\")","v":0},{"$f":"COUNTIF($I87:$I90,\"X\")","v":0},{"$f":"COUNTIF($J87:$J90,\"X\")","v":0},null,{"$f":"COUNTIF($G80:$G83,\"X\")","v":0},{"$f":"COUNTIF($H80:$H83,\"X\")","v":0},{"$f":"COUNTIF($I87:$I90,\"X\")","v":0},{"$f":"COUNTIF($J87:$J90,\"X\")","v":0}]
[81,{"$nulls":7},{"$f":"IF(INDEX(periode1,NEVAL,Nenfant)=\"D\",\"X\",\"\")","v":{"$error":"#NAME?"}},{"$f":"IF(INDEX(periode1,NEVAL,Nenfant)=\"C\",\"X\",\"\")","v":{"$error":"#NAME?"}},{"$f":"IF(INDEX(periode1,NEVAL,Nenfant)=\"B\",\"X\",\"\")","v":{"$error":"#NAME?"}},{"$f":"IF(INDEX(periode1,NEVAL,Nenfant)=\"A\",\"X\",\"\")","v":{"$error":"#NAME?"}},null,{"$f":"IF(INDEX(periode2,NEVAL,Nenfant)=\"D\",\"X\",\"\")","v":{"$error":"#NAME?"}},{"$f":"IF(INDEX(periode2,NEVAL,Nenfant)=\"C\",\"X\",\"\")","v":{"$error":"#NAME?"}},{"$f":"IF(INDEX(periode2,NEVAL,Nenfant)=\"B\",\"X\",\"\")","v":{"$error":"#NAME?"}},{"$f":"IF(INDEX(periode2,NEVAL,Nenfant)=\"A\",\"X\",\"\")","v":{"$error":"#NAME?"}},null,{"$f":"IF(INDEX(periode3,NEVAL,Nenfant)=\"D\",\"X\",\"\")","v":{"$error":"#NAME?"}},{"$f":"IF(INDEX(periode3,NEVAL,Nenfant)=\"C\",\"X\",\"\")","v":{"$error":"#NAME?"}},{"$f":"IF(INDEX(periode3,NEVAL,Nenfant)=\"B\",\"X\",\"\")","v":{"$error":"#NAME?"}},{"$f":"IF(INDEX(periode3,NEVAL,Nenfant)=\"A\",\"X\",\"\")","v":{"$error":"#NAME?"}},null,{"$f":"IF(INDEX(periode4,NEVAL,Nenfant)=\"D\",\"X\",\"\")","v":{"$error":"#NAME?"}},{"$f":"IF(INDEX(periode4,NEVAL,Nenfant)=\"C\",\"X\",\"\")","v":{"$error":"#NAME?"}},{"$f":"IF(INDEX(periode4,NEVAL,Nenfant)=\"B\",\"X\",\"\")","v":{"$error":"#NAME?"}},{"$f":"IF(INDEX(periode4,NEVAL,Nenfant)=\"A\",\"X\",\"\")","v":{"$error":"#NAME?"}},null,{"$f":"IF(INDEX(periode5,NEVAL,Nenfant)=\"D\",\"X\",\"\")","v":{"$error":"#NAME?"}},{"$f":"IF(INDEX(periode5,NEVAL,Nenfant)=\"C\",\"X\",\"\")","v":{"$error":"#NAME?"}},{"$f":"IF(INDEX(periode5,NEVAL,Nenfant)=\"B\",\"X\",\"\")","v":{"$error":"#NAME?"}},{"$f":"IF(INDEX(periode5,NEVAL,Nenfant)=\"A\",\"X\",\"\")","v":{"$error":"#NAME?"}},null,{"$f":"IF(INDEX(periode6,NEVAL,Nenfant)=\"D\",\"X\",\"\")","v":{"$error":"#NAME?"}},{"$f":"IF(INDEX(periode6,NEVAL,Nenfant)=\"C\",\"X\",\"\")","v":{"$error":"#NAME?"}},{"$f":"IF(INDEX(periode6,NEVAL,Nenfant)=\"B\",\"X\",\"\")","v":{"$error":"#NAME?"}},{"$f":"IF(INDEX(periode6,NEVAL,Nenfant)=\"A\",\"X\",\"\")","v":{"$error":"#NAME?"}}]
[82,{"$nulls":7},{"$f":"IF(INDEX(periode1,NEVAL,Nenfant)=\"D\",\"X\",\"\")","v":{"$error":"#NAME?"}},{"$f":"IF(INDEX(periode1,NEVAL,Nenfant)=\"C\",\"X\",\"\")","v":{"$error":"#NAME?"}},{"$f":"IF(INDEX(periode1,NEVAL,Nenfant)=\"B\",\"X\",\"\")","v":{"$error":"#NAME?"}},{"$f":"IF(INDEX(periode1,NEVAL,Nenfant)=\"A\",\"X\",\"\")","v":{"$error":"#NAME?"}},null,{"$f":"IF(INDEX(periode2,NEVAL,Nenfant)=\"D\",\"X\",\"\")","v":{"$error":"#NAME?"}},{"$f":"IF(INDEX(periode2,NEVAL,Nenfant)=\"C\",\"X\",\"\")","v":{"$error":"#NAME?"}},{"$f":"IF(INDEX(periode2,NEVAL,Nenfant)=\"B\",\"X\",\"\")","v":{"$error":"#NAME?"}},{"$f":"IF(INDEX(periode2,NEVAL,Nenfant)=\"A\",\"X\",\"\")","v":{"$error":"#NAME?"}},null,{"$f":"IF(INDEX(periode3,NEVAL,Nenfant)=\"D\",\"X\",\"\")","v":{"$error":"#NAME?"}},{"$f":"IF(INDEX(periode3,NEVAL,Nenfant)=\"C\",\"X\",\"\")","v":{"$error":"#NAME?"}},{"$f":"IF(INDEX(periode3,NEVAL,Nenfant)=\"B\",\"X\",\"\")","v":{"$error":"#NAME?"}},{"$f":"IF(INDEX(periode3,NEVAL,Nenfant)=\"A\",\"X\",\"\")","v":{"$error":"#NAME?"}},null,{"$f":"IF(INDEX(periode4,NEVAL,Nenfant)=\"D\",\"X\",\"\")","v":{"$error":"#NAME?"}},{"$f":"IF(INDEX(periode4,NEVAL,Nenfant)=\"C\",\"X\",\"\")","v":{"$error":"#NAME?"}},{"$f":"IF(INDEX(periode4,NEVAL,Nenfant)=\"B\",\"X\",\"\")","v":{"$error":"#NAME?"}},{"$f":"IF(INDEX(periode4,NEVAL,Nenfant)=\"A\",\"X\",\"\")","v":{"$error":"#NAME?"}},null,{"$f":"IF(INDEX(periode5,NEVAL,Nenfant)=\"D\",\"X\",\"\")","v":{"$error":"#NAME?"}},{"$f":"IF(INDEX(periode5,NEVAL,Nenfant)=\"C\",\"X\",\"\")","v":{"$error":"#NAME?"}},{"$f":"IF(INDEX(periode5,NEVAL,Nenfant)=\"B\",\"X\",\"\")","v":{"$error":"#NAME?"}},{"$f":"IF(INDEX(periode5,NEVAL,Nenfant)=\"A\",\"X\",\"\")","v":{"$error":"#NAME?"}},null,{"$f":"IF(INDEX(periode6,NEVAL,Nenfant)=\"D\",\"X\",\"\")","v":{"$error":"#NAME?"}},{"$f":"IF(INDEX(periode6,NEVAL,Nenfant)=\"C\",\"X\",\"\")","v":{"$error":"#NAME?"}},{"$f":"IF(INDEX(periode6,NEVAL,Nenfant)=\"B\",\"X\",\"\")","v":{"$error":"#NAME?"}},{"$f":"IF(INDEX(periode6,NEVAL,Nenfant)=\"A\",\"X\",\"\")","v":{"$error":"#NAME?"}}]
[83,{"$nulls":7},{"$f":"IF(INDEX(periode1,NEVAL,Nenfant)=\"D\",\"X\",\"\")","v":{"$error":"#NAME?"}},{"$f":"IF(INDEX(periode1,NEVAL,Nenfant)=\"C\",\"X\",\"\")","v":{"$error":"#NAME?"}},{"$f":"IF(INDEX(periode1,NEVAL,Nenfant)=\"B\",\"X\",\"\")","v":{"$error":"#NAME?"}},{"$f":"IF(INDEX(periode1,NEVAL,Nenfant)=\"A\",\"X\",\"\")","v":{"$error":"#NAME?"}},null,{"$f":"IF(INDEX(periode2,NEVAL,Nenfant)=\"D\",\"X\",\"\")","v":{"$error":"#NAME?"}},{"$f":"IF(INDEX(periode2,NEVAL,Nenfant)=\"C\",\"X\",\"\")","v":{"$error":"#NAME?"}},{"$f":"IF(INDEX(periode2,NEVAL,Nenfant)=\"B\",\"X\",\"\")","v":{"$error":"#NAME?"}},{"$f":"IF(INDEX(periode2,NEVAL,Nenfant)=\"A\",\"X\",\"\")","v":{"$error":"#NAME?"}},null,{"$f":"IF(INDEX(periode3,NEVAL,Nenfant)=\"D\",\"X\",\"\")","v":{"$error":"#NAME?"}},{"$f":"IF(INDEX(periode3,NEVAL,Nenfant)=\"C\",\"X\",\"\")","v":{"$error":"#NAME?"}},{"$f":"IF(INDEX(periode3,NEVAL,Nenfant)=\"B\",\"X\",\"\")","v":{"$error":"#NAME?"}},{"$f":"IF(INDEX(periode3,NEVAL,Nenfant)=\"A\",\"X\",\"\")","v":{"$error":"#NAME?"}},null,{"$f":"IF(INDEX(periode4,NEVAL,Nenfant)=\"D\",\"X\",\"\")","v":{"$error":"#NAME?"}},{"$f":"IF(INDEX(periode4,NEVAL,Nenfant)=\"C\",\"X\",\"\")","v":{"$error":"#NAME?"}},{"$f":"IF(INDEX(periode4,NEVAL,Nenfant)=\"B\",\"X\",\"\")","v":{"$error":"#NAME?"}},{"$f":"IF(INDEX(periode4,NEVAL,Nenfant)=\"A\",\"X\",\"\")","v":{"$error":"#NAME?"}},null,{"$f":"IF(INDEX(periode5,NEVAL,Nenfant)=\"D\",\"X\",\"\")","v":{"$error":"#NAME?"}},{"$f":"IF(INDEX(periode5,NEVAL,Nenfant)=\"C\",\"X\",\"\")","v":{"$error":"#NAME?"}},{"$f":"IF(INDEX(periode5,NEVAL,Nenfant)=\"B\",\"X\",\"\")","v":{"$error":"#NAME?"}},{"$f":"IF(INDEX(periode5,NEVAL,Nenfant)=\"A\",\"X\",\"\")","v":{"$error":"#NAME?"}},null,{"$f":"IF(INDEX(periode6,NEVAL,Nenfant)=\"D\",\"X\",\"\")","v":{"$error":"#NAME?"}},{"$f":"IF(INDEX(periode6,NEVAL,Nenfant)=\"C\",\"X\",\"\")","v":{"$error":"#NAME?"}},{"$f":"IF(INDEX(periode6,NEVAL,Nenfant)=\"B\",\"X\",\"\")","v":{"$error":"#NAME?"}},{"$f":"IF(INDEX(periode6,NEVAL,Nenfant)=\"A\",\"X\",\"\")","v":{"$error":"#NAME?"}}]
[84,{"$nulls":7},{"$f":"IF(INDEX(periode1,NEVAL,Nenfant)=\"D\",\"X\",\"\")","v":{"$error":"#NAME?"}},{"$f":"IF(INDEX(periode1,NEVAL,Nenfant)=\"C\",\"X\",\"\")","v":{"$error":"#NAME?"}},{"$f":"IF(INDEX(periode1,NEVAL,Nenfant)=\"B\",\"X\",\"\")","v":{"$error":"#NAME?"}},{"$f":"IF(INDEX(periode1,NEVAL,Nenfant)=\"A\",\"X\",\"\")","v":{"$error":"#NAME?"}},null,{"$f":"IF(INDEX(periode2,NEVAL,Nenfant)=\"D\",\"X\",\"\")","v":{"$error":"#NAME?"}},{"$f":"IF(INDEX(periode2,NEVAL,Nenfant)=\"C\",\"X\",\"\")","v":{"$error":"#NAME?"}},{"$f":"IF(INDEX(periode2,NEVAL,Nenfant)=\"B\",\"X\",\"\")","v":{"$error":"#NAME?"}},{"$f":"IF(INDEX(periode2,NEVAL,Nenfant)=\"A\",\"X\",\"\")","v":{"$error":"#NAME?"}},null,{"$f":"IF(INDEX(periode3,NEVAL,Nenfant)=\"D\",\"X\",\"\")","v":{"$error":"#NAME?"}},{"$f":"IF(INDEX(periode3,NEVAL,Nenfant)=\"C\",\"X\",\"\")","v":{"$error":"#NAME?"}},{"$f":"IF(INDEX(periode3,NEVAL,Nenfant)=\"B\",\"X\",\"\")","v":{"$error":"#NAME?"}},{"$f":"IF(INDEX(periode3,NEVAL,Nenfant)=\"A\",\"X\",\"\")","v":{"$error":"#NAME?"}},null,{"$f":"IF(INDEX(periode4,NEVAL,Nenfant)=\"D\",\"X\",\"\")","v":{"$error":"#NAME?"}},{"$f":"IF(INDEX(periode4,NEVAL,Nenfant)=\"C\",\"X\",\"\")","v":{"$error":"#NAME?"}},{"$f":"IF(INDEX(periode4,NEVAL,Nenfant)=\"B\",\"X\",\"\")","v":{"$error":"#NAME?"}},{"$f":"IF(INDEX(periode4,NEVAL,Nenfant)=\"A\",\"X\",\"\")","v":{"$error":"#NAME?"}},null,{"$f":"IF(INDEX(periode5,NEVAL,Nenfant)=\"D\",\"X\",\"\")","v":{"$error":"#NAME?"}},{"$f":"IF(INDEX(periode5,NEVAL,Nenfant)=\"C\",\"X\",\"\")","v":{"$error":"#NAME?"}},{"$f":"IF(INDEX(periode5,NEVAL,Nenfant)=\"B\",\"X\",\"\")","v":{"$error":"#NAME?"}},{"$f":"IF(INDEX(periode5,NEVAL,Nenfant)=\"A\",\"X\",\"\")","v":{"$error":"#NAME?"}},null,{"$f":"IF(INDEX(periode6,NEVAL,Nenfant)=\"D\",\"X\",\"\")","v":{"$error":"#NAME?"}},{"$f":"IF(INDEX(periode6,NEVAL,Nenfant)=\"C\",\"X\",\"\")","v":{"$error":"#NAME?"}},{"$f":"IF(INDEX(periode6,NEVAL,Nenfant)=\"B\",\"X\",\"\")","v":{"$error":"#NAME?"}},{"$f":"IF(INDEX(periode6,NEVAL,Nenfant)=\"A\",\"X\",\"\")","v":{"$error":"#NAME?"}}]
[85,{"$nulls":7},{"$f":"COUNTIF($G85:$G86,\"X\")","v":0},{"$f":"COUNTIF($H85:$H86,\"X\")","v":0},{"$f":"COUNTIF($I92:$I93,\"X\")","v":0},{"$f":"COUNTIF($J92:$J93,\"X\")","v":0},null,{"$f":"COUNTIF($G85:$G86,\"X\")","v":0},{"$f":"COUNTIF($H85:$H86,\"X\")","v":0},{"$f":"COUNTIF($I92:$I93,\"X\")","v":0},{"$f":"COUNTIF($J92:$J93,\"X\")","v":0},null,{"$f":"COUNTIF($G85:$G86,\"X\")","v":0},{"$f":"COUNTIF($H85:$H86,\"X\")","v":0},{"$f":"COUNTIF($I92:$I93,\"X\")","v":0},{"$f":"COUNTIF($J92:$J93,\"X\")","v":0},null,{"$f":"COUNTIF($G85:$G86,\"X\")","v":0},{"$f":"COUNTIF($H85:$H86,\"X\")","v":0},{"$f":"COUNTIF($I92:$I93,\"X\")","v":0},{"$f":"COUNTIF(AA92:AA93,\"X\")","v":0},null,{"$f":"COUNTIF($G85:$G86,\"X\")","v":0},{"$f":"COUNTIF($H85:$H86,\"X\")","v":0},{"$f":"COUNTIF($I92:$I93,\"X\")","v":0},{"$f":"COUNTIF($J92:$J93,\"X\")","v":0},null,{"$f":"COUNTIF($G85:$G86,\"X\")","v":0},{"$f":"COUNTIF($H85:$H86,\"X\")","v":0},{"$f":"COUNTIF($I92:$I93,\"X\")","v":0},{"$f":"COUNTIF($J92:$J93,\"X\")","v":0}]
[86,{"$nulls":7},{"$f":"IF(INDEX(periode1,NEVAL,Nenfant)=\"D\",\"X\",\"\")","v":{"$error":"#NAME?"}},{"$f":"IF(INDEX(periode1,NEVAL,Nenfant)=\"C\",\"X\",\"\")","v":{"$error":"#NAME?"}},{"$f":"IF(INDEX(periode1,NEVAL,Nenfant)=\"B\",\"X\",\"\")","v":{"$error":"#NAME?"}},{"$f":"IF(INDEX(periode1,NEVAL,Nenfant)=\"A\",\"X\",\"\")","v":{"$error":"#NAME?"}},null,{"$f":"IF(INDEX(periode2,NEVAL,Nenfant)=\"D\",\"X\",\"\")","v":{"$error":"#NAME?"}},{"$f":"IF(INDEX(periode2,NEVAL,Nenfant)=\"C\",\"X\",\"\")","v":{"$error":"#NAME?"}},{"$f":"IF(INDEX(periode2,NEVAL,Nenfant)=\"B\",\"X\",\"\")","v":{"$error":"#NAME?"}},{"$f":"IF(INDEX(periode2,NEVAL,Nenfant)=\"A\",\"X\",\"\")","v":{"$error":"#NAME?"}},null,{"$f":"IF(INDEX(periode3,NEVAL,Nenfant)=\"D\",\"X\",\"\")","v":{"$error":"#NAME?"}},{"$f":"IF(INDEX(periode3,NEVAL,Nenfant)=\"C\",\"X\",\"\")","v":{"$error":"#NAME?"}},{"$f":"IF(INDEX(periode3,NEVAL,Nenfant)=\"B\",\"X\",\"\")","v":{"$error":"#NAME?"}},{"$f":"IF(INDEX(periode3,NEVAL,Nenfant)=\"A\",\"X\",\"\")","v":{"$error":"#NAME?"}},null,{"$f":"IF(INDEX(periode4,NEVAL,Nenfant)=\"D\",\"X\",\"\")","v":{"$error":"#NAME?"}},{"$f":"IF(INDEX(periode4,NEVAL,Nenfant)=\"C\",\"X\",\"\")","v":{"$error":"#NAME?"}},{"$f":"IF(INDEX(periode4,NEVAL,Nenfant)=\"B\",\"X\",\"\")","v":{"$error":"#NAME?"}},{"$f":"IF(INDEX(periode4,NEVAL,Nenfant)=\"A\",\"X\",\"\")","v":{"$error":"#NAME?"}},null,{"$f":"IF(INDEX(periode5,NEVAL,Nenfant)=\"D\",\"X\",\"\")","v":{"$error":"#NAME?"}},{"$f":"IF(INDEX(periode5,NEVAL,Nenfant)=\"C\",\"X\",\"\")","v":{"$error":"#NAME?"}},{"$f":"IF(INDEX(periode5,NEVAL,Nenfant)=\"B\",\"X\",\"\")","v":{"$error":"#NAME?"}},{"$f":"IF(INDEX(periode5,NEVAL,Nenfant)=\"A\",\"X\",\"\")","v":{"$error":"#NAME?"}},null,{"$f":"IF(INDEX(periode6,NEVAL,Nenfant)=\"D\",\"X\",\"\")","v":{"$error":"#NAME?"}},{"$f":"IF(INDEX(periode6,NEVAL,Nenfant)=\"C\",\"X\",\"\")","v":{"$error":"#NAME?"}},{"$f":"IF(INDEX(periode6,NEVAL,Nenfant)=\"B\",\"X\",\"\")","v":{"$error":"#NAME?"}},{"$f":"IF(INDEX(periode6,NEVAL,Nenfant)=\"A\",\"X\",\"\")","v":{"$error":"#NAME?"}}]
[87,{"$nulls":7},{"$f":"IF(INDEX(periode1,NEVAL,Nenfant)=\"D\",\"X\",\"\")","v":{"$error":"#NAME?"}},{"$f":"IF(INDEX(periode1,NEVAL,Nenfant)=\"C\",\"X\",\"\")","v":{"$error":"#NAME?"}},{"$f":"IF(INDEX(periode1,NEVAL,Nenfant)=\"B\",\"X\",\"\")","v":{"$error":"#NAME?"}},{"$f":"IF(INDEX(periode1,NEVAL,Nenfant)=\"A\",\"X\",\"\")","v":{"$error":"#NAME?"}},null,{"$f":"IF(INDEX(periode2,NEVAL,Nenfant)=\"D\",\"X\",\"\")","v":{"$error":"#NAME?"}},{"$f":"IF(INDEX(periode2,NEVAL,Nenfant)=\"C\",\"X\",\"\")","v":{"$error":"#NAME?"}},{"$f":"IF(INDEX(periode2,NEVAL,Nenfant)=\"B\",\"X\",\"\")","v":{"$error":"#NAME?"}},{"$f":"IF(INDEX(periode2,NEVAL,Nenfant)=\"A\",\"X\",\"\")","v":{"$error":"#NAME?"}},null,{"$f":"IF(INDEX(periode3,NEVAL,Nenfant)=\"D\",\"X\",\"\")","v":{"$error":"#NAME?"}},{"$f":"IF(INDEX(periode3,NEVAL,Nenfant)=\"C\",\"X\",\"\")","v":{"$error":"#NAME?"}},{"$f":"IF(INDEX(periode3,NEVAL,Nenfant)=\"B\",\"X\",\"\")","v":{"$error":"#NAME?"}},{"$f":"IF(INDEX(periode3,NEVAL,Nenfant)=\"A\",\"X\",\"\")","v":{"$error":"#NAME?"}},null,{"$f":"IF(INDEX(periode4,NEVAL,Nenfant)=\"D\",\"X\",\"\")","v":{"$error":"#NAME?"}},{"$f":"IF(INDEX(periode4,NEVAL,Nenfant)=\"C\",\"X\",\"\")","v":{"$error":"#NAME?"}},{"$f":"IF(INDEX(periode4,NEVAL,Nenfant)=\"B\",\"X\",\"\")","v":{"$error":"#NAME?"}},{"$f":"IF(INDEX(periode4,NEVAL,Nenfant)=\"A\",\"X\",\"\")","v":{"$error":"#NAME?"}},null,{"$f":"IF(INDEX(periode5,NEVAL,Nenfant)=\"D\",\"X\",\"\")","v":{"$error":"#NAME?"}},{"$f":"IF(INDEX(periode5,NEVAL,Nenfant)=\"C\",\"X\",\"\")","v":{"$error":"#NAME?"}},{"$f":"IF(INDEX(periode5,NEVAL,Nenfant)=\"B\",\"X\",\"\")","v":{"$error":"#NAME?"}},{"$f":"IF(INDEX(periode5,NEVAL,Nenfant)=\"A\",\"X\",\"\")","v":{"$error":"#NAME?"}},null,{"$f":"IF(INDEX(periode6,NEVAL,Nenfant)=\"D\",\"X\",\"\")","v":{"$error":"#NAME?"}},{"$f":"IF(INDEX(periode6,NEVAL,Nenfant)=\"C\",\"X\",\"\")","v":{"$error":"#NAME?"}},{"$f":"IF(INDEX(periode6,NEVAL,Nenfant)=\"B\",\"X\",\"\")","v":{"$error":"#NAME?"}},{"$f":"IF(INDEX(periode6,NEVAL,Nenfant)=\"A\",\"X\",\"\")","v":{"$error":"#NAME?"}}]
[88,{"$nulls":7},{"$f":"COUNTIF($G88:$G91,\"X\")","v":0},{"$f":"COUNTIF($H88:$H91,\"X\")","v":0},{"$f":"COUNTIF($I95:$I98,\"X\")","v":0},{"$f":"COUNTIF($J95:$J98,\"X\")","v":0},null,{"$f":"COUNTIF($G88:$G91,\"X\")","v":0},{"$f":"COUNTIF($H88:$H91,\"X\")","v":0},{"$f":"COUNTIF($I95:$I98,\"X\")","v":0},{"$f":"COUNTIF($J95:$J98,\"X\")","v":0},null,{"$f":"COUNTIF($G88:$G91,\"X\")","v":0},{"$f":"COUNTIF($H88:$H91,\"X\")","v":0},{"$f":"COUNTIF($I95:$I98,\"X\")","v":0},{"$f":"COUNTIF(V95:V98,\"X\")","v":0},null,{"$f":"COUNTIF($G88:$G91,\"X\")","v":0},{"$f":"COUNTIF($H88:$H91,\"X\")","v":0},{"$f":"COUNTIF($I95:$I98,\"X\")","v":0},{"$f":"COUNTIF(AA95:AA98,\"X\")","v":0},null,{"$f":"COUNTIF($G88:$G91,\"X\")","v":0},{"$f":"COUNTIF($H88:$H91,\"X\")","v":0},{"$f":"COUNTIF($I95:$I98,\"X\")","v":0},{"$f":"COUNTIF($J95:$J98,\"X\")","v":0},null,{"$f":"COUNTIF($G88:$G91,\"X\")","v":0},{"$f":"COUNTIF($H88:$H91,\"X\")","v":0},{"$f":"COUNTIF($I95:$I98,\"X\")","v":0},{"$f":"COUNTIF($J95:$J98,\"X\")","v":0}]
[89,{"$nulls":7},{"$f":"IF(INDEX(periode1,NEVAL,Nenfant)=\"D\",\"X\",\"\")","v":{"$error":"#NAME?"}},{"$f":"IF(INDEX(periode1,NEVAL,Nenfant)=\"C\",\"X\",\"\")","v":{"$error":"#NAME?"}},{"$f":"IF(INDEX(periode1,NEVAL,Nenfant)=\"B\",\"X\",\"\")","v":{"$error":"#NAME?"}},{"$f":"IF(INDEX(periode1,NEVAL,Nenfant)=\"A\",\"X\",\"\")","v":{"$error":"#NAME?"}},null,{"$f":"IF(INDEX(periode2,NEVAL,Nenfant)=\"D\",\"X\",\"\")","v":{"$error":"#NAME?"}},{"$f":"IF(INDEX(periode2,NEVAL,Nenfant)=\"C\",\"X\",\"\")","v":{"$error":"#NAME?"}},{"$f":"IF(INDEX(periode2,NEVAL,Nenfant)=\"B\",\"X\",\"\")","v":{"$error":"#NAME?"}},{"$f":"IF(INDEX(periode2,NEVAL,Nenfant)=\"A\",\"X\",\"\")","v":{"$error":"#NAME?"}},null,{"$f":"IF(INDEX(periode3,NEVAL,Nenfant)=\"D\",\"X\",\"\")","v":{"$error":"#NAME?"}},{"$f":"IF(INDEX(periode3,NEVAL,Nenfant)=\"C\",\"X\",\"\")","v":{"$error":"#NAME?"}},{"$f":"IF(INDEX(periode3,NEVAL,Nenfant)=\"B\",\"X\",\"\")","v":{"$error":"#NAME?"}},{"$f":"IF(INDEX(periode3,NEVAL,Nenfant)=\"A\",\"X\",\"\")","v":{"$error":"#NAME?"}},null,{"$f":"IF(INDEX(periode4,NEVAL,Nenfant)=\"D\",\"X\",\"\")","v":{"$error":"#NAME?"}},{"$f":"IF(INDEX(periode4,NEVAL,Nenfant)=\"C\",\"X\",\"\")","v":{"$error":"#NAME?"}},{"$f":"IF(INDEX(periode4,NEVAL,Nenfant)=\"B\",\"X\",\"\")","v":{"$error":"#NAME?"}},{"$f":"IF(INDEX(periode4,NEVAL,Nenfant)=\"A\",\"X\",\"\")","v":{"$error":"#NAME?"}},null,{"$f":"IF(INDEX(periode5,NEVAL,Nenfant)=\"D\",\"X\",\"\")","v":{"$error":"#NAME?"}},{"$f":"IF(INDEX(periode5,NEVAL,Nenfant)=\"C\",\"X\",\"\")","v":{"$error":"#NAME?"}},{"$f":"IF(INDEX(periode5,NEVAL,Nenfant)=\"B\",\"X\",\"\")","v":{"$error":"#NAME?"}},{"$f":"IF(INDEX(periode5,NEVAL,Nenfant)=\"A\",\"X\",\"\")","v":{"$error":"#NAME?"}},null,{"$f":"IF(INDEX(periode6,NEVAL,Nenfant)=\"D\",\"X\",\"\")","v":{"$error":"#NAME?"}},{"$f":"IF(INDEX(periode6,NEVAL,Nenfant)=\"C\",\"X\",\"\")","v":{"$error":"#NAME?"}},{"$f":"IF(INDEX(periode6,NEVAL,Nenfant)=\"B\",\"X\",\"\")","v":{"$error":"#NAME?"}},{"$f":"IF(INDEX(periode6,NEVAL,Nenfant)=\"A\",\"X\",\"\")","v":{"$error":"#NAME?"}}]
[90,{"$nulls":7},{"$f":"IF(INDEX(periode1,NEVAL,Nenfant)=\"D\",\"X\",\"\")","v":{"$error":"#NAME?"}},{"$f":"IF(INDEX(periode1,NEVAL,Nenfant)=\"C\",\"X\",\"\")","v":{"$error":"#NAME?"}},{"$f":"IF(INDEX(periode1,NEVAL,Nenfant)=\"B\",\"X\",\"\")","v":{"$error":"#NAME?"}},{"$f":"IF(INDEX(periode1,NEVAL,Nenfant)=\"A\",\"X\",\"\")","v":{"$error":"#NAME?"}},null,{"$f":"IF(INDEX(periode2,NEVAL,Nenfant)=\"D\",\"X\",\"\")","v":{"$error":"#NAME?"}},{"$f":"IF(INDEX(periode2,NEVAL,Nenfant)=\"C\",\"X\",\"\")","v":{"$error":"#NAME?"}},{"$f":"IF(INDEX(periode2,NEVAL,Nenfant)=\"B\",\"X\",\"\")","v":{"$error":"#NAME?"}},{"$f":"IF(INDEX(periode2,NEVAL,Nenfant)=\"A\",\"X\",\"\")","v":{"$error":"#NAME?"}},null,{"$f":"IF(INDEX(periode3,NEVAL,Nenfant)=\"D\",\"X\",\"\")","v":{"$error":"#NAME?"}},{"$f":"IF(INDEX(periode3,NEVAL,Nenfant)=\"C\",\"X\",\"\")","v":{"$error":"#NAME?"}},{"$f":"IF(INDEX(periode3,NEVAL,Nenfant)=\"B\",\"X\",\"\")","v":{"$error":"#NAME?"}},{"$f":"IF(INDEX(periode3,NEVAL,Nenfant)=\"A\",\"X\",\"\")","v":{"$error":"#NAME?"}},null,{"$f":"IF(INDEX(periode4,NEVAL,Nenfant)=\"D\",\"X\",\"\")","v":{"$error":"#NAME?"}},{"$f":"IF(INDEX(periode4,NEVAL,Nenfant)=\"C\",\"X\",\"\")","v":{"$error":"#NAME?"}},{"$f":"IF(INDEX(periode4,NEVAL,Nenfant)=\"B\",\"X\",\"\")","v":{"$error":"#NAME?"}},{"$f":"IF(INDEX(periode4,NEVAL,Nenfant)=\"A\",\"X\",\"\")","v":{"$error":"#NAME?"}},null,{"$f":"IF(INDEX(periode5,NEVAL,Nenfant)=\"D\",\"X\",\"\")","v":{"$error":"#NAME?"}},{"$f":"IF(INDEX(periode5,NEVAL,Nenfant)=\"C\",\"X\",\"\")","v":{"$error":"#NAME?"}},{"$f":"IF(INDEX(periode5,NEVAL,Nenfant)=\"B\",\"X\",\"\")","v":{"$error":"#NAME?"}},{"$f":"IF(INDEX(periode5,NEVAL,Nenfant)=\"A\",\"X\",\"\")","v":{"$error":"#NAME?"}},null,{"$f":"IF(INDEX(periode6,NEVAL,Nenfant)=\"D\",\"X\",\"\")","v":{"$error":"#NAME?"}},{"$f":"IF(INDEX(periode6,NEVAL,Nenfant)=\"C\",\"X\",\"\")","v":{"$error":"#NAME?"}},{"$f":"IF(INDEX(periode6,NEVAL,Nenfant)=\"B\",\"X\",\"\")","v":{"$error":"#NAME?"}},{"$f":"IF(INDEX(periode6,NEVAL,Nenfant)=\"A\",\"X\",\"\")","v":{"$error":"#NAME?"}}]
[91,{"$nulls":7},{"$f":"IF(INDEX(periode1,NEVAL,Nenfant)=\"D\",\"X\",\"\")","v":{"$error":"#NAME?"}},{"$f":"IF(INDEX(periode1,NEVAL,Nenfant)=\"C\",\"X\",\"\")","v":{"$error":"#NAME?"}},{"$f":"IF(INDEX(periode1,NEVAL,Nenfant)=\"B\",\"X\",\"\")","v":{"$error":"#NAME?"}},{"$f":"IF(INDEX(periode1,NEVAL,Nenfant)=\"A\",\"X\",\"\")","v":{"$error":"#NAME?"}},null,{"$f":"IF(INDEX(periode2,NEVAL,Nenfant)=\"D\",\"X\",\"\")","v":{"$error":"#NAME?"}},{"$f":"IF(INDEX(periode2,NEVAL,Nenfant)=\"C\",\"X\",\"\")","v":{"$error":"#NAME?"}},{"$f":"IF(INDEX(periode2,NEVAL,Nenfant)=\"B\",\"X\",\"\")","v":{"$error":"#NAME?"}},{"$f":"IF(INDEX(periode2,NEVAL,Nenfant)=\"A\",\"X\",\"\")","v":{"$error":"#NAME?"}},null,{"$f":"IF(INDEX(periode3,NEVAL,Nenfant)=\"D\",\"X\",\"\")","v":{"$error":"#NAME?"}},{"$f":"IF(INDEX(periode3,NEVAL,Nenfant)=\"C\",\"X\",\"\")","v":{"$error":"#NAME?"}},{"$f":"IF(INDEX(periode3,NEVAL,Nenfant)=\"B\",\"X\",\"\")","v":{"$error":"#NAME?"}},{"$f":"IF(INDEX(periode3,NEVAL,Nenfant)=\"A\",\"X\",\"\")","v":{"$error":"#NAME?"}},null,{"$f":"IF(INDEX(periode4,NEVAL,Nenfant)=\"D\",\"X\",\"\")","v":{"$error":"#NAME?"}},{"$f":"IF(INDEX(periode4,NEVAL,Nenfant)=\"C\",\"X\",\"\")","v":{"$error":"#NAME?"}},{"$f":"IF(INDEX(periode4,NEVAL,Nenfant)=\"B\",\"X\",\"\")","v":{"$error":"#NAME?"}},{"$f":"IF(INDEX(periode4,NEVAL,Nenfant)=\"A\",\"X\",\"\")","v":{"$error":"#NAME?"}},null,{"$f":"IF(INDEX(periode5,NEVAL,Nenfant)=\"D\",\"X\",\"\")","v":{"$error":"#NAME?"}},{"$f":"IF(INDEX(periode5,NEVAL,Nenfant)=\"C\",\"X\",\"\")","v":{"$error":"#NAME?"}},{"$f":"IF(INDEX(periode5,NEVAL,Nenfant)=\"B\",\"X\",\"\")","v":{"$error":"#NAME?"}},{"$f":"IF(INDEX(periode5,NEVAL,Nenfant)=\"A\",\"X\",\"\")","v":{"$error":"#NAME?"}},null,{"$f":"IF(INDEX(periode6,NEVAL,Nenfant)=\"D\",\"X\",\"\")","v":{"$error":"#NAME?"}},{"$f":"IF(INDEX(periode6,NEVAL,Nenfant)=\"C\",\"X\",\"\")","v":{"$error":"#NAME?"}},{"$f":"IF(INDEX(periode6,NEVAL,Nenfant)=\"B\",\"X\",\"\")","v":{"$error":"#NAME?"}},{"$f":"IF(INDEX(periode6,NEVAL,Nenfant)=\"A\",\"X\",\"\")","v":{"$error":"#NAME?"}}]
[92,{"$nulls":7},{"$f":"COUNTIF($G101:$G103,\"X\")","v":0},{"$f":"COUNTIF($H101:$H103,\"X\")","v":0},{"$f":"COUNTIF($I99:$I101,\"X\")","v":0},{"$f":"COUNTIF($J99:$J101,\"X\")","v":0},null,{"$f":"COUNTIF($G101:$G103,\"X\")","v":0},{"$f":"COUNTIF($H101:$H103,\"X\")","v":0},{"$f":"COUNTIF($I99:$I101,\"X\")","v":0},{"$f":"COUNTIF($J99:$J101,\"X\")","v":0},null,{"$f":"COUNTIF($G101:$G103,\"X\")","v":0},{"$f":"COUNTIF($H101:$H103,\"X\")","v":0},{"$f":"COUNTIF($I99:$I101,\"X\")","v":0},{"$f":"COUNTIF($J99:$J101,\"X\")","v":0},null,{"$f":"COUNTIF($G101:$G103,\"X\")","v":0},{"$f":"COUNTIF($H101:$H103,\"X\")","v":0},{"$f":"COUNTIF($I99:$I101,\"X\")","v":0},{"$f":"COUNTIF(AA99:AA101,\"X\")","v":0},null,{"$f":"COUNTIF($G101:$G103,\"X\")","v":0},{"$f":"COUNTIF($H101:$H103,\"X\")","v":0},{"$f":"COUNTIF($I99:$I101,\"X\")","v":0},{"$f":"COUNTIF($J99:$J101,\"X\")","v":0},null,{"$f":"COUNTIF($G101:$G103,\"X\")","v":0},{"$f":"COUNTIF($H101:$H103,\"X\")","v":0},{"$f":"COUNTIF($I99:$I101,\"X\")","v":0},{"$f":"COUNTIF($J99:$J101,\"X\")","v":0}]
[93,{"$nulls":7},{"$f":"IF(INDEX(periode1,NEVAL,Nenfant)=\"D\",\"X\",\"\")","v":{"$error":"#NAME?"}},{"$f":"IF(INDEX(periode1,NEVAL,Nenfant)=\"C\",\"X\",\"\")","v":{"$error":"#NAME?"}},{"$f":"IF(INDEX(periode1,NEVAL,Nenfant)=\"B\",\"X\",\"\")","v":{"$error":"#NAME?"}},{"$f":"IF(INDEX(periode1,NEVAL,Nenfant)=\"A\",\"X\",\"\")","v":{"$error":"#NAME?"}},null,{"$f":"IF(INDEX(periode2,NEVAL,Nenfant)=\"D\",\"X\",\"\")","v":{"$error":"#NAME?"}},{"$f":"IF(INDEX(periode2,NEVAL,Nenfant)=\"C\",\"X\",\"\")","v":{"$error":"#NAME?"}},{"$f":"IF(INDEX(periode2,NEVAL,Nenfant)=\"B\",\"X\",\"\")","v":{"$error":"#NAME?"}},{"$f":"IF(INDEX(periode2,NEVAL,Nenfant)=\"A\",\"X\",\"\")","v":{"$error":"#NAME?"}},null,{"$f":"IF(INDEX(periode3,NEVAL,Nenfant)=\"D\",\"X\",\"\")","v":{"$error":"#NAME?"}},{"$f":"IF(INDEX(periode3,NEVAL,Nenfant)=\"C\",\"X\",\"\")","v":{"$error":"#NAME?"}},{"$f":"IF(INDEX(periode3,NEVAL,Nenfant)=\"B\",\"X\",\"\")","v":{"$error":"#NAME?"}},{"$f":"IF(INDEX(periode3,NEVAL,Nenfant)=\"A\",\"X\",\"\")","v":{"$error":"#NAME?"}},null,{"$f":"IF(INDEX(periode4,NEVAL,Nenfant)=\"D\",\"X\",\"\")","v":{"$error":"#NAME?"}},{"$f":"IF(INDEX(periode4,NEVAL,Nenfant)=\"C\",\"X\",\"\")","v":{"$error":"#NAME?"}},{"$f":"IF(INDEX(periode4,NEVAL,Nenfant)=\"B\",\"X\",\"\")","v":{"$error":"#NAME?"}},{"$f":"IF(INDEX(periode4,NEVAL,Nenfant)=\"A\",\"X\",\"\")","v":{"$error":"#NAME?"}},null,{"$f":"IF(INDEX(periode5,NEVAL,Nenfant)=\"D\",\"X\",\"\")","v":{"$error":"#NAME?"}},{"$f":"IF(INDEX(periode5,NEVAL,Nenfant)=\"C\",\"X\",\"\")","v":{"$error":"#NAME?"}},{"$f":"IF(INDEX(periode5,NEVAL,Nenfant)=\"B\",\"X\",\"\")","v":{"$error":"#NAME?"}},{"$f":"IF(INDEX(periode5,NEVAL,Nenfant)=\"A\",\"X\",\"\")","v":{"$error":"#NAME?"}},null,{"$f":"IF(INDEX(periode6,NEVAL,Nenfant)=\"D\",\"X\",\"\")","v":{"$error":"#NAME?"}},{"$f":"IF(INDEX(periode6,NEVAL,Nenfant)=\"C\",\"X\",\"\")","v":{"$error":"#NAME?"}},{"$f":"IF(INDEX(periode6,NEVAL,Nenfant)=\"B\",\"X\",\"\")","v":{"$error":"#NAME?"}},{"$f":"IF(INDEX(periode6,NEVAL,Nenfant)=\"A\",\"X\",\"\")","v":{"$error":"#NAME?"}}]
[94,{"$nulls":7},{"$f":"IF(INDEX(periode1,NEVAL,Nenfant)=\"D\",\"X\",\"\")","v":{"$error":"#NAME?"}},{"$f":"IF(INDEX(periode1,NEVAL,Nenfant)=\"C\",\"X\",\"\")","v":{"$error":"#NAME?"}},{"$f":"IF(INDEX(periode1,NEVAL,Nenfant)=\"B\",\"X\",\"\")","v":{"$error":"#NAME?"}},{"$f":"IF(INDEX(periode1,NEVAL,Nenfant)=\"A\",\"X\",\"\")","v":{"$error":"#NAME?"}},null,{"$f":"IF(INDEX(periode2,NEVAL,Nenfant)=\"D\",\"X\",\"\")","v":{"$error":"#NAME?"}},{"$f":"IF(INDEX(periode2,NEVAL,Nenfant)=\"C\",\"X\",\"\")","v":{"$error":"#NAME?"}},{"$f":"IF(INDEX(periode2,NEVAL,Nenfant)=\"B\",\"X\",\"\")","v":{"$error":"#NAME?"}},{"$f":"IF(INDEX(periode2,NEVAL,Nenfant)=\"A\",\"X\",\"\")","v":{"$error":"#NAME?"}},null,{"$f":"IF(INDEX(periode3,NEVAL,Nenfant)=\"D\",\"X\",\"\")","v":{"$error":"#NAME?"}},{"$f":"IF(INDEX(periode3,NEVAL,Nenfant)=\"C\",\"X\",\"\")","v":{"$error":"#NAME?"}},{"$f":"IF(INDEX(periode3,NEVAL,Nenfant)=\"B\",\"X\",\"\")","v":{"$error":"#NAME?"}},{"$f":"IF(INDEX(periode3,NEVAL,Nenfant)=\"A\",\"X\",\"\")","v":{"$error":"#NAME?"}},null,{"$f":"IF(INDEX(periode4,NEVAL,Nenfant)=\"D\",\"X\",\"\")","v":{"$error":"#NAME?"}},{"$f":"IF(INDEX(periode4,NEVAL,Nenfant)=\"C\",\"X\",\"\")","v":{"$error":"#NAME?"}},{"$f":"IF(INDEX(periode4,NEVAL,Nenfant)=\"B\",\"X\",\"\")","v":{"$error":"#NAME?"}},{"$f":"IF(INDEX(periode4,NEVAL,Nenfant)=\"A\",\"X\",\"\")","v":{"$error":"#NAME?"}},null,{"$f":"IF(INDEX(periode5,NEVAL,Nenfant)=\"D\",\"X\",\"\")","v":{"$error":"#NAME?"}},{"$f":"IF(INDEX(periode5,NEVAL,Nenfant)=\"C\",\"X\",\"\")","v":{"$error":"#NAME?"}},{"$f":"IF(INDEX(periode5,NEVAL,Nenfant)=\"B\",\"X\",\"\")","v":{"$error":"#NAME?"}},{"$f":"IF(INDEX(periode5,NEVAL,Nenfant)=\"A\",\"X\",\"\")","v":{"$error":"#NAME?"}},null,{"$f":"IF(INDEX(periode6,NEVAL,Nenfant)=\"D\",\"X\",\"\")","v":{"$error":"#NAME?"}},{"$f":"IF(INDEX(periode6,NEVAL,Nenfant)=\"C\",\"X\",\"\")","v":{"$error":"#NAME?"}},{"$f":"IF(INDEX(periode6,NEVAL,Nenfant)=\"B\",\"X\",\"\")","v":{"$error":"#NAME?"}},{"$f":"IF(INDEX(periode6,NEVAL,Nenfant)=\"A\",\"X\",\"\")","v":{"$error":"#NAME?"}}]
[95,{"$nulls":7},{"$f":"IF(INDEX(periode1,NEVAL,Nenfant)=\"D\",\"X\",\"\")","v":{"$error":"#NAME?"}},{"$f":"IF(INDEX(periode1,NEVAL,Nenfant)=\"C\",\"X\",\"\")","v":{"$error":"#NAME?"}},{"$f":"IF(INDEX(periode1,NEVAL,Nenfant)=\"B\",\"X\",\"\")","v":{"$error":"#NAME?"}},{"$f":"IF(INDEX(periode1,NEVAL,Nenfant)=\"A\",\"X\",\"\")","v":{"$error":"#NAME?"}},null,{"$f":"IF(INDEX(periode2,NEVAL,Nenfant)=\"D\",\"X\",\"\")","v":{"$error":"#NAME?"}},{"$f":"IF(INDEX(periode2,NEVAL,Nenfant)=\"C\",\"X\",\"\")","v":{"$error":"#NAME?"}},{"$f":"IF(INDEX(periode2,NEVAL,Nenfant)=\"B\",\"X\",\"\")","v":{"$error":"#NAME?"}},{"$f":"IF(INDEX(periode2,NEVAL,Nenfant)=\"A\",\"X\",\"\")","v":{"$error":"#NAME?"}},null,{"$f":"IF(INDEX(periode3,NEVAL,Nenfant)=\"D\",\"X\",\"\")","v":{"$error":"#NAME?"}},{"$f":"IF(INDEX(periode3,NEVAL,Nenfant)=\"C\",\"X\",\"\")","v":{"$error":"#NAME?"}},{"$f":"IF(INDEX(periode3,NEVAL,Nenfant)=\"B\",\"X\",\"\")","v":{"$error":"#NAME?"}},{"$f":"IF(INDEX(periode3,NEVAL,Nenfant)=\"A\",\"X\",\"\")","v":{"$error":"#NAME?"}},null,{"$f":"IF(INDEX(periode4,NEVAL,Nenfant)=\"D\",\"X\",\"\")","v":{"$error":"#NAME?"}},{"$f":"IF(INDEX(periode4,NEVAL,Nenfant)=\"C\",\"X\",\"\")","v":{"$error":"#NAME?"}},{"$f":"IF(INDEX(periode4,NEVAL,Nenfant)=\"B\",\"X\",\"\")","v":{"$error":"#NAME?"}},{"$f":"IF(INDEX(periode4,NEVAL,Nenfant)=\"A\",\"X\",\"\")","v":{"$error":"#NAME?"}},null,{"$f":"IF(INDEX(periode5,NEVAL,Nenfant)=\"D\",\"X\",\"\")","v":{"$error":"#NAME?"}},{"$f":"IF(INDEX(periode5,NEVAL,Nenfant)=\"C\",\"X\",\"\")","v":{"$error":"#NAME?"}},{"$f":"IF(INDEX(periode5,NEVAL,Nenfant)=\"B\",\"X\",\"\")","v":{"$error":"#NAME?"}},{"$f":"IF(INDEX(periode5,NEVAL,Nenfant)=\"A\",\"X\",\"\")","v":{"$error":"#NAME?"}},null,{"$f":"IF(INDEX(periode6,NEVAL,Nenfant)=\"D\",\"X\",\"\")","v":{"$error":"#NAME?"}},{"$f":"IF(INDEX(periode6,NEVAL,Nenfant)=\"C\",\"X\",\"\")","v":{"$error":"#NAME?"}},{"$f":"IF(INDEX(periode6,NEVAL,Nenfant)=\"B\",\"X\",\"\")","v":{"$error":"#NAME?"}},{"$f":"IF(INDEX(periode6,NEVAL,Nenfant)=\"A\",\"X\",\"\")","v":{"$error":"#NAME?"}}]
[96,{"$nulls":7},{"$f":"COUNTIF($G104:$G106,\"X\")","v":0},{"$f":"COUNTIF($H104:$H106,\"X\")","v":0},{"$f":"COUNTIF($I103:$I108,\"X\")","v":0},{"$f":"COUNTIF($J103:$J108,\"X\")","v":0},null,{"$f":"COUNTIF($G104:$G106,\"X\")","v":0},{"$f":"COUNTIF($H104:$H106,\"X\")","v":0},{"$f":"COUNTIF($I103:$I108,\"X\")","v":0},{"$f":"COUNTIF($J103:$J108,\"X\")","v":0},null,{"$f":"COUNTIF($G104:$G106,\"X\")","v":0},{"$f":"COUNTIF($H104:$H106,\"X\")","v":0},{"$f":"COUNTIF($I103:$I108,\"X\")","v":0},{"$f":"COUNTIF($J103:$J108,\"X\")","v":0},null,{"$f":"COUNTIF($G104:$G106,\"X\")","v":0},{"$f":"COUNTIF($H104:$H106,\"X\")","v":0},{"$f":"COUNTIF($I103:$I108,\"X\")","v":0},{"$f":"COUNTIF(AA103:AA108,\"X\")","v":0},null,{"$f":"COUNTIF($G104:$G106,\"X\")","v":0},{"$f":"COUNTIF($H104:$H106,\"X\")","v":0},{"$f":"COUNTIF($I103:$I108,\"X\")","v":0},{"$f":"COUNTIF($J103:$J108,\"X\")","v":0},null,{"$f":"COUNTIF($G104:$G106,\"X\")","v":0},{"$f":"COUNTIF($H104:$H106,\"X\")","v":0},{"$f":"COUNTIF($I103:$I108,\"X\")","v":0},{"$f":"COUNTIF($J103:$J108,\"X\")","v":0}]
[97,{"$nulls":7},{"$f":"IF(INDEX(periode1,NEVAL,Nenfant)=\"D\",\"X\",\"\")","v":{"$error":"#NAME?"}},{"$f":"IF(INDEX(periode1,NEVAL,Nenfant)=\"C\",\"X\",\"\")","v":{"$error":"#NAME?"}},{"$f":"IF(INDEX(periode1,NEVAL,Nenfant)=\"B\",\"X\",\"\")","v":{"$error":"#NAME?"}},{"$f":"IF(INDEX(periode1,NEVAL,Nenfant)=\"A\",\"X\",\"\")","v":{"$error":"#NAME?"}},null,{"$f":"IF(INDEX(periode2,NEVAL,Nenfant)=\"D\",\"X\",\"\")","v":{"$error":"#NAME?"}},{"$f":"IF(INDEX(periode2,NEVAL,Nenfant)=\"C\",\"X\",\"\")","v":{"$error":"#NAME?"}},{"$f":"IF(INDEX(periode2,NEVAL,Nenfant)=\"B\",\"X\",\"\")","v":{"$error":"#NAME?"}},{"$f":"IF(INDEX(periode2,NEVAL,Nenfant)=\"A\",\"X\",\"\")","v":{"$error":"#NAME?"}},null,{"$f":"IF(INDEX(periode3,NEVAL,Nenfant)=\"D\",\"X\",\"\")","v":{"$error":"#NAME?"}},{"$f":"IF(INDEX(periode3,NEVAL,Nenfant)=\"C\",\"X\",\"\")","v":{"$error":"#NAME?"}},{"$f":"IF(INDEX(periode3,NEVAL,Nenfant)=\"B\",\"X\",\"\")","v":{"$error":"#NAME?"}},{"$f":"IF(INDEX(periode3,NEVAL,Nenfant)=\"A\",\"X\",\"\")","v":{"$error":"#NAME?"}},null,{"$f":"IF(INDEX(periode4,NEVAL,Nenfant)=\"D\",\"X\",\"\")","v":{"$error":"#NAME?"}},{"$f":"IF(INDEX(periode4,NEVAL,Nenfant)=\"C\",\"X\",\"\")","v":{"$error":"#NAME?"}},{"$f":"IF(INDEX(periode4,NEVAL,Nenfant)=\"B\",\"X\",\"\")","v":{"$error":"#NAME?"}},{"$f":"IF(INDEX(periode4,NEVAL,Nenfant)=\"A\",\"X\",\"\")","v":{"$error":"#NAME?"}},null,{"$f":"IF(INDEX(periode5,NEVAL,Nenfant)=\"D\",\"X\",\"\")","v":{"$error":"#NAME?"}},{"$f":"IF(INDEX(periode5,NEVAL,Nenfant)=\"C\",\"X\",\"\")","v":{"$error":"#NAME?"}},{"$f":"IF(INDEX(periode5,NEVAL,Nenfant)=\"B\",\"X\",\"\")","v":{"$error":"#NAME?"}},{"$f":"IF(INDEX(periode5,NEVAL,Nenfant)=\"A\",\"X\",\"\")","v":{"$error":"#NAME?"}},null,{"$f":"IF(INDEX(periode6,NEVAL,Nenfant)=\"D\",\"X\",\"\")","v":{"$error":"#NAME?"}},{"$f":"IF(INDEX(periode6,NEVAL,Nenfant)=\"C\",\"X\",\"\")","v":{"$error":"#NAME?"}},{"$f":"IF(INDEX(periode6,NEVAL,Nenfant)=\"B\",\"X\",\"\")","v":{"$error":"#NAME?"}},{"$f":"IF(INDEX(periode6,NEVAL,Nenfant)=\"A\",\"X\",\"\")","v":{"$error":"#NAME?"}}]
[98,{"$nulls":7},{"$error":"#NAME?"},{"$error":"#NAME?"},{"$error":"#NAME?"},{"$error":"#NAME?"},null,{"$error":"#NAME?"},{"$error":"#NAME?"},{"$error":"#NAME?"},{"$error":"#NAME?"},null,{"$error":"#NAME?"},{"$error":"#NAME?"},{"$error":"#NAME?"},{"$error":"#NAME?"},null,{"$error":"#NAME?"},{"$error":"#NAME?"},{"$error":"#NAME?"},{"$error":"#NAME?"},null,{"$error":"#NAME?"},{"$error":"#NAME?"},{"$error":"#NAME?"},{"$error":"#NAME?"},null,{"$error":"#NAME?"},{"$error":"#NAME?"},{"$error":"#NAME?"},{"$error":"#NAME?"}]
[99,{"$nulls":7},{"$error":"#NAME?"},{"$error":"#NAME?"},{"$error":"#NAME?"},{"$error":"#NAME?"},null,{"$error":"#NAME?"},{"$error":"#NAME?"},{"$error":"#NAME?"},{"$error":"#NAME?"},null,{"$error":"#NAME?"},{"$error":"#NAME?"},{"$error":"#NAME?"},{"$error":"#NAME?"},null,{"$error":"#NAME?"},{"$error":"#NAME?"},{"$error":"#NAME?"},{"$error":"#NAME?"},null,{"$error":"#NAME?"},{"$error":"#NAME?"},{"$error":"#NAME?"},{"$error":"#NAME?"},null,{"$error":"#NAME?"},{"$error":"#NAME?"},{"$error":"#NAME?"},{"$error":"#NAME?"}]
[100,{"$nulls":7},{"$error":"#NAME?"},{"$error":"#NAME?"},{"$error":"#NAME?"},{"$error":"#NAME?"},null,{"$error":"#NAME?"},{"$error":"#NAME?"},{"$error":"#NAME?"},{"$error":"#NAME?"},null,{"$error":"#NAME?"},{"$error":"#NAME?"},{"$error":"#NAME?"},{"$error":"#NAME?"},null,{"$error":"#NAME?"},{"$error":"#NAME?"},{"$error":"#NAME?"},{"$error":"#NAME?"},null,{"$error":"#NAME?"},{"$error":"#NAME?"},{"$error":"#NAME?"},{"$error":"#NAME?"},null,{"$error":"#NAME?"},{"$error":"#NAME?"},{"$error":"#NAME?"},{"$error":"#NAME?"}]
[101,{"$nulls":7},{"$error":"#NAME?"},{"$error":"#NAME?"},{"$error":"#NAME?"},{"$error":"#NAME?"},null,{"$error":"#NAME?"},{"$error":"#NAME?"},{"$error":"#NAME?"},{"$error":"#NAME?"},null,{"$error":"#NAME?"},{"$error":"#NAME?"},{"$error":"#NAME?"},{"$error":"#NAME?"},null,{"$error":"#NAME?"},{"$error":"#NAME?"},{"$error":"#NAME?"},{"$error":"#NAME?"},null,{"$error":"#NAME?"},{"$error":"#NAME?"},{"$error":"#NAME?"},{"$error":"#NAME?"},null,{"$error":"#NAME?"},{"$error":"#NAME?"},{"$error":"#NAME?"},{"$error":"#NAME?"}]
[102,{"$nulls":7},{"$error":"#NAME?"},{"$error":"#NAME?"},{"$error":"#NAME?"},{"$error":"#NAME?"},null,{"$error":"#NAME?"},{"$error":"#NAME?"},{"$error":"#NAME?"},{"$error":"#NAME?"},null,{"$error":"#NAME?"},{"$error":"#NAME?"},{"$error":"#NAME?"},{"$error":"#NAME?"},null,{"$error":"#NAME?"},{"$error":"#NAME?"},{"$error":"#NAME?"},{"$error":"#NAME?"},null,{"$error":"#NAME?"},{"$error":"#NAME?"},{"$error":"#NAME?"},{"$error":"#NAME?"},null,{"$error":"#NAME?"},{"$error":"#NAME?"},{"$error":"#NAME?"},{"$error":"#NAME?"}]
[103,{"$nulls":7},{"$f":"COUNTIF($G110:$G113,\"X\")","v":0},{"$f":"COUNTIF($H110:$H113,\"X\")","v":0},{"$f":"COUNTIF($I110:$I114,\"X\")","v":0},{"$f":"COUNTIF($J110:$J114,\"X\")","v":0},null,{"$f":"COUNTIF($G110:$G113,\"X\")","v":0},{"$f":"COUNTIF($H110:$H113,\"X\")","v":0},{"$f":"COUNTIF($I110:$I114,\"X\")","v":0},{"$f":"COUNTIF($J110:$J114,\"X\")","v":0},null,{"$f":"COUNTIF($G110:$G113,\"X\")","v":0},{"$f":"COUNTIF($H110:$H113,\"X\")","v":0},{"$f":"COUNTIF($I110:$I114,\"X\")","v":0},{"$f":"COUNTIF($J110:$J114,\"X\")","v":0},null,{"$f":"COUNTIF($G110:$G113,\"X\")","v":0},{"$f":"COUNTIF($H110:$H113,\"X\")","v":0},{"$f":"COUNTIF($I110:$I114,\"X\")","v":0},{"$f":"COUNTIF(AA110:AA114,\"X\")","v":0},null,{"$f":"COUNTIF($G110:$G113,\"X\")","v":0},{"$f":"COUNTIF($H110:$H113,\"X\")","v":0},{"$f":"COUNTIF($I110:$I114,\"X\")","v":0},{"$f":"COUNTIF($J110:$J114,\"X\")","v":0},null,{"$f":"COUNTIF($G110:$G113,\"X\")","v":0},{"$f":"COUNTIF($H110:$H113,\"X\")","v":0},{"$f":"COUNTIF($I110:$I114,\"X\")","v":0},{"$f":"COUNTIF($J110:$J114,\"X\")","v":0}]
[104,{"$nulls":7},{"$f":"IF(INDEX(periode1,NEVAL,Nenfant)=\"D\",\"X\",\"\")","v":{"$error":"#NAME?"}},{"$f":"IF(INDEX(periode1,NEVAL,Nenfant)=\"C\",\"X\",\"\")","v":{"$error":"#NAME?"}},{"$f":"IF(INDEX(periode1,NEVAL,Nenfant)=\"B\",\"X\",\"\")","v":{"$error":"#NAME?"}},{"$f":"IF(INDEX(periode1,NEVAL,Nenfant)=\"A\",\"X\",\"\")","v":{"$error":"#NAME?"}},null,{"$f":"IF(INDEX(periode2,NEVAL,Nenfant)=\"D\",\"X\",\"\")","v":{"$error":"#NAME?"}},{"$f":"IF(INDEX(periode2,NEVAL,Nenfant)=\"C\",\"X\",\"\")","v":{"$error":"#NAME?"}},{"$f":"IF(INDEX(periode2,NEVAL,Nenfant)=\"B\",\"X\",\"\")","v":{"$error":"#NAME?"}},{"$f":"IF(INDEX(periode2,NEVAL,Nenfant)=\"A\",\"X\",\"\")","v":{"$error":"#NAME?"}},null,{"$f":"IF(INDEX(periode3,NEVAL,Nenfant)=\"D\",\"X\",\"\")","v":{"$error":"#NAME?"}},{"$f":"IF(INDEX(periode3,NEVAL,Nenfant)=\"C\",\"X\",\"\")","v":{"$error":"#NAME?"}},{"$f":"IF(INDEX(periode3,NEVAL,Nenfant)=\"B\",\"X\",\"\")","v":{"$error":"#NAME?"}},{"$f":"IF(INDEX(periode3,NEVAL,Nenfant)=\"A\",\"X\",\"\")","v":{"$error":"#NAME?"}},null,{"$f":"IF(INDEX(periode4,NEVAL,Nenfant)=\"D\",\"X\",\"\")","v":{"$error":"#NAME?"}},{"$f":"IF(INDEX(periode4,NEVAL,Nenfant)=\"C\",\"X\",\"\")","v":{"$error":"#NAME?"}},{"$f":"IF(INDEX(periode4,NEVAL,Nenfant)=\"B\",\"X\",\"\")","v":{"$error":"#NAME?"}},{"$f":"IF(INDEX(periode4,NEVAL,Nenfant)=\"A\",\"X\",\"\")","v":{"$error":"#NAME?"}},null,{"$f":"IF(INDEX(periode5,NEVAL,Nenfant)=\"D\",\"X\",\"\")","v":{"$error":"#NAME?"}},{"$f":"IF(INDEX(periode5,NEVAL,Nenfant)=\"C\",\"X\",\"\")","v":{"$error":"#NAME?"}},{"$f":"IF(INDEX(periode5,NEVAL,Nenfant)=\"B\",\"X\",\"\")","v":{"$error":"#NAME?"}},{"$f":"IF(INDEX(periode5,NEVAL,Nenfant)=\"A\",\"X\",\"\")","v":{"$error":"#NAME?"}},null,{"$f":"IF(INDEX(periode6,NEVAL,Nenfant)=\"D\",\"X\",\"\")","v":{"$error":"#NAME?"}},{"$f":"IF(INDEX(periode6,NEVAL,Nenfant)=\"C\",\"X\",\"\")","v":{"$error":"#NAME?"}},{"$f":"IF(INDEX(periode6,NEVAL,Nenfant)=\"B\",\"X\",\"\")","v":{"$error":"#NAME?"}},{"$f":"IF(INDEX(periode6,NEVAL,Nenfant)=\"A\",\"X\",\"\")","v":{"$error":"#NAME?"}}]
[105,{"$nulls":7},{"$f":"IF(INDEX(periode1,NEVAL,Nenfant)=\"D\",\"X\",\"\")","v":{"$error":"#NAME?"}},{"$f":"IF(INDEX(periode1,NEVAL,Nenfant)=\"C\",\"X\",\"\")","v":{"$error":"#NAME?"}},{"$f":"IF(INDEX(periode1,NEVAL,Nenfant)=\"B\",\"X\",\"\")","v":{"$error":"#NAME?"}},{"$f":"IF(INDEX(periode1,NEVAL,Nenfant)=\"A\",\"X\",\"\")","v":{"$error":"#NAME?"}},null,{"$f":"IF(INDEX(periode2,NEVAL,Nenfant)=\"D\",\"X\",\"\")","v":{"$error":"#NAME?"}},{"$f":"IF(INDEX(periode2,NEVAL,Nenfant)=\"C\",\"X\",\"\")","v":{"$error":"#NAME?"}},{"$f":"IF(INDEX(periode2,NEVAL,Nenfant)=\"B\",\"X\",\"\")","v":{"$error":"#NAME?"}},{"$f":"IF(INDEX(periode2,NEVAL,Nenfant)=\"A\",\"X\",\"\")","v":{"$error":"#NAME?"}},null,{"$f":"IF(INDEX(periode3,NEVAL,Nenfant)=\"D\",\"X\",\"\")","v":{"$error":"#NAME?"}},{"$f":"IF(INDEX(periode3,NEVAL,Nenfant)=\"C\",\"X\",\"\")","v":{"$error":"#NAME?"}},{"$f":"IF(INDEX(periode3,NEVAL,Nenfant)=\"B\",\"X\",\"\")","v":{"$error":"#NAME?"}},{"$f":"IF(INDEX(periode3,NEVAL,Nenfant)=\"A\",\"X\",\"\")","v":{"$error":"#NAME?"}},null,{"$f":"IF(INDEX(periode4,NEVAL,Nenfant)=\"D\",\"X\",\"\")","v":{"$error":"#NAME?"}},{"$f":"IF(INDEX(periode4,NEVAL,Nenfant)=\"C\",\"X\",\"\")","v":{"$error":"#NAME?"}},{"$f":"IF(INDEX(periode4,NEVAL,Nenfant)=\"B\",\"X\",\"\")","v":{"$error":"#NAME?"}},{"$f":"IF(INDEX(periode4,NEVAL,Nenfant)=\"A\",\"X\",\"\")","v":{"$error":"#NAME?"}},null,{"$f":"IF(INDEX(periode5,NEVAL,Nenfant)=\"D\",\"X\",\"\")","v":{"$error":"#NAME?"}},{"$f":"IF(INDEX(periode5,NEVAL,Nenfant)=\"C\",\"X\",\"\")","v":{"$error":"#NAME?"}},{"$f":"IF(INDEX(periode5,NEVAL,Nenfant)=\"B\",\"X\",\"\")","v":{"$error":"#NAME?"}},{"$f":"IF(INDEX(periode5,NEVAL,Nenfant)=\"A\",\"X\",\"\")","v":{"$error":"#NAME?"}},null,{"$f":"IF(INDEX(periode6,NEVAL,Nenfant)=\"D\",\"X\",\"\")","v":{"$error":"#NAME?"}},{"$f":"IF(INDEX(periode6,NEVAL,Nenfant)=\"C\",\"X\",\"\")","v":{"$error":"#NAME?"}},{"$f":"IF(INDEX(periode6,NEVAL,Nenfant)=\"B\",\"X\",\"\")","v":{"$error":"#NAME?"}},{"$f":"IF(INDEX(periode6,NEVAL,Nenfant)=\"A\",\"X\",\"\")","v":{"$error":"#NAME?"}}]
[106,{"$nulls":7},{"$f":"IF(INDEX(periode1,NEVAL,Nenfant)=\"D\",\"X\",\"\")","v":{"$error":"#NAME?"}},{"$f":"IF(INDEX(periode1,NEVAL,Nenfant)=\"C\",\"X\",\"\")","v":{"$error":"#NAME?"}},{"$f":"IF(INDEX(periode1,NEVAL,Nenfant)=\"B\",\"X\",\"\")","v":{"$error":"#NAME?"}},{"$f":"IF(INDEX(periode1,NEVAL,Nenfant)=\"A\",\"X\",\"\")","v":{"$error":"#NAME?"}},null,{"$f":"IF(INDEX(periode2,NEVAL,Nenfant)=\"D\",\"X\",\"\")","v":{"$error":"#NAME?"}},{"$f":"IF(INDEX(periode2,NEVAL,Nenfant)=\"C\",\"X\",\"\")","v":{"$error":"#NAME?"}},{"$f":"IF(INDEX(periode2,NEVAL,Nenfant)=\"B\",\"X\",\"\")","v":{"$error":"#NAME?"}},{"$f":"IF(INDEX(periode2,NEVAL,Nenfant)=\"A\",\"X\",\"\")","v":{"$error":"#NAME?"}},null,{"$f":"IF(INDEX(periode3,NEVAL,Nenfant)=\"D\",\"X\",\"\")","v":{"$error":"#NAME?"}},{"$f":"IF(INDEX(periode3,NEVAL,Nenfant)=\"C\",\"X\",\"\")","v":{"$error":"#NAME?"}},{"$f":"IF(INDEX(periode3,NEVAL,Nenfant)=\"B\",\"X\",\"\")","v":{"$error":"#NAME?"}},{"$f":"IF(INDEX(periode3,NEVAL,Nenfant)=\"A\",\"X\",\"\")","v":{"$error":"#NAME?"}},null,{"$f":"IF(INDEX(periode4,NEVAL,Nenfant)=\"D\",\"X\",\"\")","v":{"$error":"#NAME?"}},{"$f":"IF(INDEX(periode4,NEVAL,Nenfant)=\"C\",\"X\",\"\")","v":{"$error":"#NAME?"}},{"$f":"IF(INDEX(periode4,NEVAL,Nenfant)=\"B\",\"X\",\"\")","v":{"$error":"#NAME?"}},{"$f":"IF(INDEX(periode4,NEVAL,Nenfant)=\"A\",\"X\",\"\")","v":{"$error":"#NAME?"}},null,{"$f":"IF(INDEX(periode5,NEVAL,Nenfant)=\"D\",\"X\",\"\")","v":{"$error":"#NAME?"}},{"$f":"IF(INDEX(periode5,NEVAL,Nenfant)=\"C\",\"X\",\"\")","v":{"$error":"#NAME?"}},{"$f":"IF(INDEX(periode5,NEVAL,Nenfant)=\"B\",\"X\",\"\")","v":{"$error":"#NAME?"}},{"$f":"IF(INDEX(periode5,NEVAL,Nenfant)=\"A\",\"X\",\"\")","v":{"$error":"#NAME?"}},null,{"$f":"IF(INDEX(periode6,NEVAL,Nenfant)=\"D\",\"X\",\"\")","v":{"$error":"#NAME?"}},{"$f":"IF(INDEX(periode6,NEVAL,Nenfant)=\"C\",\"X\",\"\")","v":{"$error":"#NAME?"}},{"$f":"IF(INDEX(periode6,NEVAL,Nenfant)=\"B\",\"X\",\"\")","v":{"$error":"#NAME?"}},{"$f":"IF(INDEX(periode6,NEVAL,Nenfant)=\"A\",\"X\",\"\")","v":{"$error":"#NAME?"}}]
[107,{"$nulls":7},{"$f":"IF(INDEX(periode1,NEVAL,Nenfant)=\"D\",\"X\",\"\")","v":{"$error":"#NAME?"}},{"$f":"IF(INDEX(periode1,NEVAL,Nenfant)=\"C\",\"X\",\"\")","v":{"$error":"#NAME?"}},{"$f":"IF(INDEX(periode1,NEVAL,Nenfant)=\"B\",\"X\",\"\")","v":{"$error":"#NAME?"}},{"$f":"IF(INDEX(periode1,NEVAL,Nenfant)=\"A\",\"X\",\"\")","v":{"$error":"#NAME?"}},null,{"$f":"IF(INDEX(periode2,NEVAL,Nenfant)=\"D\",\"X\",\"\")","v":{"$error":"#NAME?"}},{"$f":"IF(INDEX(periode2,NEVAL,Nenfant)=\"C\",\"X\",\"\")","v":{"$error":"#NAME?"}},{"$f":"IF(INDEX(periode2,NEVAL,Nenfant)=\"B\",\"X\",\"\")","v":{"$error":"#NAME?"}},{"$f":"IF(INDEX(periode2,NEVAL,Nenfant)=\"A\",\"X\",\"\")","v":{"$error":"#NAME?"}},null,{"$f":"IF(INDEX(periode3,NEVAL,Nenfant)=\"D\",\"X\",\"\")","v":{"$error":"#NAME?"}},{"$f":"IF(INDEX(periode3,NEVAL,Nenfant)=\"C\",\"X\",\"\")","v":{"$error":"#NAME?"}},{"$f":"IF(INDEX(periode3,NEVAL,Nenfant)=\"B\",\"X\",\"\")","v":{"$error":"#NAME?"}},{"$f":"IF(INDEX(periode3,NEVAL,Nenfant)=\"A\",\"X\",\"\")","v":{"$error":"#NAME?"}},null,{"$f":"IF(INDEX(periode4,NEVAL,Nenfant)=\"D\",\"X\",\"\")","v":{"$error":"#NAME?"}},{"$f":"IF(INDEX(periode4,NEVAL,Nenfant)=\"C\",\"X\",\"\")","v":{"$error":"#NAME?"}},{"$f":"IF(INDEX(periode4,NEVAL,Nenfant)=\"B\",\"X\",\"\")","v":{"$error":"#NAME?"}},{"$f":"IF(INDEX(periode4,NEVAL,Nenfant)=\"A\",\"X\",\"\")","v":{"$error":"#NAME?"}},null,{"$f":"IF(INDEX(periode5,NEVAL,Nenfant)=\"D\",\"X\",\"\")","v":{"$error":"#NAME?"}},{"$f":"IF(INDEX(periode5,NEVAL,Nenfant)=\"C\",\"X\",\"\")","v":{"$error":"#NAME?"}},{"$f":"IF(INDEX(periode5,NEVAL,Nenfant)=\"B\",\"X\",\"\")","v":{"$error":"#NAME?"}},{"$f":"IF(INDEX(periode5,NEVAL,Nenfant)=\"A\",\"X\",\"\")","v":{"$error":"#NAME?"}},null,{"$f":"IF(INDEX(periode6,NEVAL,Nenfant)=\"D\",\"X\",\"\")","v":{"$error":"#NAME?"}},{"$f":"IF(INDEX(periode6,NEVAL,Nenfant)=\"C\",\"X\",\"\")","v":{"$error":"#NAME?"}},{"$f":"IF(INDEX(periode6,NEVAL,Nenfant)=\"B\",\"X\",\"\")","v":{"$error":"#NAME?"}},{"$f":"IF(INDEX(periode6,NEVAL,Nenfant)=\"A\",\"X\",\"\")","v":{"$error":"#NAME?"}}]
[108,{"$nulls":7},{"$f":"IF(INDEX(periode1,NEVAL,Nenfant)=\"D\",\"X\",\"\")","v":{"$error":"#NAME?"}},{"$f":"IF(INDEX(periode1,NEVAL,Nenfant)=\"C\",\"X\",\"\")","v":{"$error":"#NAME?"}},{"$f":"IF(INDEX(periode1,NEVAL,Nenfant)=\"B\",\"X\",\"\")","v":{"$error":"#NAME?"}},{"$f":"IF(INDEX(periode1,NEVAL,Nenfant)=\"A\",\"X\",\"\")","v":{"$error":"#NAME?"}},null,{"$f":"IF(INDEX(periode2,NEVAL,Nenfant)=\"D\",\"X\",\"\")","v":{"$error":"#NAME?"}},{"$f":"IF(INDEX(periode2,NEVAL,Nenfant)=\"C\",\"X\",\"\")","v":{"$error":"#NAME?"}},{"$f":"IF(INDEX(periode2,NEVAL,Nenfant)=\"B\",\"X\",\"\")","v":{"$error":"#NAME?"}},{"$f":"IF(INDEX(periode2,NEVAL,Nenfant)=\"A\",\"X\",\"\")","v":{"$error":"#NAME?"}},null,{"$f":"IF(INDEX(periode3,NEVAL,Nenfant)=\"D\",\"X\",\"\")","v":{"$error":"#NAME?"}},{"$f":"IF(INDEX(periode3,NEVAL,Nenfant)=\"C\",\"X\",\"\")","v":{"$error":"#NAME?"}},{"$f":"IF(INDEX(periode3,NEVAL,Nenfant)=\"B\",\"X\",\"\")","v":{"$error":"#NAME?"}},{"$f":"IF(INDEX(periode3,NEVAL,Nenfant)=\"A\",\"X\",\"\")","v":{"$error":"#NAME?"}},null,{"$f":"IF(INDEX(periode4,NEVAL,Nenfant)=\"D\",\"X\",\"\")","v":{"$error":"#NAME?"}},{"$f":"IF(INDEX(periode4,NEVAL,Nenfant)=\"C\",\"X\",\"\")","v":{"$error":"#NAME?"}},{"$f":"IF(INDEX(periode4,NEVAL,Nenfant)=\"B\",\"X\",\"\")","v":{"$error":"#NAME?"}},{"$f":"IF(INDEX(periode4,NEVAL,Nenfant)=\"A\",\"X\",\"\")","v":{"$error":"#NAME?"}},null,{"$f":"IF(INDEX(periode5,NEVAL,Nenfant)=\"D\",\"X\",\"\")","v":{"$error":"#NAME?"}},{"$f":"IF(INDEX(periode5,NEVAL,Nenfant)=\"C\",\"X\",\"\")","v":{"$error":"#NAME?"}},{"$f":"IF(INDEX(periode5,NEVAL,Nenfant)=\"B\",\"X\",\"\")","v":{"$error":"#NAME?"}},{"$f":"IF(INDEX(periode5,NEVAL,Nenfant)=\"A\",\"X\",\"\")","v":{"$error":"#NAME?"}},null,{"$f":"IF(INDEX(periode6,NEVAL,Nenfant)=\"D\",\"X\",\"\")","v":{"$error":"#NAME?"}},{"$f":"IF(INDEX(periode6,NEVAL,Nenfant)=\"C\",\"X\",\"\")","v":{"$error":"#NAME?"}},{"$f":"IF(INDEX(periode6,NEVAL,Nenfant)=\"B\",\"X\",\"\")","v":{"$error":"#NAME?"}},{"$f":"IF(INDEX(periode6,NEVAL,Nenfant)=\"A\",\"X\",\"\")","v":{"$error":"#NAME?"}}]
[109,{"$nulls":7},{"$f":"COUNTIF($G117:$G119,\"X\")","v":0},{"$f":"COUNTIF($H117:$H119,\"X\")","v":0},{"$f":"COUNTIF($I116:$I121,\"X\")","v":0},{"$f":"COUNTIF($J116:$J121,\"X\")","v":0},null,{"$f":"COUNTIF($G117:$G119,\"X\")","v":0},{"$f":"COUNTIF($H117:$H119,\"X\")","v":0},{"$f":"COUNTIF($I116:$I121,\"X\")","v":0},{"$f":"COUNTIF($J116:$J121,\"X\")","v":0},null,{"$f":"COUNTIF($G117:$G119,\"X\")","v":0},{"$f":"COUNTIF($H117:$H119,\"X\")","v":0},{"$f":"COUNTIF($I116:$I121,\"X\")","v":0},{"$f":"COUNTIF($J116:$J121,\"X\")","v":0},null,{"$f":"COUNTIF($G117:$G119,\"X\")","v":0},{"$f":"COUNTIF($H117:$H119,\"X\")","v":0},{"$f":"COUNTIF($I116:$I121,\"X\")","v":0},{"$f":"COUNTIF(AA116:AA121,\"X\")","v":0},null,{"$f":"COUNTIF($G117:$G119,\"X\")","v":0},{"$f":"COUNTIF($H117:$H119,\"X\")","v":0},{"$f":"COUNTIF($I116:$I121,\"X\")","v":0},{"$f":"COUNTIF($J116:$J121,\"X\")","v":0},null,{"$f":"COUNTIF($G117:$G119,\"X\")","v":0},{"$f":"COUNTIF($H117:$H119,\"X\")","v":0},{"$f":"COUNTIF($I116:$I121,\"X\")","v":0},{"$f":"COUNTIF($J116:$J121,\"X\")","v":0}]
[110,{"$nulls":7},{"$f":"IF(INDEX(periode1,NEVAL,Nenfant)=\"D\",\"X\",\"\")","v":{"$error":"#NAME?"}},{"$f":"IF(INDEX(periode1,NEVAL,Nenfant)=\"C\",\"X\",\"\")","v":{"$error":"#NAME?"}},{"$f":"IF(INDEX(periode1,NEVAL,Nenfant)=\"B\",\"X\",\"\")","v":{"$error":"#NAME?"}},{"$f":"IF(INDEX(periode1,NEVAL,Nenfant)=\"A\",\"X\",\"\")","v":{"$error":"#NAME?"}},null,{"$f":"IF(INDEX(periode2,NEVAL,Nenfant)=\"D\",\"X\",\"\")","v":{"$error":"#NAME?"}},{"$f":"IF(INDEX(periode2,NEVAL,Nenfant)=\"C\",\"X\",\"\")","v":{"$error":"#NAME?"}},{"$f":"IF(INDEX(periode2,NEVAL,Nenfant)=\"B\",\"X\",\"\")","v":{"$error":"#NAME?"}},{"$f":"IF(INDEX(periode2,NEVAL,Nenfant)=\"A\",\"X\",\"\")","v":{"$error":"#NAME?"}},null,{"$f":"IF(INDEX(periode3,NEVAL,Nenfant)=\"D\",\"X\",\"\")","v":{"$error":"#NAME?"}},{"$f":"IF(INDEX(periode3,NEVAL,Nenfant)=\"C\",\"X\",\"\")","v":{"$error":"#NAME?"}},{"$f":"IF(INDEX(periode3,NEVAL,Nenfant)=\"B\",\"X\",\"\")","v":{"$error":"#NAME?"}},{"$f":"IF(INDEX(periode3,NEVAL,Nenfant)=\"A\",\"X\",\"\")","v":{"$error":"#NAME?"}},null,{"$f":"IF(INDEX(periode4,NEVAL,Nenfant)=\"D\",\"X\",\"\")","v":{"$error":"#NAME?"}},{"$f":"IF(INDEX(periode4,NEVAL,Nenfant)=\"C\",\"X\",\"\")","v":{"$error":"#NAME?"}},{"$f":"IF(INDEX(periode4,NEVAL,Nenfant)=\"B\",\"X\",\"\")","v":{"$error":"#NAME?"}},{"$f":"IF(INDEX(periode4,NEVAL,Nenfant)=\"A\",\"X\",\"\")","v":{"$error":"#NAME?"}},null,{"$f":"IF(INDEX(periode5,NEVAL,Nenfant)=\"D\",\"X\",\"\")","v":{"$error":"#NAME?"}},{"$f":"IF(INDEX(periode5,NEVAL,Nenfant)=\"C\",\"X\",\"\")","v":{"$error":"#NAME?"}},{"$f":"IF(INDEX(periode5,NEVAL,Nenfant)=\"B\",\"X\",\"\")","v":{"$error":"#NAME?"}},{"$f":"IF(INDEX(periode5,NEVAL,Nenfant)=\"A\",\"X\",\"\")","v":{"$error":"#NAME?"}},null,{"$f":"IF(INDEX(periode6,NEVAL,Nenfant)=\"D\",\"X\",\"\")","v":{"$error":"#NAME?"}},{"$f":"IF(INDEX(periode6,NEVAL,Nenfant)=\"C\",\"X\",\"\")","v":{"$error":"#NAME?"}},{"$f":"IF(INDEX(periode6,NEVAL,Nenfant)=\"B\",\"X\",\"\")","v":{"$error":"#NAME?"}},{"$f":"IF(INDEX(periode6,NEVAL,Nenfant)=\"A\",\"X\",\"\")","v":{"$error":"#NAME?"}}]
[111,{"$nulls":7},{"$error":"#NAME?"},{"$error":"#NAME?"},{"$error":"#NAME?"},{"$error":"#NAME?"},null,{"$error":"#NAME?"},{"$error":"#NAME?"},{"$error":"#NAME?"},{"$error":"#NAME?"},null,{"$error":"#NAME?"},{"$error":"#NAME?"},{"$error":"#NAME?"},{"$error":"#NAME?"},null,{"$error":"#NAME?"},{"$error":"#NAME?"},{"$error":"#NAME?"},{"$error":"#NAME?"},null,{"$error":"#NAME?"},{"$error":"#NAME?"},{"$error":"#NAME?"},{"$error":"#NAME?"},null,{"$error":"#NAME?"},{"$error":"#NAME?"},{"$error":"#NAME?"},{"$error":"#NAME?"}]
[112,{"$nulls":7},{"$error":"#NAME?"},{"$error":"#NAME?"},{"$error":"#NAME?"},{"$error":"#NAME?"},null,{"$error":"#NAME?"},{"$error":"#NAME?"},{"$error":"#NAME?"},{"$error":"#NAME?"},null,{"$error":"#NAME?"},{"$error":"#NAME?"},{"$error":"#NAME?"},{"$error":"#NAME?"},null,{"$error":"#NAME?"},{"$error":"#NAME?"},{"$error":"#NAME?"},{"$error":"#NAME?"},null,{"$error":"#NAME?"},{"$error":"#NAME?"},{"$error":"#NAME?"},{"$error":"#NAME?"},null,{"$error":"#NAME?"},{"$error":"#NAME?"},{"$error":"#NAME?"},{"$error":"#NAME?"}]
[113,{"$nulls":7},{"$error":"#NAME?"},{"$error":"#NAME?"},{"$error":"#NAME?"},{"$error":"#NAME?"},null,{"$error":"#NAME?"},{"$error":"#NAME?"},{"$error":"#NAME?"},{"$error":"#NAME?"},null,{"$error":"#NAME?"},{"$error":"#NAME?"},{"$error":"#NAME?"},{"$error":"#NAME?"},null,{"$error":"#NAME?"},{"$error":"#NAME?"},{"$error":"#NAME?"},{"$error":"#NAME?"},null,{"$error":"#NAME?"},{"$error":"#NAME?"},{"$error":"#NAME?"},{"$error":"#NAME?"},null,{"$error":"#NAME?"},{"$error":"#NAME?"},{"$error":"#NAME?"},{"$error":"#NAME?"}]
[114,{"$nulls":7},{"$error":"#NAME?"},{"$error":"#NAME?"},{"$error":"#NAME?"},{"$error":"#NAME?"},null,{"$error":"#NAME?"},{"$error":"#NAME?"},{"$error":"#NAME?"},{"$error":"#NAME?"},null,{"$error":"#NAME?"},{"$error":"#NAME?"},{"$error":"#NAME?"},{"$error":"#NAME?"},null,{"$error":"#NAME?"},{"$error":"#NAME?"},{"$error":"#NAME?"},{"$error":"#NAME?"},null,{"$error":"#NAME?"},{"$error":"#NAME?"},{"$error":"#NAME?"},{"$error":"#NAME?"},null,{"$error":"#NAME?"},{"$error":"#NAME?"},{"$error":"#NAME?"},{"$error":"#NAME?"}]
[115,{"$nulls":7},{"$error":"#NAME?"},{"$error":"#NAME?"},{"$error":"#NAME?"},{"$error":"#NAME?"},null,{"$error":"#NAME?"},{"$error":"#NAME?"},{"$error":"#NAME?"},{"$error":"#NAME?"},null,{"$error":"#NAME?"},{"$error":"#NAME?"},{"$error":"#NAME?"},{"$error":"#NAME?"},null,{"$error":"#NAME?"},{"$error":"#NAME?"},{"$error":"#NAME?"},{"$error":"#NAME?"},null,{"$error":"#NAME?"},{"$error":"#NAME?"},{"$error":"#NAME?"},{"$error":"#NAME?"},null,{"$error":"#NAME?"},{"$error":"#NAME?"},{"$error":"#NAME?"},{"$error":"#NAME?"}]
[116,{"$nulls":7},{"$f":"COUNTIF($G117,\"X\")","v":0},{"$f":"COUNTIF($H117,\"X\")","v":0},{"$f":"COUNTIF($I123,\"X\")","v":0},{"$f":"COUNTIF($J123,\"X\")","v":0},null,{"$f":"COUNTIF($G117,\"X\")","v":0},{"$f":"COUNTIF($H117,\"X\")","v":0},{"$f":"COUNTIF($I123,\"X\")","v":0},{"$f":"COUNTIF($J123,\"X\")","v":0},null,{"$f":"COUNTIF($G117,\"X\")","v":0},{"$f":"COUNTIF($H117,\"X\")","v":0},{"$f":"COUNTIF($I123,\"X\")","v":0},{"$f":"COUNTIF($J123,\"X\")","v":0},null,{"$f":"COUNTIF($G117,\"X\")","v":0},{"$f":"COUNTIF($H117,\"X\")","v":0},{"$f":"COUNTIF($I123,\"X\")","v":0},{"$f":"COUNTIF(AA123,\"X\")","v":0},null,{"$f":"COUNTIF($G117,\"X\")","v":0},{"$f":"COUNTIF($H117,\"X\")","v":0},{"$f":"COUNTIF($I123,\"X\")","v":0},{"$f":"COUNTIF($J123,\"X\")","v":0},null,{"$f":"COUNTIF($G117,\"X\")","v":0},{"$f":"COUNTIF($H117,\"X\")","v":0},{"$f":"COUNTIF($I123,\"X\")","v":0},{"$f":"COUNTIF($J123,\"X\")","v":0}]
[117,{"$nulls":7},{"$f":"IF(INDEX(periode1,NEVAL,Nenfant)=\"D\",\"X\",\"\")","v":{"$error":"#NAME?"}},{"$f":"IF(INDEX(periode1,NEVAL,Nenfant)=\"C\",\"X\",\"\")","v":{"$error":"#NAME?"}},{"$f":"IF(INDEX(periode1,NEVAL,Nenfant)=\"B\",\"X\",\"\")","v":{"$error":"#NAME?"}},{"$f":"IF(INDEX(periode1,NEVAL,Nenfant)=\"A\",\"X\",\"\")","v":{"$error":"#NAME?"}},null,{"$f":"IF(INDEX(periode2,NEVAL,Nenfant)=\"D\",\"X\",\"\")","v":{"$error":"#NAME?"}},{"$f":"IF(INDEX(periode2,NEVAL,Nenfant)=\"C\",\"X\",\"\")","v":{"$error":"#NAME?"}},{"$f":"IF(INDEX(periode2,NEVAL,Nenfant)=\"B\",\"X\",\"\")","v":{"$error":"#NAME?"}},{"$f":"IF(INDEX(periode2,NEVAL,Nenfant)=\"A\",\"X\",\"\")","v":{"$error":"#NAME?"}},null,{"$f":"IF(INDEX(periode3,NEVAL,Nenfant)=\"D\",\"X\",\"\")","v":{"$error":"#NAME?"}},{"$f":"IF(INDEX(periode3,NEVAL,Nenfant)=\"C\",\"X\",\"\")","v":{"$error":"#NAME?"}},{"$f":"IF(INDEX(periode3,NEVAL,Nenfant)=\"B\",\"X\",\"\")","v":{"$error":"#NAME?"}},{"$f":"IF(INDEX(periode3,NEVAL,Nenfant)=\"A\",\"X\",\"\")","v":{"$error":"#NAME?"}},null,{"$f":"IF(INDEX(periode4,NEVAL,Nenfant)=\"D\",\"X\",\"\")","v":{"$error":"#NAME?"}},{"$f":"IF(INDEX(periode4,NEVAL,Nenfant)=\"C\",\"X\",\"\")","v":{"$error":"#NAME?"}},{"$f":"IF(INDEX(periode4,NEVAL,Nenfant)=\"B\",\"X\",\"\")","v":{"$error":"#NAME?"}},{"$f":"IF(INDEX(periode4,NEVAL,Nenfant)=\"A\",\"X\",\"\")","v":{"$error":"#NAME?"}},null,{"$f":"IF(INDEX(periode5,NEVAL,Nenfant)=\"D\",\"X\",\"\")","v":{"$error":"#NAME?"}},{"$f":"IF(INDEX(periode5,NEVAL,Nenfant)=\"C\",\"X\",\"\")","v":{"$error":"#NAME?"}},{"$f":"IF(INDEX(periode5,NEVAL,Nenfant)=\"B\",\"X\",\"\")","v":{"$error":"#NAME?"}},{"$f":"IF(INDEX(periode5,NEVAL,Nenfant)=\"A\",\"X\",\"\")","v":{"$error":"#NAME?"}},null,{"$f":"IF(INDEX(periode6,NEVAL,Nenfant)=\"D\",\"X\",\"\")","v":{"$error":"#NAME?"}},{"$f":"IF(INDEX(periode6,NEVAL,Nenfant)=\"C\",\"X\",\"\")","v":{"$error":"#NAME?"}},{"$f":"IF(INDEX(periode6,NEVAL,Nenfant)=\"B\",\"X\",\"\")","v":{"$error":"#NAME?"}},{"$f":"IF(INDEX(periode6,NEVAL,Nenfant)=\"A\",\"X\",\"\")","v":{"$error":"#NAME?"}}]
[118,{"$nulls":7},{"$f":"IF(INDEX(periode1,NEVAL,Nenfant)=\"D\",\"X\",\"\")","v":{"$error":"#NAME?"}},{"$f":"IF(INDEX(periode1,NEVAL,Nenfant)=\"C\",\"X\",\"\")","v":{"$error":"#NAME?"}},{"$f":"IF(INDEX(periode1,NEVAL,Nenfant)=\"B\",\"X\",\"\")","v":{"$error":"#NAME?"}},{"$f":"IF(INDEX(periode1,NEVAL,Nenfant)=\"A\",\"X\",\"\")","v":{"$error":"#NAME?"}},null,{"$f":"IF(INDEX(periode2,NEVAL,Nenfant)=\"D\",\"X\",\"\")","v":{"$error":"#NAME?"}},{"$f":"IF(INDEX(periode2,NEVAL,Nenfant)=\"C\",\"X\",\"\")","v":{"$error":"#NAME?"}},{"$f":"IF(INDEX(periode2,NEVAL,Nenfant)=\"B\",\"X\",\"\")","v":{"$error":"#NAME?"}},{"$f":"IF(INDEX(periode2,NEVAL,Nenfant)=\"A\",\"X\",\"\")","v":{"$error":"#NAME?"}},null,{"$f":"IF(INDEX(periode3,NEVAL,Nenfant)=\"D\",\"X\",\"\")","v":{"$error":"#NAME?"}},{"$f":"IF(INDEX(periode3,NEVAL,Nenfant)=\"C\",\"X\",\"\")","v":{"$error":"#NAME?"}},{"$f":"IF(INDEX(periode3,NEVAL,Nenfant)=\"B\",\"X\",\"\")","v":{"$error":"#NAME?"}},{"$f":"IF(INDEX(periode3,NEVAL,Nenfant)=\"A\",\"X\",\"\")","v":{"$error":"#NAME?"}},null,{"$f":"IF(INDEX(periode4,NEVAL,Nenfant)=\"D\",\"X\",\"\")","v":{"$error":"#NAME?"}},{"$f":"IF(INDEX(periode4,NEVAL,Nenfant)=\"C\",\"X\",\"\")","v":{"$error":"#NAME?"}},{"$f":"IF(INDEX(periode4,NEVAL,Nenfant)=\"B\",\"X\",\"\")","v":{"$error":"#NAME?"}},{"$f":"IF(INDEX(periode4,NEVAL,Nenfant)=\"A\",\"X\",\"\")","v":{"$error":"#NAME?"}},null,{"$f":"IF(INDEX(periode5,NEVAL,Nenfant)=\"D\",\"X\",\"\")","v":{"$error":"#NAME?"}},{"$f":"IF(INDEX(periode5,NEVAL,Nenfant)=\"C\",\"X\",\"\")","v":{"$error":"#NAME?"}},{"$f":"IF(INDEX(periode5,NEVAL,Nenfant)=\"B\",\"X\",\"\")","v":{"$error":"#NAME?"}},{"$f":"IF(INDEX(periode5,NEVAL,Nenfant)=\"A\",\"X\",\"\")","v":{"$error":"#NAME?"}},null,{"$f":"IF(INDEX(periode6,NEVAL,Nenfant)=\"D\",\"X\",\"\")","v":{"$error":"#NAME?"}},{"$f":"IF(INDEX(periode6,NEVAL,Nenfant)=\"C\",\"X\",\"\")","v":{"$error":"#NAME?"}},{"$f":"IF(INDEX(periode6,NEVAL,Nenfant)=\"B\",\"X\",\"\")","v":{"$error":"#NAME?"}},{"$f":"IF(INDEX(periode6,NEVAL,Nenfant)=\"A\",\"X\",\"\")","v":{"$error":"#NAME?"}}]
[119,{"$nulls":7},{"$f":"IF(INDEX(periode1,NEVAL,Nenfant)=\"D\",\"X\",\"\")","v":{"$error":"#NAME?"}},{"$f":"IF(INDEX(periode1,NEVAL,Nenfant)=\"C\",\"X\",\"\")","v":{"$error":"#NAME?"}},{"$f":"IF(INDEX(periode1,NEVAL,Nenfant)=\"B\",\"X\",\"\")","v":{"$error":"#NAME?"}},{"$f":"IF(INDEX(periode1,NEVAL,Nenfant)=\"A\",\"X\",\"\")","v":{"$error":"#NAME?"}},null,{"$f":"IF(INDEX(periode2,NEVAL,Nenfant)=\"D\",\"X\",\"\")","v":{"$error":"#NAME?"}},{"$f":"IF(INDEX(periode2,NEVAL,Nenfant)=\"C\",\"X\",\"\")","v":{"$error":"#NAME?"}},{"$f":"IF(INDEX(periode2,NEVAL,Nenfant)=\"B\",\"X\",\"\")","v":{"$error":"#NAME?"}},{"$f":"IF(INDEX(periode2,NEVAL,Nenfant)=\"A\",\"X\",\"\")","v":{"$error":"#NAME?"}},null,{"$f":"IF(INDEX(periode3,NEVAL,Nenfant)=\"D\",\"X\",\"\")","v":{"$error":"#NAME?"}},{"$f":"IF(INDEX(periode3,NEVAL,Nenfant)=\"C\",\"X\",\"\")","v":{"$error":"#NAME?"}},{"$f":"IF(INDEX(periode3,NEVAL,Nenfant)=\"B\",\"X\",\"\")","v":{"$error":"#NAME?"}},{"$f":"IF(INDEX(periode3,NEVAL,Nenfant)=\"A\",\"X\",\"\")","v":{"$error":"#NAME?"}},null,{"$f":"IF(INDEX(periode4,NEVAL,Nenfant)=\"D\",\"X\",\"\")","v":{"$error":"#NAME?"}},{"$f":"IF(INDEX(periode4,NEVAL,Nenfant)=\"C\",\"X\",\"\")","v":{"$error":"#NAME?"}},{"$f":"IF(INDEX(periode4,NEVAL,Nenfant)=\"B\",\"X\",\"\")","v":{"$error":"#NAME?"}},{"$f":"IF(INDEX(periode4,NEVAL,Nenfant)=\"A\",\"X\",\"\")","v":{"$error":"#NAME?"}},null,{"$f":"IF(INDEX(periode5,NEVAL,Nenfant)=\"D\",\"X\",\"\")","v":{"$error":"#NAME?"}},{"$f":"IF(INDEX(periode5,NEVAL,Nenfant)=\"C\",\"X\",\"\")","v":{"$error":"#NAME?"}},{"$f":"IF(INDEX(periode5,NEVAL,Nenfant)=\"B\",\"X\",\"\")","v":{"$error":"#NAME?"}},{"$f":"IF(INDEX(periode5,NEVAL,Nenfant)=\"A\",\"X\",\"\")","v":{"$error":"#NAME?"}},null,{"$f":"IF(INDEX(periode6,NEVAL,Nenfant)=\"D\",\"X\",\"\")","v":{"$error":"#NAME?"}},{"$f":"IF(INDEX(periode6,NEVAL,Nenfant)=\"C\",\"X\",\"\")","v":{"$error":"#NAME?"}},{"$f":"IF(INDEX(periode6,NEVAL,Nenfant)=\"B\",\"X\",\"\")","v":{"$error":"#NAME?"}},{"$f":"IF(INDEX(periode6,NEVAL,Nenfant)=\"A\",\"X\",\"\")","v":{"$error":"#NAME?"}}]
[120,{"$nulls":7},{"$f":"IF(INDEX(periode1,NEVAL,Nenfant)=\"D\",\"X\",\"\")","v":{"$error":"#NAME?"}},{"$f":"IF(INDEX(periode1,NEVAL,Nenfant)=\"C\",\"X\",\"\")","v":{"$error":"#NAME?"}},{"$f":"IF(INDEX(periode1,NEVAL,Nenfant)=\"B\",\"X\",\"\")","v":{"$error":"#NAME?"}},{"$f":"IF(INDEX(periode1,NEVAL,Nenfant)=\"A\",\"X\",\"\")","v":{"$error":"#NAME?"}},null,{"$f":"IF(INDEX(periode2,NEVAL,Nenfant)=\"D\",\"X\",\"\")","v":{"$error":"#NAME?"}},{"$f":"IF(INDEX(periode2,NEVAL,Nenfant)=\"C\",\"X\",\"\")","v":{"$error":"#NAME?"}},{"$f":"IF(INDEX(periode2,NEVAL,Nenfant)=\"B\",\"X\",\"\")","v":{"$error":"#NAME?"}},{"$f":"IF(INDEX(periode2,NEVAL,Nenfant)=\"A\",\"X\",\"\")","v":{"$error":"#NAME?"}},null,{"$f":"IF(INDEX(periode3,NEVAL,Nenfant)=\"D\",\"X\",\"\")","v":{"$error":"#NAME?"}},{"$f":"IF(INDEX(periode3,NEVAL,Nenfant)=\"C\",\"X\",\"\")","v":{"$error":"#NAME?"}},{"$f":"IF(INDEX(periode3,NEVAL,Nenfant)=\"B\",\"X\",\"\")","v":{"$error":"#NAME?"}},{"$f":"IF(INDEX(periode3,NEVAL,Nenfant)=\"A\",\"X\",\"\")","v":{"$error":"#NAME?"}},null,{"$f":"IF(INDEX(periode4,NEVAL,Nenfant)=\"D\",\"X\",\"\")","v":{"$error":"#NAME?"}},{"$f":"IF(INDEX(periode4,NEVAL,Nenfant)=\"C\",\"X\",\"\")","v":{"$error":"#NAME?"}},{"$f":"IF(INDEX(periode4,NEVAL,Nenfant)=\"B\",\"X\",\"\")","v":{"$error":"#NAME?"}},{"$f":"IF(INDEX(periode4,NEVAL,Nenfant)=\"A\",\"X\",\"\")","v":{"$error":"#NAME?"}},null,{"$f":"IF(INDEX(periode5,NEVAL,Nenfant)=\"D\",\"X\",\"\")","v":{"$error":"#NAME?"}},{"$f":"IF(INDEX(periode5,NEVAL,Nenfant)=\"C\",\"X\",\"\")","v":{"$error":"#NAME?"}},{"$f":"IF(INDEX(periode5,NEVAL,Nenfant)=\"B\",\"X\",\"\")","v":{"$error":"#NAME?"}},{"$f":"IF(INDEX(periode5,NEVAL,Nenfant)=\"A\",\"X\",\"\")","v":{"$error":"#NAME?"}},null,{"$f":"IF(INDEX(periode6,NEVAL,Nenfant)=\"D\",\"X\",\"\")","v":{"$error":"#NAME?"}},{"$f":"IF(INDEX(periode6,NEVAL,Nenfant)=\"C\",\"X\",\"\")","v":{"$error":"#NAME?"}},{"$f":"IF(INDEX(periode6,NEVAL,Nenfant)=\"B\",\"X\",\"\")","v":{"$error":"#NAME?"}},{"$f":"IF(INDEX(periode6,NEVAL,Nenfant)=\"A\",\"X\",\"\")","v":{"$error":"#NAME?"}}]
[121,{"$nulls":7},{"$f":"COUNTIF($G128:$G131,\"X\")","v":0},{"$f":"COUNTIF($H128:$H131,\"X\")","v":0},{"$f":"COUNTIF($I128:$I132,\"X\")","v":0},{"$f":"COUNTIF($J128:$J132,\"X\")","v":0},null,{"$f":"COUNTIF($G128:$G131,\"X\")","v":0},{"$f":"COUNTIF($H128:$H131,\"X\")","v":0},{"$f":"COUNTIF($I128:$I132,\"X\")","v":0},{"$f":"COUNTIF($J128:$J132,\"X\")","v":0},null,{"$f":"COUNTIF($G128:$G131,\"X\")","v":0},{"$f":"COUNTIF($H128:$H131,\"X\")","v":0},{"$f":"COUNTIF($I128:$I132,\"X\")","v":0},{"$f":"COUNTIF($J128:$J132,\"X\")","v":0},null,{"$f":"COUNTIF($G128:$G131,\"X\")","v":0},{"$f":"COUNTIF($H128:$H131,\"X\")","v":0},{"$f":"COUNTIF($I128:$I132,\"X\")","v":0},{"$f":"COUNTIF(AA128:AA132,\"X\")","v":0},null,{"$f":"COUNTIF($G128:$G131,\"X\")","v":0},{"$f":"COUNTIF($H128:$H131,\"X\")","v":0},{"$f":"COUNTIF($I128:$I132,\"X\")","v":0},{"$f":"COUNTIF($J128:$J132,\"X\")","v":0},null,{"$f":"COUNTIF($G128:$G131,\"X\")","v":0},{"$f":"COUNTIF($H128:$H131,\"X\")","v":0},{"$f":"COUNTIF($I128:$I132,\"X\")","v":0},{"$f":"COUNTIF($J128:$J132,\"X\")","v":0}]
[122,{"$nulls":7},{"$f":"IF(INDEX(periode1,NEVAL,Nenfant)=\"D\",\"X\",\"\")","v":{"$error":"#NAME?"}},{"$f":"IF(INDEX(periode1,NEVAL,Nenfant)=\"C\",\"X\",\"\")","v":{"$error":"#NAME?"}},{"$f":"IF(INDEX(periode1,NEVAL,Nenfant)=\"B\",\"X\",\"\")","v":{"$error":"#NAME?"}},{"$f":"IF(INDEX(periode1,NEVAL,Nenfant)=\"A\",\"X\",\"\")","v":{"$error":"#NAME?"}},null,{"$f":"IF(INDEX(periode2,NEVAL,Nenfant)=\"D\",\"X\",\"\")","v":{"$error":"#NAME?"}},{"$f":"IF(INDEX(periode2,NEVAL,Nenfant)=\"C\",\"X\",\"\")","v":{"$error":"#NAME?"}},{"$f":"IF(INDEX(periode2,NEVAL,Nenfant)=\"B\",\"X\",\"\")","v":{"$error":"#NAME?"}},{"$f":"IF(INDEX(periode2,NEVAL,Nenfant)=\"A\",\"X\",\"\")","v":{"$error":"#NAME?"}},null,{"$f":"IF(INDEX(periode3,NEVAL,Nenfant)=\"D\",\"X\",\"\")","v":{"$error":"#NAME?"}},{"$f":"IF(INDEX(periode3,NEVAL,Nenfant)=\"C\",\"X\",\"\")","v":{"$error":"#NAME?"}},{"$f":"IF(INDEX(periode3,NEVAL,Nenfant)=\"B\",\"X\",\"\")","v":{"$error":"#NAME?"}},{"$f":"IF(INDEX(periode3,NEVAL,Nenfant)=\"A\",\"X\",\"\")","v":{"$error":"#NAME?"}},null,{"$f":"IF(INDEX(periode4,NEVAL,Nenfant)=\"D\",\"X\",\"\")","v":{"$error":"#NAME?"}},{"$f":"IF(INDEX(periode4,NEVAL,Nenfant)=\"C\",\"X\",\"\")","v":{"$error":"#NAME?"}},{"$f":"IF(INDEX(periode4,NEVAL,Nenfant)=\"B\",\"X\",\"\")","v":{"$error":"#NAME?"}},{"$f":"IF(INDEX(periode4,NEVAL,Nenfant)=\"A\",\"X\",\"\")","v":{"$error":"#NAME?"}},null,{"$f":"IF(INDEX(periode5,NEVAL,Nenfant)=\"D\",\"X\",\"\")","v":{"$error":"#NAME?"}},{"$f":"IF(INDEX(periode5,NEVAL,Nenfant)=\"C\",\"X\",\"\")","v":{"$error":"#NAME?"}},{"$f":"IF(INDEX(periode5,NEVAL,Nenfant)=\"B\",\"X\",\"\")","v":{"$error":"#NAME?"}},{"$f":"IF(INDEX(periode5,NEVAL,Nenfant)=\"A\",\"X\",\"\")","v":{"$error":"#NAME?"}},null,{"$f":"IF(INDEX(periode6,NEVAL,Nenfant)=\"D\",\"X\",\"\")","v":{"$error":"#NAME?"}},{"$f":"IF(INDEX(periode6,NEVAL,Nenfant)=\"C\",\"X\",\"\")","v":{"$error":"#NAME?"}},{"$f":"IF(INDEX(periode6,NEVAL,Nenfant)=\"B\",\"X\",\"\")","v":{"$error":"#NAME?"}},{"$f":"IF(INDEX(periode6,NEVAL,Nenfant)=\"A\",\"X\",\"\")","v":{"$error":"#NAME?"}}]
[123,{"$nulls":7},{"$f":"IF(INDEX(periode1,NEVAL,Nenfant)=\"D\",\"X\",\"\")","v":{"$error":"#NAME?"}},{"$f":"IF(INDEX(periode1,NEVAL,Nenfant)=\"C\",\"X\",\"\")","v":{"$error":"#NAME?"}},{"$f":"IF(INDEX(periode1,NEVAL,Nenfant)=\"B\",\"X\",\"\")","v":{"$error":"#NAME?"}},{"$f":"IF(INDEX(periode1,NEVAL,Nenfant)=\"A\",\"X\",\"\")","v":{"$error":"#NAME?"}},null,{"$f":"IF(INDEX(periode2,NEVAL,Nenfant)=\"D\",\"X\",\"\")","v":{"$error":"#NAME?"}},{"$f":"IF(INDEX(periode2,NEVAL,Nenfant)=\"C\",\"X\",\"\")","v":{"$error":"#NAME?"}},{"$f":"IF(INDEX(periode2,NEVAL,Nenfant)=\"B\",\"X\",\"\")","v":{"$error":"#NAME?"}},{"$f":"IF(INDEX(periode2,NEVAL,Nenfant)=\"A\",\"X\",\"\")","v":{"$error":"#NAME?"}},null,{"$f":"IF(INDEX(periode3,NEVAL,Nenfant)=\"D\",\"X\",\"\")","v":{"$error":"#NAME?"}},{"$f":"IF(INDEX(periode3,NEVAL,Nenfant)=\"C\",\"X\",\"\")","v":{"$error":"#NAME?"}},{"$f":"IF(INDEX(periode3,NEVAL,Nenfant)=\"B\",\"X\",\"\")","v":{"$error":"#NAME?"}},{"$f":"IF(INDEX(periode3,NEVAL,Nenfant)=\"A\",\"X\",\"\")","v":{"$error":"#NAME?"}},null,{"$f":"IF(INDEX(periode4,NEVAL,Nenfant)=\"D\",\"X\",\"\")","v":{"$error":"#NAME?"}},{"$f":"IF(INDEX(periode4,NEVAL,Nenfant)=\"C\",\"X\",\"\")","v":{"$error":"#NAME?"}},{"$f":"IF(INDEX(periode4,NEVAL,Nenfant)=\"B\",\"X\",\"\")","v":{"$error":"#NAME?"}},{"$f":"IF(INDEX(periode4,NEVAL,Nenfant)=\"A\",\"X\",\"\")","v":{"$error":"#NAME?"}},null,{"$f":"IF(INDEX(periode5,NEVAL,Nenfant)=\"D\",\"X\",\"\")","v":{"$error":"#NAME?"}},{"$f":"IF(INDEX(periode5,NEVAL,Nenfant)=\"C\",\"X\",\"\")","v":{"$error":"#NAME?"}},{"$f":"IF(INDEX(periode5,NEVAL,Nenfant)=\"B\",\"X\",\"\")","v":{"$error":"#NAME?"}},{"$f":"IF(INDEX(periode5,NEVAL,Nenfant)=\"A\",\"X\",\"\")","v":{"$error":"#NAME?"}},null,{"$f":"IF(INDEX(periode6,NEVAL,Nenfant)=\"D\",\"X\",\"\")","v":{"$error":"#NAME?"}},{"$f":"IF(INDEX(periode6,NEVAL,Nenfant)=\"C\",\"X\",\"\")","v":{"$error":"#NAME?"}},{"$f":"IF(INDEX(periode6,NEVAL,Nenfant)=\"B\",\"X\",\"\")","v":{"$error":"#NAME?"}},{"$f":"IF(INDEX(periode6,NEVAL,Nenfant)=\"A\",\"X\",\"\")","v":{"$error":"#NAME?"}}]
[124,{"$nulls":7},{"$f":"IF(INDEX(periode1,NEVAL,Nenfant)=\"D\",\"X\",\"\")","v":{"$error":"#NAME?"}},{"$f":"IF(INDEX(periode1,NEVAL,Nenfant)=\"C\",\"X\",\"\")","v":{"$error":"#NAME?"}},{"$f":"IF(INDEX(periode1,NEVAL,Nenfant)=\"B\",\"X\",\"\")","v":{"$error":"#NAME?"}},{"$f":"IF(INDEX(periode1,NEVAL,Nenfant)=\"A\",\"X\",\"\")","v":{"$error":"#NAME?"}},null,{"$f":"IF(INDEX(periode2,NEVAL,Nenfant)=\"D\",\"X\",\"\")","v":{"$error":"#NAME?"}},{"$f":"IF(INDEX(periode2,NEVAL,Nenfant)=\"C\",\"X\",\"\")","v":{"$error":"#NAME?"}},{"$f":"IF(INDEX(periode2,NEVAL,Nenfant)=\"B\",\"X\",\"\")","v":{"$error":"#NAME?"}},{"$f":"IF(INDEX(periode2,NEVAL,Nenfant)=\"A\",\"X\",\"\")","v":{"$error":"#NAME?"}},null,{"$f":"IF(INDEX(periode3,NEVAL,Nenfant)=\"D\",\"X\",\"\")","v":{"$error":"#NAME?"}},{"$f":"IF(INDEX(periode3,NEVAL,Nenfant)=\"C\",\"X\",\"\")","v":{"$error":"#NAME?"}},{"$f":"IF(INDEX(periode3,NEVAL,Nenfant)=\"B\",\"X\",\"\")","v":{"$error":"#NAME?"}},{"$f":"IF(INDEX(periode3,NEVAL,Nenfant)=\"A\",\"X\",\"\")","v":{"$error":"#NAME?"}},null,{"$f":"IF(INDEX(periode4,NEVAL,Nenfant)=\"D\",\"X\",\"\")","v":{"$error":"#NAME?"}},{"$f":"IF(INDEX(periode4,NEVAL,Nenfant)=\"C\",\"X\",\"\")","v":{"$error":"#NAME?"}},{"$f":"IF(INDEX(periode4,NEVAL,Nenfant)=\"B\",\"X\",\"\")","v":{"$error":"#NAME?"}},{"$f":"IF(INDEX(periode4,NEVAL,Nenfant)=\"A\",\"X\",\"\")","v":{"$error":"#NAME?"}},null,{"$f":"IF(INDEX(periode5,NEVAL,Nenfant)=\"D\",\"X\",\"\")","v":{"$error":"#NAME?"}},{"$f":"IF(INDEX(periode5,NEVAL,Nenfant)=\"C\",\"X\",\"\")","v":{"$error":"#NAME?"}},{"$f":"IF(INDEX(periode5,NEVAL,Nenfant)=\"B\",\"X\",\"\")","v":{"$error":"#NAME?"}},{"$f":"IF(INDEX(periode5,NEVAL,Nenfant)=\"A\",\"X\",\"\")","v":{"$error":"#NAME?"}},null,{"$f":"IF(INDEX(periode6,NEVAL,Nenfant)=\"D\",\"X\",\"\")","v":{"$error":"#NAME?"}},{"$f":"IF(INDEX(periode6,NEVAL,Nenfant)=\"C\",\"X\",\"\")","v":{"$error":"#NAME?"}},{"$f":"IF(INDEX(periode6,NEVAL,Nenfant)=\"B\",\"X\",\"\")","v":{"$error":"#NAME?"}},{"$f":"IF(INDEX(periode6,NEVAL,Nenfant)=\"A\",\"X\",\"\")","v":{"$error":"#NAME?"}}]
[125,{"$nulls":7},{"$f":"IF(INDEX(periode1,NEVAL,Nenfant)=\"D\",\"X\",\"\")","v":{"$error":"#NAME?"}},{"$f":"IF(INDEX(periode1,NEVAL,Nenfant)=\"C\",\"X\",\"\")","v":{"$error":"#NAME?"}},{"$f":"IF(INDEX(periode1,NEVAL,Nenfant)=\"B\",\"X\",\"\")","v":{"$error":"#NAME?"}},{"$f":"IF(INDEX(periode1,NEVAL,Nenfant)=\"A\",\"X\",\"\")","v":{"$error":"#NAME?"}},null,{"$f":"IF(INDEX(periode2,NEVAL,Nenfant)=\"D\",\"X\",\"\")","v":{"$error":"#NAME?"}},{"$f":"IF(INDEX(periode2,NEVAL,Nenfant)=\"C\",\"X\",\"\")","v":{"$error":"#NAME?"}},{"$f":"IF(INDEX(periode2,NEVAL,Nenfant)=\"B\",\"X\",\"\")","v":{"$error":"#NAME?"}},{"$f":"IF(INDEX(periode2,NEVAL,Nenfant)=\"A\",\"X\",\"\")","v":{"$error":"#NAME?"}},null,{"$f":"IF(INDEX(periode3,NEVAL,Nenfant)=\"D\",\"X\",\"\")","v":{"$error":"#NAME?"}},{"$f":"IF(INDEX(periode3,NEVAL,Nenfant)=\"C\",\"X\",\"\")","v":{"$error":"#NAME?"}},{"$f":"IF(INDEX(periode3,NEVAL,Nenfant)=\"B\",\"X\",\"\")","v":{"$error":"#NAME?"}},{"$f":"IF(INDEX(periode3,NEVAL,Nenfant)=\"A\",\"X\",\"\")","v":{"$error":"#NAME?"}},null,{"$f":"IF(INDEX(periode4,NEVAL,Nenfant)=\"D\",\"X\",\"\")","v":{"$error":"#NAME?"}},{"$f":"IF(INDEX(periode4,NEVAL,Nenfant)=\"C\",\"X\",\"\")","v":{"$error":"#NAME?"}},{"$f":"IF(INDEX(periode4,NEVAL,Nenfant)=\"B\",\"X\",\"\")","v":{"$error":"#NAME?"}},{"$f":"IF(INDEX(periode4,NEVAL,Nenfant)=\"A\",\"X\",\"\")","v":{"$error":"#NAME?"}},null,{"$f":"IF(INDEX(periode5,NEVAL,Nenfant)=\"D\",\"X\",\"\")","v":{"$error":"#NAME?"}},{"$f":"IF(INDEX(periode5,NEVAL,Nenfant)=\"C\",\"X\",\"\")","v":{"$error":"#NAME?"}},{"$f":"IF(INDEX(periode5,NEVAL,Nenfant)=\"B\",\"X\",\"\")","v":{"$error":"#NAME?"}},{"$f":"IF(INDEX(periode5,NEVAL,Nenfant)=\"A\",\"X\",\"\")","v":{"$error":"#NAME?"}},null,{"$f":"IF(INDEX(periode6,NEVAL,Nenfant)=\"D\",\"X\",\"\")","v":{"$error":"#NAME?"}},{"$f":"IF(INDEX(periode6,NEVAL,Nenfant)=\"C\",\"X\",\"\")","v":{"$error":"#NAME?"}},{"$f":"IF(INDEX(periode6,NEVAL,Nenfant)=\"B\",\"X\",\"\")","v":{"$error":"#NAME?"}},{"$f":"IF(INDEX(periode6,NEVAL,Nenfant)=\"A\",\"X\",\"\")","v":{"$error":"#NAME?"}}]
[126,{"$nulls":7},{"$f":"IF(INDEX(periode1,NEVAL,Nenfant)=\"D\",\"X\",\"\")","v":{"$error":"#NAME?"}},{"$f":"IF(INDEX(periode1,NEVAL,Nenfant)=\"C\",\"X\",\"\")","v":{"$error":"#NAME?"}},{"$f":"IF(INDEX(periode1,NEVAL,Nenfant)=\"B\",\"X\",\"\")","v":{"$error":"#NAME?"}},{"$f":"IF(INDEX(periode1,NEVAL,Nenfant)=\"A\",\"X\",\"\")","v":{"$error":"#NAME?"}},null,{"$f":"IF(INDEX(periode2,NEVAL,Nenfant)=\"D\",\"X\",\"\")","v":{"$error":"#NAME?"}},{"$f":"IF(INDEX(periode2,NEVAL,Nenfant)=\"C\",\"X\",\"\")","v":{"$error":"#NAME?"}},{"$f":"IF(INDEX(periode2,NEVAL,Nenfant)=\"B\",\"X\",\"\")","v":{"$error":"#NAME?"}},{"$f":"IF(INDEX(periode2,NEVAL,Nenfant)=\"A\",\"X\",\"\")","v":{"$error":"#NAME?"}},null,{"$f":"IF(INDEX(periode3,NEVAL,Nenfant)=\"D\",\"X\",\"\")","v":{"$error":"#NAME?"}},{"$f":"IF(INDEX(periode3,NEVAL,Nenfant)=\"C\",\"X\",\"\")","v":{"$error":"#NAME?"}},{"$f":"IF(INDEX(periode3,NEVAL,Nenfant)=\"B\",\"X\",\"\")","v":{"$error":"#NAME?"}},{"$f":"IF(INDEX(periode3,NEVAL,Nenfant)=\"A\",\"X\",\"\")","v":{"$error":"#NAME?"}},null,{"$f":"IF(INDEX(periode4,NEVAL,Nenfant)=\"D\",\"X\",\"\")","v":{"$error":"#NAME?"}},{"$f":"IF(INDEX(periode4,NEVAL,Nenfant)=\"C\",\"X\",\"\")","v":{"$error":"#NAME?"}},{"$f":"IF(INDEX(periode4,NEVAL,Nenfant)=\"B\",\"X\",\"\")","v":{"$error":"#NAME?"}},{"$f":"IF(INDEX(periode4,NEVAL,Nenfant)=\"A\",\"X\",\"\")","v":{"$error":"#NAME?"}},null,{"$f":"IF(INDEX(periode5,NEVAL,Nenfant)=\"D\",\"X\",\"\")","v":{"$error":"#NAME?"}},{"$f":"IF(INDEX(periode5,NEVAL,Nenfant)=\"C\",\"X\",\"\")","v":{"$error":"#NAME?"}},{"$f":"IF(INDEX(periode5,NEVAL,Nenfant)=\"B\",\"X\",\"\")","v":{"$error":"#NAME?"}},{"$f":"IF(INDEX(periode5,NEVAL,Nenfant)=\"A\",\"X\",\"\")","v":{"$error":"#NAME?"}},null,{"$f":"IF(INDEX(periode6,NEVAL,Nenfant)=\"D\",\"X\",\"\")","v":{"$error":"#NAME?"}},{"$f":"IF(INDEX(periode6,NEVAL,Nenfant)=\"C\",\"X\",\"\")","v":{"$error":"#NAME?"}},{"$f":"IF(INDEX(periode6,NEVAL,Nenfant)=\"B\",\"X\",\"\")","v":{"$error":"#NAME?"}},{"$f":"IF(INDEX(periode6,NEVAL,Nenfant)=\"A\",\"X\",\"\")","v":{"$error":"#NAME?"}}]
[127,{"$nulls":7},{"$f":"COUNTIF($G133:$G135,\"X\")","v":0},{"$f":"COUNTIF($H133:$H135,\"X\")","v":0},{"$f":"COUNTIF($I134:$I135,\"X\")","v":0},{"$f":"COUNTIF($J134:$J135,\"X\")","v":0},null,{"$f":"COUNTIF($G133:$G135,\"X\")","v":0},{"$f":"COUNTIF($H133:$H135,\"X\")","v":0},{"$f":"COUNTIF($I134:$I135,\"X\")","v":0},{"$f":"COUNTIF($J134:$J135,\"X\")","v":0},null,{"$f":"COUNTIF($G133:$G135,\"X\")","v":0},{"$f":"COUNTIF($H133:$H135,\"X\")","v":0},{"$f":"COUNTIF($I134:$I135,\"X\")","v":0},{"$f":"COUNTIF($J134:$J135,\"X\")","v":0},null,{"$f":"COUNTIF($G133:$G135,\"X\")","v":0},{"$f":"COUNTIF($H133:$H135,\"X\")","v":0},{"$f":"COUNTIF($I134:$I135,\"X\")","v":0},{"$f":"COUNTIF(AA134:AA135,\"X\")","v":0},null,{"$f":"COUNTIF($G133:$G135,\"X\")","v":0},{"$f":"COUNTIF($H133:$H135,\"X\")","v":0},{"$f":"COUNTIF($I134:$I135,\"X\")","v":0},{"$f":"COUNTIF($J134:$J135,\"X\")","v":0},null,{"$f":"COUNTIF($G133:$G135,\"X\")","v":0},{"$f":"COUNTIF($H133:$H135,\"X\")","v":0},{"$f":"COUNTIF($I134:$I135,\"X\")","v":0},{"$f":"COUNTIF($J134:$J135,\"X\")","v":0}]
[128,{"$nulls":7},{"$f":"IF(INDEX(periode1,NEVAL,Nenfant)=\"D\",\"X\",\"\")","v":{"$error":"#NAME?"}},{"$f":"IF(INDEX(periode1,NEVAL,Nenfant)=\"C\",\"X\",\"\")","v":{"$error":"#NAME?"}},{"$f":"IF(INDEX(periode1,NEVAL,Nenfant)=\"B\",\"X\",\"\")","v":{"$error":"#NAME?"}},{"$f":"IF(INDEX(periode1,NEVAL,Nenfant)=\"A\",\"X\",\"\")","v":{"$error":"#NAME?"}},null,{"$f":"IF(INDEX(periode2,NEVAL,Nenfant)=\"D\",\"X\",\"\")","v":{"$error":"#NAME?"}},{"$f":"IF(INDEX(periode2,NEVAL,Nenfant)=\"C\",\"X\",\"\")","v":{"$error":"#NAME?"}},{"$f":"IF(INDEX(periode2,NEVAL,Nenfant)=\"B\",\"X\",\"\")","v":{"$error":"#NAME?"}},{"$f":"IF(INDEX(periode2,NEVAL,Nenfant)=\"A\",\"X\",\"\")","v":{"$error":"#NAME?"}},null,{"$f":"IF(INDEX(periode3,NEVAL,Nenfant)=\"D\",\"X\",\"\")","v":{"$error":"#NAME?"}},{"$f":"IF(INDEX(periode3,NEVAL,Nenfant)=\"C\",\"X\",\"\")","v":{"$error":"#NAME?"}},{"$f":"IF(INDEX(periode3,NEVAL,Nenfant)=\"B\",\"X\",\"\")","v":{"$error":"#NAME?"}},{"$f":"IF(INDEX(periode3,NEVAL,Nenfant)=\"A\",\"X\",\"\")","v":{"$error":"#NAME?"}},null,{"$f":"IF(INDEX(periode4,NEVAL,Nenfant)=\"D\",\"X\",\"\")","v":{"$error":"#NAME?"}},{"$f":"IF(INDEX(periode4,NEVAL,Nenfant)=\"C\",\"X\",\"\")","v":{"$error":"#NAME?"}},{"$f":"IF(INDEX(periode4,NEVAL,Nenfant)=\"B\",\"X\",\"\")","v":{"$error":"#NAME?"}},{"$f":"IF(INDEX(periode4,NEVAL,Nenfant)=\"A\",\"X\",\"\")","v":{"$error":"#NAME?"}},null,{"$f":"IF(INDEX(periode5,NEVAL,Nenfant)=\"D\",\"X\",\"\")","v":{"$error":"#NAME?"}},{"$f":"IF(INDEX(periode5,NEVAL,Nenfant)=\"C\",\"X\",\"\")","v":{"$error":"#NAME?"}},{"$f":"IF(INDEX(periode5,NEVAL,Nenfant)=\"B\",\"X\",\"\")","v":{"$error":"#NAME?"}},{"$f":"IF(INDEX(periode5,NEVAL,Nenfant)=\"A\",\"X\",\"\")","v":{"$error":"#NAME?"}},null,{"$f":"IF(INDEX(periode6,NEVAL,Nenfant)=\"D\",\"X\",\"\")","v":{"$error":"#NAME?"}},{"$f":"IF(INDEX(periode6,NEVAL,Nenfant)=\"C\",\"X\",\"\")","v":{"$error":"#NAME?"}},{"$f":"IF(INDEX(periode6,NEVAL,Nenfant)=\"B\",\"X\",\"\")","v":{"$error":"#NAME?"}},{"$f":"IF(INDEX(periode6,NEVAL,Nenfant)=\"A\",\"X\",\"\")","v":{"$error":"#NAME?"}}]
[129,{"$nulls":7},{"$f":"IF(INDEX(periode1,NEVAL,Nenfant)=\"D\",\"X\",\"\")","v":{"$error":"#NAME?"}},{"$f":"IF(INDEX(periode1,NEVAL,Nenfant)=\"C\",\"X\",\"\")","v":{"$error":"#NAME?"}},{"$f":"IF(INDEX(periode1,NEVAL,Nenfant)=\"B\",\"X\",\"\")","v":{"$error":"#NAME?"}},{"$f":"IF(INDEX(periode1,NEVAL,Nenfant)=\"A\",\"X\",\"\")","v":{"$error":"#NAME?"}},null,{"$f":"IF(INDEX(periode2,NEVAL,Nenfant)=\"D\",\"X\",\"\")","v":{"$error":"#NAME?"}},{"$f":"IF(INDEX(periode2,NEVAL,Nenfant)=\"C\",\"X\",\"\")","v":{"$error":"#NAME?"}},{"$f":"IF(INDEX(periode2,NEVAL,Nenfant)=\"B\",\"X\",\"\")","v":{"$error":"#NAME?"}},{"$f":"IF(INDEX(periode2,NEVAL,Nenfant)=\"A\",\"X\",\"\")","v":{"$error":"#NAME?"}},null,{"$f":"IF(INDEX(periode3,NEVAL,Nenfant)=\"D\",\"X\",\"\")","v":{"$error":"#NAME?"}},{"$f":"IF(INDEX(periode3,NEVAL,Nenfant)=\"C\",\"X\",\"\")","v":{"$error":"#NAME?"}},{"$f":"IF(INDEX(periode3,NEVAL,Nenfant)=\"B\",\"X\",\"\")","v":{"$error":"#NAME?"}},{"$f":"IF(INDEX(periode3,NEVAL,Nenfant)=\"A\",\"X\",\"\")","v":{"$error":"#NAME?"}},null,{"$f":"IF(INDEX(periode4,NEVAL,Nenfant)=\"D\",\"X\",\"\")","v":{"$error":"#NAME?"}},{"$f":"IF(INDEX(periode4,NEVAL,Nenfant)=\"C\",\"X\",\"\")","v":{"$error":"#NAME?"}},{"$f":"IF(INDEX(periode4,NEVAL,Nenfant)=\"B\",\"X\",\"\")","v":{"$error":"#NAME?"}},{"$f":"IF(INDEX(periode4,NEVAL,Nenfant)=\"A\",\"X\",\"\")","v":{"$error":"#NAME?"}},null,{"$f":"IF(INDEX(periode5,NEVAL,Nenfant)=\"D\",\"X\",\"\")","v":{"$error":"#NAME?"}},{"$f":"IF(INDEX(periode5,NEVAL,Nenfant)=\"C\",\"X\",\"\")","v":{"$error":"#NAME?"}},{"$f":"IF(INDEX(periode5,NEVAL,Nenfant)=\"B\",\"X\",\"\")","v":{"$error":"#NAME?"}},{"$f":"IF(INDEX(periode5,NEVAL,Nenfant)=\"A\",\"X\",\"\")","v":{"$error":"#NAME?"}},null,{"$f":"IF(INDEX(periode6,NEVAL,Nenfant)=\"D\",\"X\",\"\")","v":{"$error":"#NAME?"}},{"$f":"IF(INDEX(periode6,NEVAL,Nenfant)=\"C\",\"X\",\"\")","v":{"$error":"#NAME?"}},{"$f":"IF(INDEX(periode6,NEVAL,Nenfant)=\"B\",\"X\",\"\")","v":{"$error":"#NAME?"}},{"$f":"IF(INDEX(periode6,NEVAL,Nenfant)=\"A\",\"X\",\"\")","v":{"$error":"#NAME?"}}]
[130,{"$nulls":7},{"$f":"COUNTIF($G136:$G138,\"X\")","v":0},{"$f":"COUNTIF($H136:$H138,\"X\")","v":0},{"$f":"COUNTIF($I137:$I138,\"X\")","v":0},{"$f":"COUNTIF($J137:$J138,\"X\")","v":0},null,{"$f":"COUNTIF($G136:$G138,\"X\")","v":0},{"$f":"COUNTIF($H136:$H138,\"X\")","v":0},{"$f":"COUNTIF($I137:$I138,\"X\")","v":0},{"$f":"COUNTIF($J137:$J138,\"X\")","v":0},null,{"$f":"COUNTIF($G136:$G138,\"X\")","v":0},{"$f":"COUNTIF($H136:$H138,\"X\")","v":0},{"$f":"COUNTIF($I137:$I138,\"X\")","v":0},{"$f":"COUNTIF($J137:$J138,\"X\")","v":0},null,{"$f":"COUNTIF($G136:$G138,\"X\")","v":0},{"$f":"COUNTIF($H136:$H138,\"X\")","v":0},{"$f":"COUNTIF($I137:$I138,\"X\")","v":0},{"$f":"COUNTIF(AA137:AA138,\"X\")","v":0},null,{"$f":"COUNTIF($G136:$G138,\"X\")","v":0},{"$f":"COUNTIF($H136:$H138,\"X\")","v":0},{"$f":"COUNTIF($I137:$I138,\"X\")","v":0},{"$f":"COUNTIF($J137:$J138,\"X\")","v":0},null,{"$f":"COUNTIF($G136:$G138,\"X\")","v":0},{"$f":"COUNTIF($H136:$H138,\"X\")","v":0},{"$f":"COUNTIF($I137:$I138,\"X\")","v":0},{"$f":"COUNTIF($J137:$J138,\"X\")","v":0}]
[131,{"$nulls":7},{"$f":"IF(INDEX(periode1,NEVAL,Nenfant)=\"D\",\"X\",\"\")","v":{"$error":"#NAME?"}},{"$f":"IF(INDEX(periode1,NEVAL,Nenfant)=\"C\",\"X\",\"\")","v":{"$error":"#NAME?"}},{"$f":"IF(INDEX(periode1,NEVAL,Nenfant)=\"B\",\"X\",\"\")","v":{"$error":"#NAME?"}},{"$f":"IF(INDEX(periode1,NEVAL,Nenfant)=\"A\",\"X\",\"\")","v":{"$error":"#NAME?"}},null,{"$f":"IF(INDEX(periode2,NEVAL,Nenfant)=\"D\",\"X\",\"\")","v":{"$error":"#NAME?"}},{"$f":"IF(INDEX(periode2,NEVAL,Nenfant)=\"C\",\"X\",\"\")","v":{"$error":"#NAME?"}},{"$f":"IF(INDEX(periode2,NEVAL,Nenfant)=\"B\",\"X\",\"\")","v":{"$error":"#NAME?"}},{"$f":"IF(INDEX(periode2,NEVAL,Nenfant)=\"A\",\"X\",\"\")","v":{"$error":"#NAME?"}},null,{"$f":"IF(INDEX(periode3,NEVAL,Nenfant)=\"D\",\"X\",\"\")","v":{"$error":"#NAME?"}},{"$f":"IF(INDEX(periode3,NEVAL,Nenfant)=\"C\",\"X\",\"\")","v":{"$error":"#NAME?"}},{"$f":"IF(INDEX(periode3,NEVAL,Nenfant)=\"B\",\"X\",\"\")","v":{"$error":"#NAME?"}},{"$f":"IF(INDEX(periode3,NEVAL,Nenfant)=\"A\",\"X\",\"\")","v":{"$error":"#NAME?"}},null,{"$f":"IF(INDEX(periode4,NEVAL,Nenfant)=\"D\",\"X\",\"\")","v":{"$error":"#NAME?"}},{"$f":"IF(INDEX(periode4,NEVAL,Nenfant)=\"C\",\"X\",\"\")","v":{"$error":"#NAME?"}},{"$f":"IF(INDEX(periode4,NEVAL,Nenfant)=\"B\",\"X\",\"\")","v":{"$error":"#NAME?"}},{"$f":"IF(INDEX(periode4,NEVAL,Nenfant)=\"A\",\"X\",\"\")","v":{"$error":"#NAME?"}},null,{"$f":"IF(INDEX(periode5,NEVAL,Nenfant)=\"D\",\"X\",\"\")","v":{"$error":"#NAME?"}},{"$f":"IF(INDEX(periode5,NEVAL,Nenfant)=\"C\",\"X\",\"\")","v":{"$error":"#NAME?"}},{"$f":"IF(INDEX(periode5,NEVAL,Nenfant)=\"B\",\"X\",\"\")","v":{"$error":"#NAME?"}},{"$f":"IF(INDEX(periode5,NEVAL,Nenfant)=\"A\",\"X\",\"\")","v":{"$error":"#NAME?"}},null,{"$f":"IF(INDEX(periode6,NEVAL,Nenfant)=\"D\",\"X\",\"\")","v":{"$error":"#NAME?"}},{"$f":"IF(INDEX(periode6,NEVAL,Nenfant)=\"C\",\"X\",\"\")","v":{"$error":"#NAME?"}},{"$f":"IF(INDEX(periode6,NEVAL,Nenfant)=\"B\",\"X\",\"\")","v":{"$error":"#NAME?"}},{"$f":"IF(INDEX(periode6,NEVAL,Nenfant)=\"A\",\"X\",\"\")","v":{"$error":"#NAME?"}}]
[132,{"$nulls":7},{"$f":"IF(INDEX(periode1,NEVAL,Nenfant)=\"D\",\"X\",\"\")","v":{"$error":"#NAME?"}},{"$f":"IF(INDEX(periode1,NEVAL,Nenfant)=\"C\",\"X\",\"\")","v":{"$error":"#NAME?"}},{"$f":"IF(INDEX(periode1,NEVAL,Nenfant)=\"B\",\"X\",\"\")","v":{"$error":"#NAME?"}},{"$f":"IF(INDEX(periode1,NEVAL,Nenfant)=\"A\",\"X\",\"\")","v":{"$error":"#NAME?"}},null,{"$f":"IF(INDEX(periode2,NEVAL,Nenfant)=\"D\",\"X\",\"\")","v":{"$error":"#NAME?"}},{"$f":"IF(INDEX(periode2,NEVAL,Nenfant)=\"C\",\"X\",\"\")","v":{"$error":"#NAME?"}},{"$f":"IF(INDEX(periode2,NEVAL,Nenfant)=\"B\",\"X\",\"\")","v":{"$error":"#NAME?"}},{"$f":"IF(INDEX(periode2,NEVAL,Nenfant)=\"A\",\"X\",\"\")","v":{"$error":"#NAME?"}},null,{"$f":"IF(INDEX(periode3,NEVAL,Nenfant)=\"D\",\"X\",\"\")","v":{"$error":"#NAME?"}},{"$f":"IF(INDEX(periode3,NEVAL,Nenfant)=\"C\",\"X\",\"\")","v":{"$error":"#NAME?"}},{"$f":"IF(INDEX(periode3,NEVAL,Nenfant)=\"B\",\"X\",\"\")","v":{"$error":"#NAME?"}},{"$f":"IF(INDEX(periode3,NEVAL,Nenfant)=\"A\",\"X\",\"\")","v":{"$error":"#NAME?"}},null,{"$f":"IF(INDEX(periode4,NEVAL,Nenfant)=\"D\",\"X\",\"\")","v":{"$error":"#NAME?"}},{"$f":"IF(INDEX(periode4,NEVAL,Nenfant)=\"C\",\"X\",\"\")","v":{"$error":"#NAME?"}},{"$f":"IF(INDEX(periode4,NEVAL,Nenfant)=\"B\",\"X\",\"\")","v":{"$error":"#NAME?"}},{"$f":"IF(INDEX(periode4,NEVAL,Nenfant)=\"A\",\"X\",\"\")","v":{"$error":"#NAME?"}},null,{"$f":"IF(INDEX(periode5,NEVAL,Nenfant)=\"D\",\"X\",\"\")","v":{"$error":"#NAME?"}},{"$f":"IF(INDEX(periode5,NEVAL,Nenfant)=\"C\",\"X\",\"\")","v":{"$error":"#NAME?"}},{"$f":"IF(INDEX(periode5,NEVAL,Nenfant)=\"B\",\"X\",\"\")","v":{"$error":"#NAME?"}},{"$f":"IF(INDEX(periode5,NEVAL,Nenfant)=\"A\",\"X\",\"\")","v":{"$error":"#NAME?"}},null,{"$f":"IF(INDEX(periode6,NEVAL,Nenfant)=\"D\",\"X\",\"\")","v":{"$error":"#NAME?"}},{"$f":"IF(INDEX(periode6,NEVAL,Nenfant)=\"C\",\"X\",\"\")","v":{"$error":"#NAME?"}},{"$f":"IF(INDEX(periode6,NEVAL,Nenfant)=\"B\",\"X\",\"\")","v":{"$error":"#NAME?"}},{"$f":"IF(INDEX(periode6,NEVAL,Nenfant)=\"A\",\"X\",\"\")","v":{"$error":"#NAME?"}}]
[133,{"$nulls":7},{"$f":"COUNTIF($G142:$G144,\"X\")","v":0},{"$f":"COUNTIF($H142:$H144,\"X\")","v":0},{"$f":"COUNTIF($I140:$I142,\"X\")","v":0},{"$f":"COUNTIF($J140:$J142,\"X\")","v":0},null,{"$f":"COUNTIF($G142:$G144,\"X\")","v":0},{"$f":"COUNTIF($H142:$H144,\"X\")","v":0},{"$f":"COUNTIF($I140:$I142,\"X\")","v":0},{"$f":"COUNTIF($J140:$J142,\"X\")","v":0},null,{"$f":"COUNTIF($G142:$G144,\"X\")","v":0},{"$f":"COUNTIF($H142:$H144,\"X\")","v":0},{"$f":"COUNTIF($I140:$I142,\"X\")","v":0},{"$f":"COUNTIF($J140:$J142,\"X\")","v":0},null,{"$f":"COUNTIF($G142:$G144,\"X\")","v":0},{"$f":"COUNTIF($H142:$H144,\"X\")","v":0},{"$f":"COUNTIF($I140:$I142,\"X\")","v":0},{"$f":"COUNTIF(AA140:AA142,\"X\")","v":0},null,{"$f":"COUNTIF($G142:$G144,\"X\")","v":0},{"$f":"COUNTIF($H142:$H144,\"X\")","v":0},{"$f":"COUNTIF($I140:$I142,\"X\")","v":0},{"$f":"COUNTIF($J140:$J142,\"X\")","v":0},null,{"$f":"COUNTIF($G142:$G144,\"X\")","v":0},{"$f":"COUNTIF($H142:$H144,\"X\")","v":0},{"$f":"COUNTIF($I140:$I142,\"X\")","v":0},{"$f":"COUNTIF($J140:$J142,\"X\")","v":0}]
[134,{"$nulls":7},{"$f":"IF(INDEX(periode1,NEVAL,Nenfant)=\"D\",\"X\",\"\")","v":{"$error":"#NAME?"}},{"$f":"IF(INDEX(periode1,NEVAL,Nenfant)=\"C\",\"X\",\"\")","v":{"$error":"#NAME?"}},{"$f":"IF(INDEX(periode1,NEVAL,Nenfant)=\"B\",\"X\",\"\")","v":{"$error":"#NAME?"}},{"$f":"IF(INDEX(periode1,NEVAL,Nenfant)=\"A\",\"X\",\"\")","v":{"$error":"#NAME?"}},null,{"$f":"IF(INDEX(periode2,NEVAL,Nenfant)=\"D\",\"X\",\"\")","v":{"$error":"#NAME?"}},{"$f":"IF(INDEX(periode2,NEVAL,Nenfant)=\"C\",\"X\",\"\")","v":{"$error":"#NAME?"}},{"$f":"IF(INDEX(periode2,NEVAL,Nenfant)=\"B\",\"X\",\"\")","v":{"$error":"#NAME?"}},{"$f":"IF(INDEX(periode2,NEVAL,Nenfant)=\"A\",\"X\",\"\")","v":{"$error":"#NAME?"}},null,{"$f":"IF(INDEX(periode3,NEVAL,Nenfant)=\"D\",\"X\",\"\")","v":{"$error":"#NAME?"}},{"$f":"IF(INDEX(periode3,NEVAL,Nenfant)=\"C\",\"X\",\"\")","v":{"$error":"#NAME?"}},{"$f":"IF(INDEX(periode3,NEVAL,Nenfant)=\"B\",\"X\",\"\")","v":{"$error":"#NAME?"}},{"$f":"IF(INDEX(periode3,NEVAL,Nenfant)=\"A\",\"X\",\"\")","v":{"$error":"#NAME?"}},null,{"$f":"IF(INDEX(periode4,NEVAL,Nenfant)=\"D\",\"X\",\"\")","v":{"$error":"#NAME?"}},{"$f":"IF(INDEX(periode4,NEVAL,Nenfant)=\"C\",\"X\",\"\")","v":{"$error":"#NAME?"}},{"$f":"IF(INDEX(periode4,NEVAL,Nenfant)=\"B\",\"X\",\"\")","v":{"$error":"#NAME?"}},{"$f":"IF(INDEX(periode4,NEVAL,Nenfant)=\"A\",\"X\",\"\")","v":{"$error":"#NAME?"}},null,{"$f":"IF(INDEX(periode5,NEVAL,Nenfant)=\"D\",\"X\",\"\")","v":{"$error":"#NAME?"}},{"$f":"IF(INDEX(periode5,NEVAL,Nenfant)=\"C\",\"X\",\"\")","v":{"$error":"#NAME?"}},{"$f":"IF(INDEX(periode5,NEVAL,Nenfant)=\"B\",\"X\",\"\")","v":{"$error":"#NAME?"}},{"$f":"IF(INDEX(periode5,NEVAL,Nenfant)=\"A\",\"X\",\"\")","v":{"$error":"#NAME?"}},null,{"$f":"IF(INDEX(periode6,NEVAL,Nenfant)=\"D\",\"X\",\"\")","v":{"$error":"#NAME?"}},{"$f":"IF(INDEX(periode6,NEVAL,Nenfant)=\"C\",\"X\",\"\")","v":{"$error":"#NAME?"}},{"$f":"IF(INDEX(periode6,NEVAL,Nenfant)=\"B\",\"X\",\"\")","v":{"$error":"#NAME?"}},{"$f":"IF(INDEX(periode6,NEVAL,Nenfant)=\"A\",\"X\",\"\")","v":{"$error":"#NAME?"}}]
[135,{"$nulls":7},{"$f":"IF(INDEX(periode1,NEVAL,Nenfant)=\"D\",\"X\",\"\")","v":{"$error":"#NAME?"}},{"$f":"IF(INDEX(periode1,NEVAL,Nenfant)=\"C\",\"X\",\"\")","v":{"$error":"#NAME?"}},{"$f":"IF(INDEX(periode1,NEVAL,Nenfant)=\"B\",\"X\",\"\")","v":{"$error":"#NAME?"}},{"$f":"IF(INDEX(periode1,NEVAL,Nenfant)=\"A\",\"X\",\"\")","v":{"$error":"#NAME?"}},null,{"$f":"IF(INDEX(periode2,NEVAL,Nenfant)=\"D\",\"X\",\"\")","v":{"$error":"#NAME?"}},{"$f":"IF(INDEX(periode2,NEVAL,Nenfant)=\"C\",\"X\",\"\")","v":{"$error":"#NAME?"}},{"$f":"IF(INDEX(periode2,NEVAL,Nenfant)=\"B\",\"X\",\"\")","v":{"$error":"#NAME?"}},{"$f":"IF(INDEX(periode2,NEVAL,Nenfant)=\"A\",\"X\",\"\")","v":{"$error":"#NAME?"}},null,{"$f":"IF(INDEX(periode3,NEVAL,Nenfant)=\"D\",\"X\",\"\")","v":{"$error":"#NAME?"}},{"$f":"IF(INDEX(periode3,NEVAL,Nenfant)=\"C\",\"X\",\"\")","v":{"$error":"#NAME?"}},{"$f":"IF(INDEX(periode3,NEVAL,Nenfant)=\"B\",\"X\",\"\")","v":{"$error":"#NAME?"}},{"$f":"IF(INDEX(periode3,NEVAL,Nenfant)=\"A\",\"X\",\"\")","v":{"$error":"#NAME?"}},null,{"$f":"IF(INDEX(periode4,NEVAL,Nenfant)=\"D\",\"X\",\"\")","v":{"$error":"#NAME?"}},{"$f":"IF(INDEX(periode4,NEVAL,Nenfant)=\"C\",\"X\",\"\")","v":{"$error":"#NAME?"}},{"$f":"IF(INDEX(periode4,NEVAL,Nenfant)=\"B\",\"X\",\"\")","v":{"$error":"#NAME?"}},{"$f":"IF(INDEX(periode4,NEVAL,Nenfant)=\"A\",\"X\",\"\")","v":{"$error":"#NAME?"}},null,{"$f":"IF(INDEX(periode5,NEVAL,Nenfant)=\"D\",\"X\",\"\")","v":{"$error":"#NAME?"}},{"$f":"IF(INDEX(periode5,NEVAL,Nenfant)=\"C\",\"X\",\"\")","v":{"$error":"#NAME?"}},{"$f":"IF(INDEX(periode5,NEVAL,Nenfant)=\"B\",\"X\",\"\")","v":{"$error":"#NAME?"}},{"$f":"IF(INDEX(periode5,NEVAL,Nenfant)=\"A\",\"X\",\"\")","v":{"$error":"#NAME?"}},null,{"$f":"IF(INDEX(periode6,NEVAL,Nenfant)=\"D\",\"X\",\"\")","v":{"$error":"#NAME?"}},{"$f":"IF(INDEX(periode6,NEVAL,Nenfant)=\"C\",\"X\",\"\")","v":{"$error":"#NAME?"}},{"$f":"IF(INDEX(periode6,NEVAL,Nenfant)=\"B\",\"X\",\"\")","v":{"$error":"#NAME?"}},{"$f":"IF(INDEX(periode6,NEVAL,Nenfant)=\"A\",\"X\",\"\")","v":{"$error":"#NAME?"}}]
[136,{"$nulls":7},{"$f":"IF(INDEX(periode1,NEVAL,Nenfant)=\"D\",\"X\",\"\")","v":{"$error":"#NAME?"}},{"$f":"IF(INDEX(periode1,NEVAL,Nenfant)=\"C\",\"X\",\"\")","v":{"$error":"#NAME?"}},{"$f":"IF(INDEX(periode1,NEVAL,Nenfant)=\"B\",\"X\",\"\")","v":{"$error":"#NAME?"}},{"$f":"IF(INDEX(periode1,NEVAL,Nenfant)=\"A\",\"X\",\"\")","v":{"$error":"#NAME?"}},null,{"$f":"IF(INDEX(periode2,NEVAL,Nenfant)=\"D\",\"X\",\"\")","v":{"$error":"#NAME?"}},{"$f":"IF(INDEX(periode2,NEVAL,Nenfant)=\"C\",\"X\",\"\")","v":{"$error":"#NAME?"}},{"$f":"IF(INDEX(periode2,NEVAL,Nenfant)=\"B\",\"X\",\"\")","v":{"$error":"#NAME?"}},{"$f":"IF(INDEX(periode2,NEVAL,Nenfant)=\"A\",\"X\",\"\")","v":{"$error":"#NAME?"}},null,{"$f":"IF(INDEX(periode3,NEVAL,Nenfant)=\"D\",\"X\",\"\")","v":{"$error":"#NAME?"}},{"$f":"IF(INDEX(periode3,NEVAL,Nenfant)=\"C\",\"X\",\"\")","v":{"$error":"#NAME?"}},{"$f":"IF(INDEX(periode3,NEVAL,Nenfant)=\"B\",\"X\",\"\")","v":{"$error":"#NAME?"}},{"$f":"IF(INDEX(periode3,NEVAL,Nenfant)=\"A\",\"X\",\"\")","v":{"$error":"#NAME?"}},null,{"$f":"IF(INDEX(periode4,NEVAL,Nenfant)=\"D\",\"X\",\"\")","v":{"$error":"#NAME?"}},{"$f":"IF(INDEX(periode4,NEVAL,Nenfant)=\"C\",\"X\",\"\")","v":{"$error":"#NAME?"}},{"$f":"IF(INDEX(periode4,NEVAL,Nenfant)=\"B\",\"X\",\"\")","v":{"$error":"#NAME?"}},{"$f":"IF(INDEX(periode4,NEVAL,Nenfant)=\"A\",\"X\",\"\")","v":{"$error":"#NAME?"}},null,{"$f":"IF(INDEX(periode5,NEVAL,Nenfant)=\"D\",\"X\",\"\")","v":{"$error":"#NAME?"}},{"$f":"IF(INDEX(periode5,NEVAL,Nenfant)=\"C\",\"X\",\"\")","v":{"$error":"#NAME?"}},{"$f":"IF(INDEX(periode5,NEVAL,Nenfant)=\"B\",\"X\",\"\")","v":{"$error":"#NAME?"}},{"$f":"IF(INDEX(periode5,NEVAL,Nenfant)=\"A\",\"X\",\"\")","v":{"$error":"#NAME?"}},null,{"$f":"IF(INDEX(periode6,NEVAL,Nenfant)=\"D\",\"X\",\"\")","v":{"$error":"#NAME?"}},{"$f":"IF(INDEX(periode6,NEVAL,Nenfant)=\"C\",\"X\",\"\")","v":{"$error":"#NAME?"}},{"$f":"IF(INDEX(periode6,NEVAL,Nenfant)=\"B\",\"X\",\"\")","v":{"$error":"#NAME?"}},{"$f":"IF(INDEX(periode6,NEVAL,Nenfant)=\"A\",\"X\",\"\")","v":{"$error":"#NAME?"}}]
[137,{"$nulls":7},{"$f":"COUNTIF($G138,\"X\")","v":0},{"$f":"COUNTIF($H138,\"X\")","v":0},{"$f":"COUNTIF($I144,\"X\")","v":0},{"$f":"COUNTIF($J144,\"X\")","v":0},null,{"$f":"COUNTIF($G138,\"X\")","v":0},{"$f":"COUNTIF($H138,\"X\")","v":0},{"$f":"COUNTIF($I144,\"X\")","v":0},{"$f":"COUNTIF($J144,\"X\")","v":0},null,{"$f":"COUNTIF($G138,\"X\")","v":0},{"$f":"COUNTIF($H138,\"X\")","v":0},{"$f":"COUNTIF($I144,\"X\")","v":0},{"$f":"COUNTIF($J144,\"X\")","v":0},null,{"$f":"COUNTIF($G138,\"X\")","v":0},{"$f":"COUNTIF($H138,\"X\")","v":0},{"$f":"COUNTIF($I144,\"X\")","v":0},{"$f":"COUNTIF(AA144,\"X\")","v":0},null,{"$f":"COUNTIF($G138,\"X\")","v":0},{"$f":"COUNTIF($H138,\"X\")","v":0},{"$f":"COUNTIF($I144,\"X\")","v":0},{"$f":"COUNTIF($J144,\"X\")","v":0},null,{"$f":"COUNTIF($G138,\"X\")","v":0},{"$f":"COUNTIF($H138,\"X\")","v":0},{"$f":"COUNTIF($I144,\"X\")","v":0},{"$f":"COUNTIF($J144,\"X\")","v":0}]
[138,{"$nulls":7},{"$f":"IF(INDEX(periode1,NEVAL,Nenfant)=\"D\",\"X\",\"\")","v":{"$error":"#NAME?"}},{"$f":"IF(INDEX(periode1,NEVAL,Nenfant)=\"C\",\"X\",\"\")","v":{"$error":"#NAME?"}},{"$f":"IF(INDEX(periode1,NEVAL,Nenfant)=\"B\",\"X\",\"\")","v":{"$error":"#NAME?"}},{"$f":"IF(INDEX(periode1,NEVAL,Nenfant)=\"A\",\"X\",\"\")","v":{"$error":"#NAME?"}},null,{"$f":"IF(INDEX(periode2,NEVAL,Nenfant)=\"D\",\"X\",\"\")","v":{"$error":"#NAME?"}},{"$f":"IF(INDEX(periode2,NEVAL,Nenfant)=\"C\",\"X\",\"\")","v":{"$error":"#NAME?"}},{"$f":"IF(INDEX(periode2,NEVAL,Nenfant)=\"B\",\"X\",\"\")","v":{"$error":"#NAME?"}},{"$f":"IF(INDEX(periode2,NEVAL,Nenfant)=\"A\",\"X\",\"\")","v":{"$error":"#NAME?"}},null,{"$f":"IF(INDEX(periode3,NEVAL,Nenfant)=\"D\",\"X\",\"\")","v":{"$error":"#NAME?"}},{"$f":"IF(INDEX(periode3,NEVAL,Nenfant)=\"C\",\"X\",\"\")","v":{"$error":"#NAME?"}},{"$f":"IF(INDEX(periode3,NEVAL,Nenfant)=\"B\",\"X\",\"\")","v":{"$error":"#NAME?"}},{"$f":"IF(INDEX(periode3,NEVAL,Nenfant)=\"A\",\"X\",\"\")","v":{"$error":"#NAME?"}},null,{"$f":"IF(INDEX(periode4,NEVAL,Nenfant)=\"D\",\"X\",\"\")","v":{"$error":"#NAME?"}},{"$f":"IF(INDEX(periode4,NEVAL,Nenfant)=\"C\",\"X\",\"\")","v":{"$error":"#NAME?"}},{"$f":"IF(INDEX(periode4,NEVAL,Nenfant)=\"B\",\"X\",\"\")","v":{"$error":"#NAME?"}},{"$f":"IF(INDEX(periode4,NEVAL,Nenfant)=\"A\",\"X\",\"\")","v":{"$error":"#NAME?"}},null,{"$f":"IF(INDEX(periode5,NEVAL,Nenfant)=\"D\",\"X\",\"\")","v":{"$error":"#NAME?"}},{"$f":"IF(INDEX(periode5,NEVAL,Nenfant)=\"C\",\"X\",\"\")","v":{"$error":"#NAME?"}},{"$f":"IF(INDEX(periode5,NEVAL,Nenfant)=\"B\",\"X\",\"\")","v":{"$error":"#NAME?"}},{"$f":"IF(INDEX(periode5,NEVAL,Nenfant)=\"A\",\"X\",\"\")","v":{"$error":"#NAME?"}},null,{"$f":"IF(INDEX(periode6,NEVAL,Nenfant)=\"D\",\"X\",\"\")","v":{"$error":"#NAME?"}},{"$f":"IF(INDEX(periode6,NEVAL,Nenfant)=\"C\",\"X\",\"\")","v":{"$error":"#NAME?"}},{"$f":"IF(INDEX(periode6,NEVAL,Nenfant)=\"B\",\"X\",\"\")","v":{"$error":"#NAME?"}},{"$f":"IF(INDEX(periode6,NEVAL,Nenfant)=\"A\",\"X\",\"\")","v":{"$error":"#NAME?"}}]
[139,{"$nulls":7},{"$f":"IF(INDEX(periode1,NEVAL,Nenfant)=\"D\",\"X\",\"\")","v":{"$error":"#NAME?"}},{"$f":"IF(INDEX(periode1,NEVAL,Nenfant)=\"C\",\"X\",\"\")","v":{"$error":"#NAME?"}},{"$f":"IF(INDEX(periode1,NEVAL,Nenfant)=\"B\",\"X\",\"\")","v":{"$error":"#NAME?"}},{"$f":"IF(INDEX(periode1,NEVAL,Nenfant)=\"A\",\"X\",\"\")","v":{"$error":"#NAME?"}},null,{"$f":"IF(INDEX(periode2,NEVAL,Nenfant)=\"D\",\"X\",\"\")","v":{"$error":"#NAME?"}},{"$f":"IF(INDEX(periode2,NEVAL,Nenfant)=\"C\",\"X\",\"\")","v":{"$error":"#NAME?"}},{"$f":"IF(INDEX(periode2,NEVAL,Nenfant)=\"B\",\"X\",\"\")","v":{"$error":"#NAME?"}},{"$f":"IF(INDEX(periode2,NEVAL,Nenfant)=\"A\",\"X\",\"\")","v":{"$error":"#NAME?"}},null,{"$f":"IF(INDEX(periode3,NEVAL,Nenfant)=\"D\",\"X\",\"\")","v":{"$error":"#NAME?"}},{"$f":"IF(INDEX(periode3,NEVAL,Nenfant)=\"C\",\"X\",\"\")","v":{"$error":"#NAME?"}},{"$f":"IF(INDEX(periode3,NEVAL,Nenfant)=\"B\",\"X\",\"\")","v":{"$error":"#NAME?"}},{"$f":"IF(INDEX(periode3,NEVAL,Nenfant)=\"A\",\"X\",\"\")","v":{"$error":"#NAME?"}},null,{"$f":"IF(INDEX(periode4,NEVAL,Nenfant)=\"D\",\"X\",\"\")","v":{"$error":"#NAME?"}},{"$f":"IF(INDEX(periode4,NEVAL,Nenfant)=\"C\",\"X\",\"\")","v":{"$error":"#NAME?"}},{"$f":"IF(INDEX(periode4,NEVAL,Nenfant)=\"B\",\"X\",\"\")","v":{"$error":"#NAME?"}},{"$f":"IF(INDEX(periode4,NEVAL,Nenfant)=\"A\",\"X\",\"\")","v":{"$error":"#NAME?"}},null,{"$f":"IF(INDEX(periode5,NEVAL,Nenfant)=\"D\",\"X\",\"\")","v":{"$error":"#NAME?"}},{"$f":"IF(INDEX(periode5,NEVAL,Nenfant)=\"C\",\"X\",\"\")","v":{"$error":"#NAME?"}},{"$f":"IF(INDEX(periode5,NEVAL,Nenfant)=\"B\",\"X\",\"\")","v":{"$error":"#NAME?"}},{"$f":"IF(INDEX(periode5,NEVAL,Nenfant)=\"A\",\"X\",\"\")","v":{"$error":"#NAME?"}},null,{"$f":"IF(INDEX(periode6,NEVAL,Nenfant)=\"D\",\"X\",\"\")","v":{"$error":"#NAME?"}},{"$f":"IF(INDEX(periode6,NEVAL,Nenfant)=\"C\",\"X\",\"\")","v":{"$error":"#NAME?"}},{"$f":"IF(INDEX(periode6,NEVAL,Nenfant)=\"B\",\"X\",\"\")","v":{"$error":"#NAME?"}},{"$f":"IF(INDEX(periode6,NEVAL,Nenfant)=\"A\",\"X\",\"\")","v":{"$error":"#NAME?"}}]
[140,{"$nulls":7},{"$f":"IF(INDEX(periode1,NEVAL,Nenfant)=\"D\",\"X\",\"\")","v":{"$error":"#NAME?"}},{"$f":"IF(INDEX(periode1,NEVAL,Nenfant)=\"C\",\"X\",\"\")","v":{"$error":"#NAME?"}},{"$f":"IF(INDEX(periode1,NEVAL,Nenfant)=\"B\",\"X\",\"\")","v":{"$error":"#NAME?"}},{"$f":"IF(INDEX(periode1,NEVAL,Nenfant)=\"A\",\"X\",\"\")","v":{"$error":"#NAME?"}},null,{"$f":"IF(INDEX(periode2,NEVAL,Nenfant)=\"D\",\"X\",\"\")","v":{"$error":"#NAME?"}},{"$f":"IF(INDEX(periode2,NEVAL,Nenfant)=\"C\",\"X\",\"\")","v":{"$error":"#NAME?"}},{"$f":"IF(INDEX(periode2,NEVAL,Nenfant)=\"B\",\"X\",\"\")","v":{"$error":"#NAME?"}},{"$f":"IF(INDEX(periode2,NEVAL,Nenfant)=\"A\",\"X\",\"\")","v":{"$error":"#NAME?"}},null,{"$f":"IF(INDEX(periode3,NEVAL,Nenfant)=\"D\",\"X\",\"\")","v":{"$error":"#NAME?"}},{"$f":"IF(INDEX(periode3,NEVAL,Nenfant)=\"C\",\"X\",\"\")","v":{"$error":"#NAME?"}},{"$f":"IF(INDEX(periode3,NEVAL,Nenfant)=\"B\",\"X\",\"\")","v":{"$error":"#NAME?"}},{"$f":"IF(INDEX(periode3,NEVAL,Nenfant)=\"A\",\"X\",\"\")","v":{"$error":"#NAME?"}},null,{"$f":"IF(INDEX(periode4,NEVAL,Nenfant)=\"D\",\"X\",\"\")","v":{"$error":"#NAME?"}},{"$f":"IF(INDEX(periode4,NEVAL,Nenfant)=\"C\",\"X\",\"\")","v":{"$error":"#NAME?"}},{"$f":"IF(INDEX(periode4,NEVAL,Nenfant)=\"B\",\"X\",\"\")","v":{"$error":"#NAME?"}},{"$f":"IF(INDEX(periode4,NEVAL,Nenfant)=\"A\",\"X\",\"\")","v":{"$error":"#NAME?"}},null,{"$f":"IF(INDEX(periode5,NEVAL,Nenfant)=\"D\",\"X\",\"\")","v":{"$error":"#NAME?"}},{"$f":"IF(INDEX(periode5,NEVAL,Nenfant)=\"C\",\"X\",\"\")","v":{"$error":"#NAME?"}},{"$f":"IF(INDEX(periode5,NEVAL,Nenfant)=\"B\",\"X\",\"\")","v":{"$error":"#NAME?"}},{"$f":"IF(INDEX(periode5,NEVAL,Nenfant)=\"A\",\"X\",\"\")","v":{"$error":"#NAME?"}},null,{"$f":"IF(INDEX(periode6,NEVAL,Nenfant)=\"D\",\"X\",\"\")","v":{"$error":"#NAME?"}},{"$f":"IF(INDEX(periode6,NEVAL,Nenfant)=\"C\",\"X\",\"\")","v":{"$error":"#NAME?"}},{"$f":"IF(INDEX(periode6,NEVAL,Nenfant)=\"B\",\"X\",\"\")","v":{"$error":"#NAME?"}},{"$f":"IF(INDEX(periode6,NEVAL,Nenfant)=\"A\",\"X\",\"\")","v":{"$error":"#NAME?"}}]
[141,{"$nulls":7},{"$f":"IF(INDEX(periode1,NEVAL,Nenfant)=\"D\",\"X\",\"\")","v":{"$error":"#NAME?"}},{"$f":"IF(INDEX(periode1,NEVAL,Nenfant)=\"C\",\"X\",\"\")","v":{"$error":"#NAME?"}},{"$f":"IF(INDEX(periode1,NEVAL,Nenfant)=\"B\",\"X\",\"\")","v":{"$error":"#NAME?"}},{"$f":"IF(INDEX(periode1,NEVAL,Nenfant)=\"A\",\"X\",\"\")","v":{"$error":"#NAME?"}},null,{"$f":"IF(INDEX(periode2,NEVAL,Nenfant)=\"D\",\"X\",\"\")","v":{"$error":"#NAME?"}},{"$f":"IF(INDEX(periode2,NEVAL,Nenfant)=\"C\",\"X\",\"\")","v":{"$error":"#NAME?"}},{"$f":"IF(INDEX(periode2,NEVAL,Nenfant)=\"B\",\"X\",\"\")","v":{"$error":"#NAME?"}},{"$f":"IF(INDEX(periode2,NEVAL,Nenfant)=\"A\",\"X\",\"\")","v":{"$error":"#NAME?"}},null,{"$f":"IF(INDEX(periode3,NEVAL,Nenfant)=\"D\",\"X\",\"\")","v":{"$error":"#NAME?"}},{"$f":"IF(INDEX(periode3,NEVAL,Nenfant)=\"C\",\"X\",\"\")","v":{"$error":"#NAME?"}},{"$f":"IF(INDEX(periode3,NEVAL,Nenfant)=\"B\",\"X\",\"\")","v":{"$error":"#NAME?"}},{"$f":"IF(INDEX(periode3,NEVAL,Nenfant)=\"A\",\"X\",\"\")","v":{"$error":"#NAME?"}},null,{"$f":"IF(INDEX(periode4,NEVAL,Nenfant)=\"D\",\"X\",\"\")","v":{"$error":"#NAME?"}},{"$f":"IF(INDEX(periode4,NEVAL,Nenfant)=\"C\",\"X\",\"\")","v":{"$error":"#NAME?"}},{"$f":"IF(INDEX(periode4,NEVAL,Nenfant)=\"B\",\"X\",\"\")","v":{"$error":"#NAME?"}},{"$f":"IF(INDEX(periode4,NEVAL,Nenfant)=\"A\",\"X\",\"\")","v":{"$error":"#NAME?"}},null,{"$f":"IF(INDEX(periode5,NEVAL,Nenfant)=\"D\",\"X\",\"\")","v":{"$error":"#NAME?"}},{"$f":"IF(INDEX(periode5,NEVAL,Nenfant)=\"C\",\"X\",\"\")","v":{"$error":"#NAME?"}},{"$f":"IF(INDEX(periode5,NEVAL,Nenfant)=\"B\",\"X\",\"\")","v":{"$error":"#NAME?"}},{"$f":"IF(INDEX(periode5,NEVAL,Nenfant)=\"A\",\"X\",\"\")","v":{"$error":"#NAME?"}},null,{"$f":"IF(INDEX(periode6,NEVAL,Nenfant)=\"D\",\"X\",\"\")","v":{"$error":"#NAME?"}},{"$f":"IF(INDEX(periode6,NEVAL,Nenfant)=\"C\",\"X\",\"\")","v":{"$error":"#NAME?"}},{"$f":"IF(INDEX(periode6,NEVAL,Nenfant)=\"B\",\"X\",\"\")","v":{"$error":"#NAME?"}},{"$f":"IF(INDEX(periode6,NEVAL,Nenfant)=\"A\",\"X\",\"\")","v":{"$error":"#NAME?"}}]
[142,{"$nulls":7},{"$f":"COUNTIF($G151:$G153,\"X\")","v":0},{"$f":"COUNTIF($H151:$H153,\"X\")","v":0},{"$f":"COUNTIF($I149:$I151,\"X\")","v":0},{"$f":"COUNTIF($J149:$J151,\"X\")","v":0},null,{"$f":"COUNTIF($G151:$G153,\"X\")","v":0},{"$f":"COUNTIF($H151:$H153,\"X\")","v":0},{"$f":"COUNTIF($I149:$I151,\"X\")","v":0},{"$f":"COUNTIF($J149:$J151,\"X\")","v":0},null,{"$f":"COUNTIF($G151:$G153,\"X\")","v":0},{"$f":"COUNTIF($H151:$H153,\"X\")","v":0},{"$f":"COUNTIF($I149:$I151,\"X\")","v":0},{"$f":"COUNTIF($J149:$J151,\"X\")","v":0},null,{"$f":"COUNTIF($G151:$G153,\"X\")","v":0},{"$f":"COUNTIF($H151:$H153,\"X\")","v":0},{"$f":"COUNTIF($I149:$I151,\"X\")","v":0},{"$f":"COUNTIF(AA149:AA151,\"X\")","v":0},null,{"$f":"COUNTIF($G151:$G153,\"X\")","v":0},{"$f":"COUNTIF($H151:$H153,\"X\")","v":0},{"$f":"COUNTIF($I149:$I151,\"X\")","v":0},{"$f":"COUNTIF($J149:$J151,\"X\")","v":0},null,{"$f":"COUNTIF($G151:$G153,\"X\")","v":0},{"$f":"COUNTIF($H151:$H153,\"X\")","v":0},{"$f":"COUNTIF($I149:$I151,\"X\")","v":0},{"$f":"COUNTIF($J149:$J151,\"X\")","v":0}]
[143,{"$nulls":7},{"$f":"IF(INDEX(periode1,NEVAL,Nenfant)=\"D\",\"X\",\"\")","v":{"$error":"#NAME?"}},{"$f":"IF(INDEX(periode1,NEVAL,Nenfant)=\"C\",\"X\",\"\")","v":{"$error":"#NAME?"}},{"$f":"IF(INDEX(periode1,NEVAL,Nenfant)=\"B\",\"X\",\"\")","v":{"$error":"#NAME?"}},{"$f":"IF(INDEX(periode1,NEVAL,Nenfant)=\"A\",\"X\",\"\")","v":{"$error":"#NAME?"}},null,{"$f":"IF(INDEX(periode2,NEVAL,Nenfant)=\"D\",\"X\",\"\")","v":{"$error":"#NAME?"}},{"$f":"IF(INDEX(periode2,NEVAL,Nenfant)=\"C\",\"X\",\"\")","v":{"$error":"#NAME?"}},{"$f":"IF(INDEX(periode2,NEVAL,Nenfant)=\"B\",\"X\",\"\")","v":{"$error":"#NAME?"}},{"$f":"IF(INDEX(periode2,NEVAL,Nenfant)=\"A\",\"X\",\"\")","v":{"$error":"#NAME?"}},null,{"$f":"IF(INDEX(periode3,NEVAL,Nenfant)=\"D\",\"X\",\"\")","v":{"$error":"#NAME?"}},{"$f":"IF(INDEX(periode3,NEVAL,Nenfant)=\"C\",\"X\",\"\")","v":{"$error":"#NAME?"}},{"$f":"IF(INDEX(periode3,NEVAL,Nenfant)=\"B\",\"X\",\"\")","v":{"$error":"#NAME?"}},{"$f":"IF(INDEX(periode3,NEVAL,Nenfant)=\"A\",\"X\",\"\")","v":{"$error":"#NAME?"}},null,{"$f":"IF(INDEX(periode4,NEVAL,Nenfant)=\"D\",\"X\",\"\")","v":{"$error":"#NAME?"}},{"$f":"IF(INDEX(periode4,NEVAL,Nenfant)=\"C\",\"X\",\"\")","v":{"$error":"#NAME?"}},{"$f":"IF(INDEX(periode4,NEVAL,Nenfant)=\"B\",\"X\",\"\")","v":{"$error":"#NAME?"}},{"$f":"IF(INDEX(periode4,NEVAL,Nenfant)=\"A\",\"X\",\"\")","v":{"$error":"#NAME?"}},null,{"$f":"IF(INDEX(periode5,NEVAL,Nenfant)=\"D\",\"X\",\"\")","v":{"$error":"#NAME?"}},{"$f":"IF(INDEX(periode5,NEVAL,Nenfant)=\"C\",\"X\",\"\")","v":{"$error":"#NAME?"}},{"$f":"IF(INDEX(periode5,NEVAL,Nenfant)=\"B\",\"X\",\"\")","v":{"$error":"#NAME?"}},{"$f":"IF(INDEX(periode5,NEVAL,Nenfant)=\"A\",\"X\",\"\")","v":{"$error":"#NAME?"}},null,{"$f":"IF(INDEX(periode6,NEVAL,Nenfant)=\"D\",\"X\",\"\")","v":{"$error":"#NAME?"}},{"$f":"IF(INDEX(periode6,NEVAL,Nenfant)=\"C\",\"X\",\"\")","v":{"$error":"#NAME?"}},{"$f":"IF(INDEX(periode6,NEVAL,Nenfant)=\"B\",\"X\",\"\")","v":{"$error":"#NAME?"}},{"$f":"IF(INDEX(periode6,NEVAL,Nenfant)=\"A\",\"X\",\"\")","v":{"$error":"#NAME?"}}]
[144,{"$nulls":7},{"$f":"IF(INDEX(periode1,NEVAL,Nenfant)=\"D\",\"X\",\"\")","v":{"$error":"#NAME?"}},{"$f":"IF(INDEX(periode1,NEVAL,Nenfant)=\"C\",\"X\",\"\")","v":{"$error":"#NAME?"}},{"$f":"IF(INDEX(periode1,NEVAL,Nenfant)=\"B\",\"X\",\"\")","v":{"$error":"#NAME?"}},{"$f":"IF(INDEX(periode1,NEVAL,Nenfant)=\"A\",\"X\",\"\")","v":{"$error":"#NAME?"}},null,{"$f":"IF(INDEX(periode2,NEVAL,Nenfant)=\"D\",\"X\",\"\")","v":{"$error":"#NAME?"}},{"$f":"IF(INDEX(periode2,NEVAL,Nenfant)=\"C\",\"X\",\"\")","v":{"$error":"#NAME?"}},{"$f":"IF(INDEX(periode2,NEVAL,Nenfant)=\"B\",\"X\",\"\")","v":{"$error":"#NAME?"}},{"$f":"IF(INDEX(periode2,NEVAL,Nenfant)=\"A\",\"X\",\"\")","v":{"$error":"#NAME?"}},null,{"$f":"IF(INDEX(periode3,NEVAL,Nenfant)=\"D\",\"X\",\"\")","v":{"$error":"#NAME?"}},{"$f":"IF(INDEX(periode3,NEVAL,Nenfant)=\"C\",\"X\",\"\")","v":{"$error":"#NAME?"}},{"$f":"IF(INDEX(periode3,NEVAL,Nenfant)=\"B\",\"X\",\"\")","v":{"$error":"#NAME?"}},{"$f":"IF(INDEX(periode3,NEVAL,Nenfant)=\"A\",\"X\",\"\")","v":{"$error":"#NAME?"}},null,{"$f":"IF(INDEX(periode4,NEVAL,Nenfant)=\"D\",\"X\",\"\")","v":{"$error":"#NAME?"}},{"$f":"IF(INDEX(periode4,NEVAL,Nenfant)=\"C\",\"X\",\"\")","v":{"$error":"#NAME?"}},{"$f":"IF(INDEX(periode4,NEVAL,Nenfant)=\"B\",\"X\",\"\")","v":{"$error":"#NAME?"}},{"$f":"IF(INDEX(periode4,NEVAL,Nenfant)=\"A\",\"X\",\"\")","v":{"$error":"#NAME?"}},null,{"$f":"IF(INDEX(periode5,NEVAL,Nenfant)=\"D\",\"X\",\"\")","v":{"$error":"#NAME?"}},{"$f":"IF(INDEX(periode5,NEVAL,Nenfant)=\"C\",\"X\",\"\")","v":{"$error":"#NAME?"}},{"$f":"IF(INDEX(periode5,NEVAL,Nenfant)=\"B\",\"X\",\"\")","v":{"$error":"#NAME?"}},{"$f":"IF(INDEX(periode5,NEVAL,Nenfant)=\"A\",\"X\",\"\")","v":{"$error":"#NAME?"}},null,{"$f":"IF(INDEX(periode6,NEVAL,Nenfant)=\"D\",\"X\",\"\")","v":{"$error":"#NAME?"}},{"$f":"IF(INDEX(periode6,NEVAL,Nenfant)=\"C\",\"X\",\"\")","v":{"$error":"#NAME?"}},{"$f":"IF(INDEX(periode6,NEVAL,Nenfant)=\"B\",\"X\",\"\")","v":{"$error":"#NAME?"}},{"$f":"IF(INDEX(periode6,NEVAL,Nenfant)=\"A\",\"X\",\"\")","v":{"$error":"#NAME?"}}]
[145,{"$nulls":7},{"$f":"IF(INDEX(periode1,NEVAL,Nenfant)=\"D\",\"X\",\"\")","v":{"$error":"#NAME?"}},{"$f":"IF(INDEX(periode1,NEVAL,Nenfant)=\"C\",\"X\",\"\")","v":{"$error":"#NAME?"}},{"$f":"IF(INDEX(periode1,NEVAL,Nenfant)=\"B\",\"X\",\"\")","v":{"$error":"#NAME?"}},{"$f":"IF(INDEX(periode1,NEVAL,Nenfant)=\"A\",\"X\",\"\")","v":{"$error":"#NAME?"}},null,{"$f":"IF(INDEX(periode2,NEVAL,Nenfant)=\"D\",\"X\",\"\")","v":{"$error":"#NAME?"}},{"$f":"IF(INDEX(periode2,NEVAL,Nenfant)=\"C\",\"X\",\"\")","v":{"$error":"#NAME?"}},{"$f":"IF(INDEX(periode2,NEVAL,Nenfant)=\"B\",\"X\",\"\")","v":{"$error":"#NAME?"}},{"$f":"IF(INDEX(periode2,NEVAL,Nenfant)=\"A\",\"X\",\"\")","v":{"$error":"#NAME?"}},null,{"$f":"IF(INDEX(periode3,NEVAL,Nenfant)=\"D\",\"X\",\"\")","v":{"$error":"#NAME?"}},{"$f":"IF(INDEX(periode3,NEVAL,Nenfant)=\"C\",\"X\",\"\")","v":{"$error":"#NAME?"}},{"$f":"IF(INDEX(periode3,NEVAL,Nenfant)=\"B\",\"X\",\"\")","v":{"$error":"#NAME?"}},{"$f":"IF(INDEX(periode3,NEVAL,Nenfant)=\"A\",\"X\",\"\")","v":{"$error":"#NAME?"}},null,{"$f":"IF(INDEX(periode4,NEVAL,Nenfant)=\"D\",\"X\",\"\")","v":{"$error":"#NAME?"}},{"$f":"IF(INDEX(periode4,NEVAL,Nenfant)=\"C\",\"X\",\"\")","v":{"$error":"#NAME?"}},{"$f":"IF(INDEX(periode4,NEVAL,Nenfant)=\"B\",\"X\",\"\")","v":{"$error":"#NAME?"}},{"$f":"IF(INDEX(periode4,NEVAL,Nenfant)=\"A\",\"X\",\"\")","v":{"$error":"#NAME?"}},null,{"$f":"IF(INDEX(periode5,NEVAL,Nenfant)=\"D\",\"X\",\"\")","v":{"$error":"#NAME?"}},{"$f":"IF(INDEX(periode5,NEVAL,Nenfant)=\"C\",\"X\",\"\")","v":{"$error":"#NAME?"}},{"$f":"IF(INDEX(periode5,NEVAL,Nenfant)=\"B\",\"X\",\"\")","v":{"$error":"#NAME?"}},{"$f":"IF(INDEX(periode5,NEVAL,Nenfant)=\"A\",\"X\",\"\")","v":{"$error":"#NAME?"}},null,{"$f":"IF(INDEX(periode6,NEVAL,Nenfant)=\"D\",\"X\",\"\")","v":{"$error":"#NAME?"}},{"$f":"IF(INDEX(periode6,NEVAL,Nenfant)=\"C\",\"X\",\"\")","v":{"$error":"#NAME?"}},{"$f":"IF(INDEX(periode6,NEVAL,Nenfant)=\"B\",\"X\",\"\")","v":{"$error":"#NAME?"}},{"$f":"IF(INDEX(periode6,NEVAL,Nenfant)=\"A\",\"X\",\"\")","v":{"$error":"#NAME?"}}]
[146,{"$nulls":7},{"$f":"COUNTIF($G152:$G154,\"X\")","v":0},{"$f":"COUNTIF($H152:$H154,\"X\")","v":0},{"$f":"COUNTIF($I153:$I154,\"X\")","v":0},{"$f":"COUNTIF($J153:$J154,\"X\")","v":0},null,{"$f":"COUNTIF($G152:$G154,\"X\")","v":0},{"$f":"COUNTIF($H152:$H154,\"X\")","v":0},{"$f":"COUNTIF($I153:$I154,\"X\")","v":0},{"$f":"COUNTIF($J153:$J154,\"X\")","v":0},null,{"$f":"COUNTIF($G152:$G154,\"X\")","v":0},{"$f":"COUNTIF($H152:$H154,\"X\")","v":0},{"$f":"COUNTIF($I153:$I154,\"X\")","v":0},{"$f":"COUNTIF($J153:$J154,\"X\")","v":0},null,{"$f":"COUNTIF($G152:$G154,\"X\")","v":0},{"$f":"COUNTIF($H152:$H154,\"X\")","v":0},{"$f":"COUNTIF($I153:$I154,\"X\")","v":0},{"$f":"COUNTIF(AA153:AA154,\"X\")","v":0},null,{"$f":"COUNTIF($G152:$G154,\"X\")","v":0},{"$f":"COUNTIF($H152:$H154,\"X\")","v":0},{"$f":"COUNTIF($I153:$I154,\"X\")","v":0},{"$f":"COUNTIF($J153:$J154,\"X\")","v":0},null,{"$f":"COUNTIF($G152:$G154,\"X\")","v":0},{"$f":"COUNTIF($H152:$H154,\"X\")","v":0},{"$f":"COUNTIF($I153:$I154,\"X\")","v":0},{"$f":"COUNTIF($J153:$J154,\"X\")","v":0}]
[147,{"$nulls":7},{"$f":"IF(INDEX(periode1,NEVAL,Nenfant)=\"D\",\"X\",\"\")","v":{"$error":"#NAME?"}},{"$f":"IF(INDEX(periode1,NEVAL,Nenfant)=\"C\",\"X\",\"\")","v":{"$error":"#NAME?"}},{"$f":"IF(INDEX(periode1,NEVAL,Nenfant)=\"B\",\"X\",\"\")","v":{"$error":"#NAME?"}},{"$f":"IF(INDEX(periode1,NEVAL,Nenfant)=\"A\",\"X\",\"\")","v":{"$error":"#NAME?"}},null,{"$f":"IF(INDEX(periode2,NEVAL,Nenfant)=\"D\",\"X\",\"\")","v":{"$error":"#NAME?"}},{"$f":"IF(INDEX(periode2,NEVAL,Nenfant)=\"C\",\"X\",\"\")","v":{"$error":"#NAME?"}},{"$f":"IF(INDEX(periode2,NEVAL,Nenfant)=\"B\",\"X\",\"\")","v":{"$error":"#NAME?"}},{"$f":"IF(INDEX(periode2,NEVAL,Nenfant)=\"A\",\"X\",\"\")","v":{"$error":"#NAME?"}},null,{"$f":"IF(INDEX(periode3,NEVAL,Nenfant)=\"D\",\"X\",\"\")","v":{"$error":"#NAME?"}},{"$f":"IF(INDEX(periode3,NEVAL,Nenfant)=\"C\",\"X\",\"\")","v":{"$error":"#NAME?"}},{"$f":"IF(INDEX(periode3,NEVAL,Nenfant)=\"B\",\"X\",\"\")","v":{"$error":"#NAME?"}},{"$f":"IF(INDEX(periode3,NEVAL,Nenfant)=\"A\",\"X\",\"\")","v":{"$error":"#NAME?"}},null,{"$f":"IF(INDEX(periode4,NEVAL,Nenfant)=\"D\",\"X\",\"\")","v":{"$error":"#NAME?"}},{"$f":"IF(INDEX(periode4,NEVAL,Nenfant)=\"C\",\"X\",\"\")","v":{"$error":"#NAME?"}},{"$f":"IF(INDEX(periode4,NEVAL,Nenfant)=\"B\",\"X\",\"\")","v":{"$error":"#NAME?"}},{"$f":"IF(INDEX(periode4,NEVAL,Nenfant)=\"A\",\"X\",\"\")","v":{"$error":"#NAME?"}},null,{"$f":"IF(INDEX(periode5,NEVAL,Nenfant)=\"D\",\"X\",\"\")","v":{"$error":"#NAME?"}},{"$f":"IF(INDEX(periode5,NEVAL,Nenfant)=\"C\",\"X\",\"\")","v":{"$error":"#NAME?"}},{"$f":"IF(INDEX(periode5,NEVAL,Nenfant)=\"B\",\"X\",\"\")","v":{"$error":"#NAME?"}},{"$f":"IF(INDEX(periode5,NEVAL,Nenfant)=\"A\",\"X\",\"\")","v":{"$error":"#NAME?"}},null,{"$f":"IF(INDEX(periode6,NEVAL,Nenfant)=\"D\",\"X\",\"\")","v":{"$error":"#NAME?"}},{"$f":"IF(INDEX(periode6,NEVAL,Nenfant)=\"C\",\"X\",\"\")","v":{"$error":"#NAME?"}},{"$f":"IF(INDEX(periode6,NEVAL,Nenfant)=\"B\",\"X\",\"\")","v":{"$error":"#NAME?"}},{"$f":"IF(INDEX(periode6,NEVAL,Nenfant)=\"A\",\"X\",\"\")","v":{"$error":"#NAME?"}}]
[148,{"$nulls":7},{"$f":"IF(INDEX(periode1,NEVAL,Nenfant)=\"D\",\"X\",\"\")","v":{"$error":"#NAME?"}},{"$f":"IF(INDEX(periode1,NEVAL,Nenfant)=\"C\",\"X\",\"\")","v":{"$error":"#NAME?"}},{"$f":"IF(INDEX(periode1,NEVAL,Nenfant)=\"B\",\"X\",\"\")","v":{"$error":"#NAME?"}},{"$f":"IF(INDEX(periode1,NEVAL,Nenfant)=\"A\",\"X\",\"\")","v":{"$error":"#NAME?"}},null,{"$f":"IF(INDEX(periode2,NEVAL,Nenfant)=\"D\",\"X\",\"\")","v":{"$error":"#NAME?"}},{"$f":"IF(INDEX(periode2,NEVAL,Nenfant)=\"C\",\"X\",\"\")","v":{"$error":"#NAME?"}},{"$f":"IF(INDEX(periode2,NEVAL,Nenfant)=\"B\",\"X\",\"\")","v":{"$error":"#NAME?"}},{"$f":"IF(INDEX(periode2,NEVAL,Nenfant)=\"A\",\"X\",\"\")","v":{"$error":"#NAME?"}},null,{"$f":"IF(INDEX(periode3,NEVAL,Nenfant)=\"D\",\"X\",\"\")","v":{"$error":"#NAME?"}},{"$f":"IF(INDEX(periode3,NEVAL,Nenfant)=\"C\",\"X\",\"\")","v":{"$error":"#NAME?"}},{"$f":"IF(INDEX(periode3,NEVAL,Nenfant)=\"B\",\"X\",\"\")","v":{"$error":"#NAME?"}},{"$f":"IF(INDEX(periode3,NEVAL,Nenfant)=\"A\",\"X\",\"\")","v":{"$error":"#NAME?"}},null,{"$f":"IF(INDEX(periode4,NEVAL,Nenfant)=\"D\",\"X\",\"\")","v":{"$error":"#NAME?"}},{"$f":"IF(INDEX(periode4,NEVAL,Nenfant)=\"C\",\"X\",\"\")","v":{"$error":"#NAME?"}},{"$f":"IF(INDEX(periode4,NEVAL,Nenfant)=\"B\",\"X\",\"\")","v":{"$error":"#NAME?"}},{"$f":"IF(INDEX(periode4,NEVAL,Nenfant)=\"A\",\"X\",\"\")","v":{"$error":"#NAME?"}},null,{"$f":"IF(INDEX(periode5,NEVAL,Nenfant)=\"D\",\"X\",\"\")","v":{"$error":"#NAME?"}},{"$f":"IF(INDEX(periode5,NEVAL,Nenfant)=\"C\",\"X\",\"\")","v":{"$error":"#NAME?"}},{"$f":"IF(INDEX(periode5,NEVAL,Nenfant)=\"B\",\"X\",\"\")","v":{"$error":"#NAME?"}},{"$f":"IF(INDEX(periode5,NEVAL,Nenfant)=\"A\",\"X\",\"\")","v":{"$error":"#NAME?"}},null,{"$f":"IF(INDEX(periode6,NEVAL,Nenfant)=\"D\",\"X\",\"\")","v":{"$error":"#NAME?"}},{"$f":"IF(INDEX(periode6,NEVAL,Nenfant)=\"C\",\"X\",\"\")","v":{"$error":"#NAME?"}},{"$f":"IF(INDEX(periode6,NEVAL,Nenfant)=\"B\",\"X\",\"\")","v":{"$error":"#NAME?"}},{"$f":"IF(INDEX(periode6,NEVAL,Nenfant)=\"A\",\"X\",\"\")","v":{"$error":"#NAME?"}}]
[149,{"$nulls":7},{"$f":"COUNTIF($G158:$G160,\"X\")","v":0},{"$f":"COUNTIF($H158:$H160,\"X\")","v":0},{"$f":"COUNTIF($I156:$I158,\"X\")","v":0},{"$f":"COUNTIF($J156:$J158,\"X\")","v":0},null,{"$f":"COUNTIF($G158:$G160,\"X\")","v":0},{"$f":"COUNTIF($H158:$H160,\"X\")","v":0},{"$f":"COUNTIF($I156:$I158,\"X\")","v":0},{"$f":"COUNTIF($J156:$J158,\"X\")","v":0},null,{"$f":"COUNTIF($G158:$G160,\"X\")","v":0},{"$f":"COUNTIF($H158:$H160,\"X\")","v":0},{"$f":"COUNTIF($I156:$I158,\"X\")","v":0},{"$f":"COUNTIF($J156:$J158,\"X\")","v":0},null,{"$f":"COUNTIF($G158:$G160,\"X\")","v":0},{"$f":"COUNTIF($H158:$H160,\"X\")","v":0},{"$f":"COUNTIF($I156:$I158,\"X\")","v":0},{"$f":"COUNTIF(AA156:AA158,\"X\")","v":0},null,{"$f":"COUNTIF($G158:$G160,\"X\")","v":0},{"$f":"COUNTIF($H158:$H160,\"X\")","v":0},{"$f":"COUNTIF($I156:$I158,\"X\")","v":0},{"$f":"COUNTIF($J156:$J158,\"X\")","v":0},null,{"$f":"COUNTIF($G158:$G160,\"X\")","v":0},{"$f":"COUNTIF($H158:$H160,\"X\")","v":0},{"$f":"COUNTIF($I156:$I158,\"X\")","v":0},{"$f":"COUNTIF($J156:$J158,\"X\")","v":0}]
[150,{"$nulls":7},{"$f":"IF(INDEX(periode1,NEVAL,Nenfant)=\"D\",\"X\",\"\")","v":{"$error":"#NAME?"}},{"$f":"IF(INDEX(periode1,NEVAL,Nenfant)=\"C\",\"X\",\"\")","v":{"$error":"#NAME?"}},{"$f":"IF(INDEX(periode1,NEVAL,Nenfant)=\"B\",\"X\",\"\")","v":{"$error":"#NAME?"}},{"$f":"IF(INDEX(periode1,NEVAL,Nenfant)=\"A\",\"X\",\"\")","v":{"$error":"#NAME?"}},null,{"$f":"IF(INDEX(periode2,NEVAL,Nenfant)=\"D\",\"X\",\"\")","v":{"$error":"#NAME?"}},{"$f":"IF(INDEX(periode2,NEVAL,Nenfant)=\"C\",\"X\",\"\")","v":{"$error":"#NAME?"}},{"$f":"IF(INDEX(periode2,NEVAL,Nenfant)=\"B\",\"X\",\"\")","v":{"$error":"#NAME?"}},{"$f":"IF(INDEX(periode2,NEVAL,Nenfant)=\"A\",\"X\",\"\")","v":{"$error":"#NAME?"}},null,{"$f":"IF(INDEX(periode3,NEVAL,Nenfant)=\"D\",\"X\",\"\")","v":{"$error":"#NAME?"}},{"$f":"IF(INDEX(periode3,NEVAL,Nenfant)=\"C\",\"X\",\"\")","v":{"$error":"#NAME?"}},{"$f":"IF(INDEX(periode3,NEVAL,Nenfant)=\"B\",\"X\",\"\")","v":{"$error":"#NAME?"}},{"$f":"IF(INDEX(periode3,NEVAL,Nenfant)=\"A\",\"X\",\"\")","v":{"$error":"#NAME?"}},null,{"$f":"IF(INDEX(periode4,NEVAL,Nenfant)=\"D\",\"X\",\"\")","v":{"$error":"#NAME?"}},{"$f":"IF(INDEX(periode4,NEVAL,Nenfant)=\"C\",\"X\",\"\")","v":{"$error":"#NAME?"}},{"$f":"IF(INDEX(periode4,NEVAL,Nenfant)=\"B\",\"X\",\"\")","v":{"$error":"#NAME?"}},{"$f":"IF(INDEX(periode4,NEVAL,Nenfant)=\"A\",\"X\",\"\")","v":{"$error":"#NAME?"}},null,{"$f":"IF(INDEX(periode5,NEVAL,Nenfant)=\"D\",\"X\",\"\")","v":{"$error":"#NAME?"}},{"$f":"IF(INDEX(periode5,NEVAL,Nenfant)=\"C\",\"X\",\"\")","v":{"$error":"#NAME?"}},{"$f":"IF(INDEX(periode5,NEVAL,Nenfant)=\"B\",\"X\",\"\")","v":{"$error":"#NAME?"}},{"$f":"IF(INDEX(periode5,NEVAL,Nenfant)=\"A\",\"X\",\"\")","v":{"$error":"#NAME?"}},null,{"$f":"IF(INDEX(periode6,NEVAL,Nenfant)=\"D\",\"X\",\"\")","v":{"$error":"#NAME?"}},{"$f":"IF(INDEX(periode6,NEVAL,Nenfant)=\"C\",\"X\",\"\")","v":{"$error":"#NAME?"}},{"$f":"IF(INDEX(periode6,NEVAL,Nenfant)=\"B\",\"X\",\"\")","v":{"$error":"#NAME?"}},{"$f":"IF(INDEX(periode6,NEVAL,Nenfant)=\"A\",\"X\",\"\")","v":{"$error":"#NAME?"}}]
[151,{"$nulls":7},{"$f":"IF(INDEX(periode1,NEVAL,Nenfant)=\"D\",\"X\",\"\")","v":{"$error":"#NAME?"}},{"$f":"IF(INDEX(periode1,NEVAL,Nenfant)=\"C\",\"X\",\"\")","v":{"$error":"#NAME?"}},{"$f":"IF(INDEX(periode1,NEVAL,Nenfant)=\"B\",\"X\",\"\")","v":{"$error":"#NAME?"}},{"$f":"IF(INDEX(periode1,NEVAL,Nenfant)=\"A\",\"X\",\"\")","v":{"$error":"#NAME?"}},null,{"$f":"IF(INDEX(periode2,NEVAL,Nenfant)=\"D\",\"X\",\"\")","v":{"$error":"#NAME?"}},{"$f":"IF(INDEX(periode2,NEVAL,Nenfant)=\"C\",\"X\",\"\")","v":{"$error":"#NAME?"}},{"$f":"IF(INDEX(periode2,NEVAL,Nenfant)=\"B\",\"X\",\"\")","v":{"$error":"#NAME?"}},{"$f":"IF(INDEX(periode2,NEVAL,Nenfant)=\"A\",\"X\",\"\")","v":{"$error":"#NAME?"}},null,{"$f":"IF(INDEX(periode3,NEVAL,Nenfant)=\"D\",\"X\",\"\")","v":{"$error":"#NAME?"}},{"$f":"IF(INDEX(periode3,NEVAL,Nenfant)=\"C\",\"X\",\"\")","v":{"$error":"#NAME?"}},{"$f":"IF(INDEX(periode3,NEVAL,Nenfant)=\"B\",\"X\",\"\")","v":{"$error":"#NAME?"}},{"$f":"IF(INDEX(periode3,NEVAL,Nenfant)=\"A\",\"X\",\"\")","v":{"$error":"#NAME?"}},null,{"$f":"IF(INDEX(periode4,NEVAL,Nenfant)=\"D\",\"X\",\"\")","v":{"$error":"#NAME?"}},{"$f":"IF(INDEX(periode4,NEVAL,Nenfant)=\"C\",\"X\",\"\")","v":{"$error":"#NAME?"}},{"$f":"IF(INDEX(periode4,NEVAL,Nenfant)=\"B\",\"X\",\"\")","v":{"$error":"#NAME?"}},{"$f":"IF(INDEX(periode4,NEVAL,Nenfant)=\"A\",\"X\",\"\")","v":{"$error":"#NAME?"}},null,{"$f":"IF(INDEX(periode5,NEVAL,Nenfant)=\"D\",\"X\",\"\")","v":{"$error":"#NAME?"}},{"$f":"IF(INDEX(periode5,NEVAL,Nenfant)=\"C\",\"X\",\"\")","v":{"$error":"#NAME?"}},{"$f":"IF(INDEX(periode5,NEVAL,Nenfant)=\"B\",\"X\",\"\")","v":{"$error":"#NAME?"}},{"$f":"IF(INDEX(periode5,NEVAL,Nenfant)=\"A\",\"X\",\"\")","v":{"$error":"#NAME?"}},null,{"$f":"IF(INDEX(periode6,NEVAL,Nenfant)=\"D\",\"X\",\"\")","v":{"$error":"#NAME?"}},{"$f":"IF(INDEX(periode6,NEVAL,Nenfant)=\"C\",\"X\",\"\")","v":{"$error":"#NAME?"}},{"$f":"IF(INDEX(periode6,NEVAL,Nenfant)=\"B\",\"X\",\"\")","v":{"$error":"#NAME?"}},{"$f":"IF(INDEX(periode6,NEVAL,Nenfant)=\"A\",\"X\",\"\")","v":{"$error":"#NAME?"}}]
[152,{"$nulls":7},{"$f":"IF(INDEX(periode1,NEVAL,Nenfant)=\"D\",\"X\",\"\")","v":{"$error":"#NAME?"}},{"$f":"IF(INDEX(periode1,NEVAL,Nenfant)=\"C\",\"X\",\"\")","v":{"$error":"#NAME?"}},{"$f":"IF(INDEX(periode1,NEVAL,Nenfant)=\"B\",\"X\",\"\")","v":{"$error":"#NAME?"}},{"$f":"IF(INDEX(periode1,NEVAL,Nenfant)=\"A\",\"X\",\"\")","v":{"$error":"#NAME?"}},null,{"$f":"IF(INDEX(periode2,NEVAL,Nenfant)=\"D\",\"X\",\"\")","v":{"$error":"#NAME?"}},{"$f":"IF(INDEX(periode2,NEVAL,Nenfant)=\"C\",\"X\",\"\")","v":{"$error":"#NAME?"}},{"$f":"IF(INDEX(periode2,NEVAL,Nenfant)=\"B\",\"X\",\"\")","v":{"$error":"#NAME?"}},{"$f":"IF(INDEX(periode2,NEVAL,Nenfant)=\"A\",\"X\",\"\")","v":{"$error":"#NAME?"}},null,{"$f":"IF(INDEX(periode3,NEVAL,Nenfant)=\"D\",\"X\",\"\")","v":{"$error":"#NAME?"}},{"$f":"IF(INDEX(periode3,NEVAL,Nenfant)=\"C\",\"X\",\"\")","v":{"$error":"#NAME?"}},{"$f":"IF(INDEX(periode3,NEVAL,Nenfant)=\"B\",\"X\",\"\")","v":{"$error":"#NAME?"}},{"$f":"IF(INDEX(periode3,NEVAL,Nenfant)=\"A\",\"X\",\"\")","v":{"$error":"#NAME?"}},null,{"$f":"IF(INDEX(periode4,NEVAL,Nenfant)=\"D\",\"X\",\"\")","v":{"$error":"#NAME?"}},{"$f":"IF(INDEX(periode4,NEVAL,Nenfant)=\"C\",\"X\",\"\")","v":{"$error":"#NAME?"}},{"$f":"IF(INDEX(periode4,NEVAL,Nenfant)=\"B\",\"X\",\"\")","v":{"$error":"#NAME?"}},{"$f":"IF(INDEX(periode4,NEVAL,Nenfant)=\"A\",\"X\",\"\")","v":{"$error":"#NAME?"}},null,{"$f":"IF(INDEX(periode5,NEVAL,Nenfant)=\"D\",\"X\",\"\")","v":{"$error":"#NAME?"}},{"$f":"IF(INDEX(periode5,NEVAL,Nenfant)=\"C\",\"X\",\"\")","v":{"$error":"#NAME?"}},{"$f":"IF(INDEX(periode5,NEVAL,Nenfant)=\"B\",\"X\",\"\")","v":{"$error":"#NAME?"}},{"$f":"IF(INDEX(periode5,NEVAL,Nenfant)=\"A\",\"X\",\"\")","v":{"$error":"#NAME?"}},null,{"$f":"IF(INDEX(periode6,NEVAL,Nenfant)=\"D\",\"X\",\"\")","v":{"$error":"#NAME?"}},{"$f":"IF(INDEX(periode6,NEVAL,Nenfant)=\"C\",\"X\",\"\")","v":{"$error":"#NAME?"}},{"$f":"IF(INDEX(periode6,NEVAL,Nenfant)=\"B\",\"X\",\"\")","v":{"$error":"#NAME?"}},{"$f":"IF(INDEX(periode6,NEVAL,Nenfant)=\"A\",\"X\",\"\")","v":{"$error":"#NAME?"}}]
[153,{"$nulls":7},{"$f":"COUNTIF($G159:$G161,\"X\")","v":0},{"$f":"COUNTIF($H159:$H161,\"X\")","v":0},{"$f":"COUNTIF($I160:$I161,\"X\")","v":0},{"$f":"COUNTIF($J160:$J161,\"X\")","v":0},null,{"$f":"COUNTIF($G159:$G161,\"X\")","v":0},{"$f":"COUNTIF($H159:$H161,\"X\")","v":0},{"$f":"COUNTIF($I160:$I161,\"X\")","v":0},{"$f":"COUNTIF($J160:$J161,\"X\")","v":0},null,{"$f":"COUNTIF($G159:$G161,\"X\")","v":0},{"$f":"COUNTIF($H159:$H161,\"X\")","v":0},{"$f":"COUNTIF($I160:$I161,\"X\")","v":0},{"$f":"COUNTIF($J160:$J161,\"X\")","v":0},null,{"$f":"COUNTIF($G159:$G161,\"X\")","v":0},{"$f":"COUNTIF($H159:$H161,\"X\")","v":0},{"$f":"COUNTIF($I160:$I161,\"X\")","v":0},{"$f":"COUNTIF(AA160:AA161,\"X\")","v":0},null,{"$f":"COUNTIF($G159:$G161,\"X\")","v":0},{"$f":"COUNTIF($H159:$H161,\"X\")","v":0},{"$f":"COUNTIF($I160:$I161,\"X\")","v":0},{"$f":"COUNTIF($J160:$J161,\"X\")","v":0},null,{"$f":"COUNTIF($G159:$G161,\"X\")","v":0},{"$f":"COUNTIF($H159:$H161,\"X\")","v":0},{"$f":"COUNTIF($I160:$I161,\"X\")","v":0},{"$f":"COUNTIF($J160:$J161,\"X\")","v":0}]
[154,{"$nulls":7},{"$f":"IF(INDEX(periode1,NEVAL,Nenfant)=\"D\",\"X\",\"\")","v":{"$error":"#NAME?"}},{"$f":"IF(INDEX(periode1,NEVAL,Nenfant)=\"C\",\"X\",\"\")","v":{"$error":"#NAME?"}},{"$f":"IF(INDEX(periode1,NEVAL,Nenfant)=\"B\",\"X\",\"\")","v":{"$error":"#NAME?"}},{"$f":"IF(INDEX(periode1,NEVAL,Nenfant)=\"A\",\"X\",\"\")","v":{"$error":"#NAME?"}},null,{"$f":"IF(INDEX(periode2,NEVAL,Nenfant)=\"D\",\"X\",\"\")","v":{"$error":"#NAME?"}},{"$f":"IF(INDEX(periode2,NEVAL,Nenfant)=\"C\",\"X\",\"\")","v":{"$error":"#NAME?"}},{"$f":"IF(INDEX(periode2,NEVAL,Nenfant)=\"B\",\"X\",\"\")","v":{"$error":"#NAME?"}},{"$f":"IF(INDEX(periode2,NEVAL,Nenfant)=\"A\",\"X\",\"\")","v":{"$error":"#NAME?"}},null,{"$f":"IF(INDEX(periode3,NEVAL,Nenfant)=\"D\",\"X\",\"\")","v":{"$error":"#NAME?"}},{"$f":"IF(INDEX(periode3,NEVAL,Nenfant)=\"C\",\"X\",\"\")","v":{"$error":"#NAME?"}},{"$f":"IF(INDEX(periode3,NEVAL,Nenfant)=\"B\",\"X\",\"\")","v":{"$error":"#NAME?"}},{"$f":"IF(INDEX(periode3,NEVAL,Nenfant)=\"A\",\"X\",\"\")","v":{"$error":"#NAME?"}},null,{"$f":"IF(INDEX(periode4,NEVAL,Nenfant)=\"D\",\"X\",\"\")","v":{"$error":"#NAME?"}},{"$f":"IF(INDEX(periode4,NEVAL,Nenfant)=\"C\",\"X\",\"\")","v":{"$error":"#NAME?"}},{"$f":"IF(INDEX(periode4,NEVAL,Nenfant)=\"B\",\"X\",\"\")","v":{"$error":"#NAME?"}},{"$f":"IF(INDEX(periode4,NEVAL,Nenfant)=\"A\",\"X\",\"\")","v":{"$error":"#NAME?"}},null,{"$f":"IF(INDEX(periode5,NEVAL,Nenfant)=\"D\",\"X\",\"\")","v":{"$error":"#NAME?"}},{"$f":"IF(INDEX(periode5,NEVAL,Nenfant)=\"C\",\"X\",\"\")","v":{"$error":"#NAME?"}},{"$f":"IF(INDEX(periode5,NEVAL,Nenfant)=\"B\",\"X\",\"\")","v":{"$error":"#NAME?"}},{"$f":"IF(INDEX(periode5,NEVAL,Nenfant)=\"A\",\"X\",\"\")","v":{"$error":"#NAME?"}},null,{"$f":"IF(INDEX(periode6,NEVAL,Nenfant)=\"D\",\"X\",\"\")","v":{"$error":"#NAME?"}},{"$f":"IF(INDEX(periode6,NEVAL,Nenfant)=\"C\",\"X\",\"\")","v":{"$error":"#NAME?"}},{"$f":"IF(INDEX(periode6,NEVAL,Nenfant)=\"B\",\"X\",\"\")","v":{"$error":"#NAME?"}},{"$f":"IF(INDEX(periode6,NEVAL,Nenfant)=\"A\",\"X\",\"\")","v":{"$error":"#NAME?"}}]
[155,{"$nulls":7},{"$f":"IF(INDEX(periode1,NEVAL,Nenfant)=\"D\",\"X\",\"\")","v":{"$error":"#NAME?"}},{"$f":"IF(INDEX(periode1,NEVAL,Nenfant)=\"C\",\"X\",\"\")","v":{"$error":"#NAME?"}},{"$f":"IF(INDEX(periode1,NEVAL,Nenfant)=\"B\",\"X\",\"\")","v":{"$error":"#NAME?"}},{"$f":"IF(INDEX(periode1,NEVAL,Nenfant)=\"A\",\"X\",\"\")","v":{"$error":"#NAME?"}},null,{"$f":"IF(INDEX(periode2,NEVAL,Nenfant)=\"D\",\"X\",\"\")","v":{"$error":"#NAME?"}},{"$f":"IF(INDEX(periode2,NEVAL,Nenfant)=\"C\",\"X\",\"\")","v":{"$error":"#NAME?"}},{"$f":"IF(INDEX(periode2,NEVAL,Nenfant)=\"B\",\"X\",\"\")","v":{"$error":"#NAME?"}},{"$f":"IF(INDEX(periode2,NEVAL,Nenfant)=\"A\",\"X\",\"\")","v":{"$error":"#NAME?"}},null,{"$f":"IF(INDEX(periode3,NEVAL,Nenfant)=\"D\",\"X\",\"\")","v":{"$error":"#NAME?"}},{"$f":"IF(INDEX(periode3,NEVAL,Nenfant)=\"C\",\"X\",\"\")","v":{"$error":"#NAME?"}},{"$f":"IF(INDEX(periode3,NEVAL,Nenfant)=\"B\",\"X\",\"\")","v":{"$error":"#NAME?"}},{"$f":"IF(INDEX(periode3,NEVAL,Nenfant)=\"A\",\"X\",\"\")","v":{"$error":"#NAME?"}},null,{"$f":"IF(INDEX(periode4,NEVAL,Nenfant)=\"D\",\"X\",\"\")","v":{"$error":"#NAME?"}},{"$f":"IF(INDEX(periode4,NEVAL,Nenfant)=\"C\",\"X\",\"\")","v":{"$error":"#NAME?"}},{"$f":"IF(INDEX(periode4,NEVAL,Nenfant)=\"B\",\"X\",\"\")","v":{"$error":"#NAME?"}},{"$f":"IF(INDEX(periode4,NEVAL,Nenfant)=\"A\",\"X\",\"\")","v":{"$error":"#NAME?"}},null,{"$f":"IF(INDEX(periode5,NEVAL,Nenfant)=\"D\",\"X\",\"\")","v":{"$error":"#NAME?"}},{"$f":"IF(INDEX(periode5,NEVAL,Nenfant)=\"C\",\"X\",\"\")","v":{"$error":"#NAME?"}},{"$f":"IF(INDEX(periode5,NEVAL,Nenfant)=\"B\",\"X\",\"\")","v":{"$error":"#NAME?"}},{"$f":"IF(INDEX(periode5,NEVAL,Nenfant)=\"A\",\"X\",\"\")","v":{"$error":"#NAME?"}},null,{"$f":"IF(INDEX(periode6,NEVAL,Nenfant)=\"D\",\"X\",\"\")","v":{"$error":"#NAME?"}},{"$f":"IF(INDEX(periode6,NEVAL,Nenfant)=\"C\",\"X\",\"\")","v":{"$error":"#NAME?"}},{"$f":"IF(INDEX(periode6,NEVAL,Nenfant)=\"B\",\"X\",\"\")","v":{"$error":"#NAME?"}},{"$f":"IF(INDEX(periode6,NEVAL,Nenfant)=\"A\",\"X\",\"\")","v":{"$error":"#NAME?"}}]
[156,{"$nulls":7},{"$f":"COUNTIF($G157,\"X\")","v":0},{"$f":"COUNTIF($H157,\"X\")","v":0},{"$f":"COUNTIF($I163,\"X\")","v":0},{"$f":"COUNTIF($J163,\"X\")","v":0},null,{"$f":"COUNTIF($G157,\"X\")","v":0},{"$f":"COUNTIF($H157,\"X\")","v":0},{"$f":"COUNTIF($I163,\"X\")","v":0},{"$f":"COUNTIF($J163,\"X\")","v":0},null,{"$f":"COUNTIF($G157,\"X\")","v":0},{"$f":"COUNTIF($H157,\"X\")","v":0},{"$f":"COUNTIF($I163,\"X\")","v":0},{"$f":"COUNTIF($J163,\"X\")","v":0},null,{"$f":"COUNTIF($G157,\"X\")","v":0},{"$f":"COUNTIF($H157,\"X\")","v":0},{"$f":"COUNTIF($I163,\"X\")","v":0},{"$f":"COUNTIF(AA163,\"X\")","v":0},null,{"$f":"COUNTIF($G157,\"X\")","v":0},{"$f":"COUNTIF($H157,\"X\")","v":0},{"$f":"COUNTIF($I163,\"X\")","v":0},{"$f":"COUNTIF($J163,\"X\")","v":0},null,{"$f":"COUNTIF($G157,\"X\")","v":0},{"$f":"COUNTIF($H157,\"X\")","v":0},{"$f":"COUNTIF($I163,\"X\")","v":0},{"$f":"COUNTIF($J163,\"X\")","v":0}]
[157,{"$nulls":7},{"$f":"IF(INDEX(periode1,NEVAL,Nenfant)=\"D\",\"X\",\"\")","v":{"$error":"#NAME?"}},{"$f":"IF(INDEX(periode1,NEVAL,Nenfant)=\"C\",\"X\",\"\")","v":{"$error":"#NAME?"}},{"$f":"IF(INDEX(periode1,NEVAL,Nenfant)=\"B\",\"X\",\"\")","v":{"$error":"#NAME?"}},{"$f":"IF(INDEX(periode1,NEVAL,Nenfant)=\"A\",\"X\",\"\")","v":{"$error":"#NAME?"}},null,{"$f":"IF(INDEX(periode2,NEVAL,Nenfant)=\"D\",\"X\",\"\")","v":{"$error":"#NAME?"}},{"$f":"IF(INDEX(periode2,NEVAL,Nenfant)=\"C\",\"X\",\"\")","v":{"$error":"#NAME?"}},{"$f":"IF(INDEX(periode2,NEVAL,Nenfant)=\"B\",\"X\",\"\")","v":{"$error":"#NAME?"}},{"$f":"IF(INDEX(periode2,NEVAL,Nenfant)=\"A\",\"X\",\"\")","v":{"$error":"#NAME?"}},null,{"$f":"IF(INDEX(periode3,NEVAL,Nenfant)=\"D\",\"X\",\"\")","v":{"$error":"#NAME?"}},{"$f":"IF(INDEX(periode3,NEVAL,Nenfant)=\"C\",\"X\",\"\")","v":{"$error":"#NAME?"}},{"$f":"IF(INDEX(periode3,NEVAL,Nenfant)=\"B\",\"X\",\"\")","v":{"$error":"#NAME?"}},{"$f":"IF(INDEX(periode3,NEVAL,Nenfant)=\"A\",\"X\",\"\")","v":{"$error":"#NAME?"}},null,{"$f":"IF(INDEX(periode4,NEVAL,Nenfant)=\"D\",\"X\",\"\")","v":{"$error":"#NAME?"}},{"$f":"IF(INDEX(periode4,NEVAL,Nenfant)=\"C\",\"X\",\"\")","v":{"$error":"#NAME?"}},{"$f":"IF(INDEX(periode4,NEVAL,Nenfant)=\"B\",\"X\",\"\")","v":{"$error":"#NAME?"}},{"$f":"IF(INDEX(periode4,NEVAL,Nenfant)=\"A\",\"X\",\"\")","v":{"$error":"#NAME?"}},null,{"$f":"IF(INDEX(periode5,NEVAL,Nenfant)=\"D\",\"X\",\"\")","v":{"$error":"#NAME?"}},{"$f":"IF(INDEX(periode5,NEVAL,Nenfant)=\"C\",\"X\",\"\")","v":{"$error":"#NAME?"}},{"$f":"IF(INDEX(periode5,NEVAL,Nenfant)=\"B\",\"X\",\"\")","v":{"$error":"#NAME?"}},{"$f":"IF(INDEX(periode5,NEVAL,Nenfant)=\"A\",\"X\",\"\")","v":{"$error":"#NAME?"}},null,{"$f":"IF(INDEX(periode6,NEVAL,Nenfant)=\"D\",\"X\",\"\")","v":{"$error":"#NAME?"}},{"$f":"IF(INDEX(periode6,NEVAL,Nenfant)=\"C\",\"X\",\"\")","v":{"$error":"#NAME?"}},{"$f":"IF(INDEX(periode6,NEVAL,Nenfant)=\"B\",\"X\",\"\")","v":{"$error":"#NAME?"}},{"$f":"IF(INDEX(periode6,NEVAL,Nenfant)=\"A\",\"X\",\"\")","v":{"$error":"#NAME?"}}]
[158,{"$nulls":7},{"$f":"IF(INDEX(periode1,NEVAL,Nenfant)=\"D\",\"X\",\"\")","v":{"$error":"#NAME?"}},{"$f":"IF(INDEX(periode1,NEVAL,Nenfant)=\"C\",\"X\",\"\")","v":{"$error":"#NAME?"}},{"$f":"IF(INDEX(periode1,NEVAL,Nenfant)=\"B\",\"X\",\"\")","v":{"$error":"#NAME?"}},{"$f":"IF(INDEX(periode1,NEVAL,Nenfant)=\"A\",\"X\",\"\")","v":{"$error":"#NAME?"}},null,{"$f":"IF(INDEX(periode2,NEVAL,Nenfant)=\"D\",\"X\",\"\")","v":{"$error":"#NAME?"}},{"$f":"IF(INDEX(periode2,NEVAL,Nenfant)=\"C\",\"X\",\"\")","v":{"$error":"#NAME?"}},{"$f":"IF(INDEX(periode2,NEVAL,Nenfant)=\"B\",\"X\",\"\")","v":{"$error":"#NAME?"}},{"$f":"IF(INDEX(periode2,NEVAL,Nenfant)=\"A\",\"X\",\"\")","v":{"$error":"#NAME?"}},null,{"$f":"IF(INDEX(periode3,NEVAL,Nenfant)=\"D\",\"X\",\"\")","v":{"$error":"#NAME?"}},{"$f":"IF(INDEX(periode3,NEVAL,Nenfant)=\"C\",\"X\",\"\")","v":{"$error":"#NAME?"}},{"$f":"IF(INDEX(periode3,NEVAL,Nenfant)=\"B\",\"X\",\"\")","v":{"$error":"#NAME?"}},{"$f":"IF(INDEX(periode3,NEVAL,Nenfant)=\"A\",\"X\",\"\")","v":{"$error":"#NAME?"}},null,{"$f":"IF(INDEX(periode4,NEVAL,Nenfant)=\"D\",\"X\",\"\")","v":{"$error":"#NAME?"}},{"$f":"IF(INDEX(periode4,NEVAL,Nenfant)=\"C\",\"X\",\"\")","v":{"$error":"#NAME?"}},{"$f":"IF(INDEX(periode4,NEVAL,Nenfant)=\"B\",\"X\",\"\")","v":{"$error":"#NAME?"}},{"$f":"IF(INDEX(periode4,NEVAL,Nenfant)=\"A\",\"X\",\"\")","v":{"$error":"#NAME?"}},null,{"$f":"IF(INDEX(periode5,NEVAL,Nenfant)=\"D\",\"X\",\"\")","v":{"$error":"#NAME?"}},{"$f":"IF(INDEX(periode5,NEVAL,Nenfant)=\"C\",\"X\",\"\")","v":{"$error":"#NAME?"}},{"$f":"IF(INDEX(periode5,NEVAL,Nenfant)=\"B\",\"X\",\"\")","v":{"$error":"#NAME?"}},{"$f":"IF(INDEX(periode5,NEVAL,Nenfant)=\"A\",\"X\",\"\")","v":{"$error":"#NAME?"}},null,{"$f":"IF(INDEX(periode6,NEVAL,Nenfant)=\"D\",\"X\",\"\")","v":{"$error":"#NAME?"}},{"$f":"IF(INDEX(periode6,NEVAL,Nenfant)=\"C\",\"X\",\"\")","v":{"$error":"#NAME?"}},{"$f":"IF(INDEX(periode6,NEVAL,Nenfant)=\"B\",\"X\",\"\")","v":{"$error":"#NAME?"}},{"$f":"IF(INDEX(periode6,NEVAL,Nenfant)=\"A\",\"X\",\"\")","v":{"$error":"#NAME?"}}]
[159,{"$nulls":7},{"$f":"IF(INDEX(periode1,NEVAL,Nenfant)=\"D\",\"X\",\"\")","v":{"$error":"#NAME?"}},{"$f":"IF(INDEX(periode1,NEVAL,Nenfant)=\"C\",\"X\",\"\")","v":{"$error":"#NAME?"}},{"$f":"IF(INDEX(periode1,NEVAL,Nenfant)=\"B\",\"X\",\"\")","v":{"$error":"#NAME?"}},{"$f":"IF(INDEX(periode1,NEVAL,Nenfant)=\"A\",\"X\",\"\")","v":{"$error":"#NAME?"}},null,{"$f":"IF(INDEX(periode2,NEVAL,Nenfant)=\"D\",\"X\",\"\")","v":{"$error":"#NAME?"}},{"$f":"IF(INDEX(periode2,NEVAL,Nenfant)=\"C\",\"X\",\"\")","v":{"$error":"#NAME?"}},{"$f":"IF(INDEX(periode2,NEVAL,Nenfant)=\"B\",\"X\",\"\")","v":{"$error":"#NAME?"}},{"$f":"IF(INDEX(periode2,NEVAL,Nenfant)=\"A\",\"X\",\"\")","v":{"$error":"#NAME?"}},null,{"$f":"IF(INDEX(periode3,NEVAL,Nenfant)=\"D\",\"X\",\"\")","v":{"$error":"#NAME?"}},{"$f":"IF(INDEX(periode3,NEVAL,Nenfant)=\"C\",\"X\",\"\")","v":{"$error":"#NAME?"}},{"$f":"IF(INDEX(periode3,NEVAL,Nenfant)=\"B\",\"X\",\"\")","v":{"$error":"#NAME?"}},{"$f":"IF(INDEX(periode3,NEVAL,Nenfant)=\"A\",\"X\",\"\")","v":{"$error":"#NAME?"}},null,{"$f":"IF(INDEX(periode4,NEVAL,Nenfant)=\"D\",\"X\",\"\")","v":{"$error":"#NAME?"}},{"$f":"IF(INDEX(periode4,NEVAL,Nenfant)=\"C\",\"X\",\"\")","v":{"$error":"#NAME?"}},{"$f":"IF(INDEX(periode4,NEVAL,Nenfant)=\"B\",\"X\",\"\")","v":{"$error":"#NAME?"}},{"$f":"IF(INDEX(periode4,NEVAL,Nenfant)=\"A\",\"X\",\"\")","v":{"$error":"#NAME?"}},null,{"$f":"IF(INDEX(periode5,NEVAL,Nenfant)=\"D\",\"X\",\"\")","v":{"$error":"#NAME?"}},{"$f":"IF(INDEX(periode5,NEVAL,Nenfant)=\"C\",\"X\",\"\")","v":{"$error":"#NAME?"}},{"$f":"IF(INDEX(periode5,NEVAL,Nenfant)=\"B\",\"X\",\"\")","v":{"$error":"#NAME?"}},{"$f":"IF(INDEX(periode5,NEVAL,Nenfant)=\"A\",\"X\",\"\")","v":{"$error":"#NAME?"}},null,{"$f":"IF(INDEX(periode6,NEVAL,Nenfant)=\"D\",\"X\",\"\")","v":{"$error":"#NAME?"}},{"$f":"IF(INDEX(periode6,NEVAL,Nenfant)=\"C\",\"X\",\"\")","v":{"$error":"#NAME?"}},{"$f":"IF(INDEX(periode6,NEVAL,Nenfant)=\"B\",\"X\",\"\")","v":{"$error":"#NAME?"}},{"$f":"IF(INDEX(periode6,NEVAL,Nenfant)=\"A\",\"X\",\"\")","v":{"$error":"#NAME?"}}]
[160,{"$nulls":7},{"$f":"IF(INDEX(periode1,NEVAL,Nenfant)=\"D\",\"X\",\"\")","v":{"$error":"#NAME?"}},{"$f":"IF(INDEX(periode1,NEVAL,Nenfant)=\"C\",\"X\",\"\")","v":{"$error":"#NAME?"}},{"$f":"IF(INDEX(periode1,NEVAL,Nenfant)=\"B\",\"X\",\"\")","v":{"$error":"#NAME?"}},{"$f":"IF(INDEX(periode1,NEVAL,Nenfant)=\"A\",\"X\",\"\")","v":{"$error":"#NAME?"}},null,{"$f":"IF(INDEX(periode2,NEVAL,Nenfant)=\"D\",\"X\",\"\")","v":{"$error":"#NAME?"}},{"$f":"IF(INDEX(periode2,NEVAL,Nenfant)=\"C\",\"X\",\"\")","v":{"$error":"#NAME?"}},{"$f":"IF(INDEX(periode2,NEVAL,Nenfant)=\"B\",\"X\",\"\")","v":{"$error":"#NAME?"}},{"$f":"IF(INDEX(periode2,NEVAL,Nenfant)=\"A\",\"X\",\"\")","v":{"$error":"#NAME?"}},null,{"$f":"IF(INDEX(periode3,NEVAL,Nenfant)=\"D\",\"X\",\"\")","v":{"$error":"#NAME?"}},{"$f":"IF(INDEX(periode3,NEVAL,Nenfant)=\"C\",\"X\",\"\")","v":{"$error":"#NAME?"}},{"$f":"IF(INDEX(periode3,NEVAL,Nenfant)=\"B\",\"X\",\"\")","v":{"$error":"#NAME?"}},{"$f":"IF(INDEX(periode3,NEVAL,Nenfant)=\"A\",\"X\",\"\")","v":{"$error":"#NAME?"}},null,{"$f":"IF(INDEX(periode4,NEVAL,Nenfant)=\"D\",\"X\",\"\")","v":{"$error":"#NAME?"}},{"$f":"IF(INDEX(periode4,NEVAL,Nenfant)=\"C\",\"X\",\"\")","v":{"$error":"#NAME?"}},{"$f":"IF(INDEX(periode4,NEVAL,Nenfant)=\"B\",\"X\",\"\")","v":{"$error":"#NAME?"}},{"$f":"IF(INDEX(periode4,NEVAL,Nenfant)=\"A\",\"X\",\"\")","v":{"$error":"#NAME?"}},null,{"$f":"IF(INDEX(periode5,NEVAL,Nenfant)=\"D\",\"X\",\"\")","v":{"$error":"#NAME?"}},{"$f":"IF(INDEX(periode5,NEVAL,Nenfant)=\"C\",\"X\",\"\")","v":{"$error":"#NAME?"}},{"$f":"IF(INDEX(periode5,NEVAL,Nenfant)=\"B\",\"X\",\"\")","v":{"$error":"#NAME?"}},{"$f":"IF(INDEX(periode5,NEVAL,Nenfant)=\"A\",\"X\",\"\")","v":{"$error":"#NAME?"}},null,{"$f":"IF(INDEX(periode6,NEVAL,Nenfant)=\"D\",\"X\",\"\")","v":{"$error":"#NAME?"}},{"$f":"IF(INDEX(periode6,NEVAL,Nenfant)=\"C\",\"X\",\"\")","v":{"$error":"#NAME?"}},{"$f":"IF(INDEX(periode6,NEVAL,Nenfant)=\"B\",\"X\",\"\")","v":{"$error":"#NAME?"}},{"$f":"IF(INDEX(periode6,NEVAL,Nenfant)=\"A\",\"X\",\"\")","v":{"$error":"#NAME?"}}]
[161,{"$nulls":7},{"$f":"COUNTIF($G162,\"X\")","v":0},{"$f":"COUNTIF($H162,\"X\")","v":0},{"$f":"COUNTIF($I168,\"X\")","v":0},{"$f":"COUNTIF($J168,\"X\")","v":0},null,{"$f":"COUNTIF($G162,\"X\")","v":0},{"$f":"COUNTIF($H162,\"X\")","v":0},{"$f":"COUNTIF($I168,\"X\")","v":0},{"$f":"COUNTIF($J168,\"X\")","v":0},null,{"$f":"COUNTIF($G162,\"X\")","v":0},{"$f":"COUNTIF($H162,\"X\")","v":0},{"$f":"COUNTIF($I168,\"X\")","v":0},{"$f":"COUNTIF($J168,\"X\")","v":0},null,{"$f":"COUNTIF($G162,\"X\")","v":0},{"$f":"COUNTIF($H162,\"X\")","v":0},{"$f":"COUNTIF($I168,\"X\")","v":0},{"$f":"COUNTIF(AA168,\"X\")","v":0},null,{"$f":"COUNTIF($G162,\"X\")","v":0},{"$f":"COUNTIF($H162,\"X\")","v":0},{"$f":"COUNTIF($I168,\"X\")","v":0},{"$f":"COUNTIF($J168,\"X\")","v":0},null,{"$f":"COUNTIF($G162,\"X\")","v":0},{"$f":"COUNTIF($H162,\"X\")","v":0},{"$f":"COUNTIF($I168,\"X\")","v":0},{"$f":"COUNTIF($J168,\"X\")","v":0}]
[162,{"$nulls":7},{"$f":"IF(INDEX(periode1,NEVAL,Nenfant)=\"D\",\"X\",\"\")","v":{"$error":"#NAME?"}},{"$f":"IF(INDEX(periode1,NEVAL,Nenfant)=\"C\",\"X\",\"\")","v":{"$error":"#NAME?"}},{"$f":"IF(INDEX(periode1,NEVAL,Nenfant)=\"B\",\"X\",\"\")","v":{"$error":"#NAME?"}},{"$f":"IF(INDEX(periode1,NEVAL,Nenfant)=\"A\",\"X\",\"\")","v":{"$error":"#NAME?"}},null,{"$f":"IF(INDEX(periode2,NEVAL,Nenfant)=\"D\",\"X\",\"\")","v":{"$error":"#NAME?"}},{"$f":"IF(INDEX(periode2,NEVAL,Nenfant)=\"C\",\"X\",\"\")","v":{"$error":"#NAME?"}},{"$f":"IF(INDEX(periode2,NEVAL,Nenfant)=\"B\",\"X\",\"\")","v":{"$error":"#NAME?"}},{"$f":"IF(INDEX(periode2,NEVAL,Nenfant)=\"A\",\"X\",\"\")","v":{"$error":"#NAME?"}},null,{"$f":"IF(INDEX(periode3,NEVAL,Nenfant)=\"D\",\"X\",\"\")","v":{"$error":"#NAME?"}},{"$f":"IF(INDEX(periode3,NEVAL,Nenfant)=\"C\",\"X\",\"\")","v":{"$error":"#NAME?"}},{"$f":"IF(INDEX(periode3,NEVAL,Nenfant)=\"B\",\"X\",\"\")","v":{"$error":"#NAME?"}},{"$f":"IF(INDEX(periode3,NEVAL,Nenfant)=\"A\",\"X\",\"\")","v":{"$error":"#NAME?"}},null,{"$f":"IF(INDEX(periode4,NEVAL,Nenfant)=\"D\",\"X\",\"\")","v":{"$error":"#NAME?"}},{"$f":"IF(INDEX(periode4,NEVAL,Nenfant)=\"C\",\"X\",\"\")","v":{"$error":"#NAME?"}},{"$f":"IF(INDEX(periode4,NEVAL,Nenfant)=\"B\",\"X\",\"\")","v":{"$error":"#NAME?"}},{"$f":"IF(INDEX(periode4,NEVAL,Nenfant)=\"A\",\"X\",\"\")","v":{"$error":"#NAME?"}},null,{"$f":"IF(INDEX(periode5,NEVAL,Nenfant)=\"D\",\"X\",\"\")","v":{"$error":"#NAME?"}},{"$f":"IF(INDEX(periode5,NEVAL,Nenfant)=\"C\",\"X\",\"\")","v":{"$error":"#NAME?"}},{"$f":"IF(INDEX(periode5,NEVAL,Nenfant)=\"B\",\"X\",\"\")","v":{"$error":"#NAME?"}},{"$f":"IF(INDEX(periode5,NEVAL,Nenfant)=\"A\",\"X\",\"\")","v":{"$error":"#NAME?"}},null,{"$f":"IF(INDEX(periode6,NEVAL,Nenfant)=\"D\",\"X\",\"\")","v":{"$error":"#NAME?"}},{"$f":"IF(INDEX(periode6,NEVAL,Nenfant)=\"C\",\"X\",\"\")","v":{"$error":"#NAME?"}},{"$f":"IF(INDEX(periode6,NEVAL,Nenfant)=\"B\",\"X\",\"\")","v":{"$error":"#NAME?"}},{"$f":"IF(INDEX(periode6,NEVAL,Nenfant)=\"A\",\"X\",\"\")","v":{"$error":"#NAME?"}}]
[163,{"$nulls":7},{"$f":"IF(INDEX(periode1,NEVAL,Nenfant)=\"D\",\"X\",\"\")","v":{"$error":"#NAME?"}},{"$f":"IF(INDEX(periode1,NEVAL,Nenfant)=\"C\",\"X\",\"\")","v":{"$error":"#NAME?"}},{"$f":"IF(INDEX(periode1,NEVAL,Nenfant)=\"B\",\"X\",\"\")","v":{"$error":"#NAME?"}},{"$f":"IF(INDEX(periode1,NEVAL,Nenfant)=\"A\",\"X\",\"\")","v":{"$error":"#NAME?"}},null,{"$f":"IF(INDEX(periode2,NEVAL,Nenfant)=\"D\",\"X\",\"\")","v":{"$error":"#NAME?"}},{"$f":"IF(INDEX(periode2,NEVAL,Nenfant)=\"C\",\"X\",\"\")","v":{"$error":"#NAME?"}},{"$f":"IF(INDEX(periode2,NEVAL,Nenfant)=\"B\",\"X\",\"\")","v":{"$error":"#NAME?"}},{"$f":"IF(INDEX(periode2,NEVAL,Nenfant)=\"A\",\"X\",\"\")","v":{"$error":"#NAME?"}},null,{"$f":"IF(INDEX(periode3,NEVAL,Nenfant)=\"D\",\"X\",\"\")","v":{"$error":"#NAME?"}},{"$f":"IF(INDEX(periode3,NEVAL,Nenfant)=\"C\",\"X\",\"\")","v":{"$error":"#NAME?"}},{"$f":"IF(INDEX(periode3,NEVAL,Nenfant)=\"B\",\"X\",\"\")","v":{"$error":"#NAME?"}},{"$f":"IF(INDEX(periode3,NEVAL,Nenfant)=\"A\",\"X\",\"\")","v":{"$error":"#NAME?"}},null,{"$f":"IF(INDEX(periode4,NEVAL,Nenfant)=\"D\",\"X\",\"\")","v":{"$error":"#NAME?"}},{"$f":"IF(INDEX(periode4,NEVAL,Nenfant)=\"C\",\"X\",\"\")","v":{"$error":"#NAME?"}},{"$f":"IF(INDEX(periode4,NEVAL,Nenfant)=\"B\",\"X\",\"\")","v":{"$error":"#NAME?"}},{"$f":"IF(INDEX(periode4,NEVAL,Nenfant)=\"A\",\"X\",\"\")","v":{"$error":"#NAME?"}},null,{"$f":"IF(INDEX(periode5,NEVAL,Nenfant)=\"D\",\"X\",\"\")","v":{"$error":"#NAME?"}},{"$f":"IF(INDEX(periode5,NEVAL,Nenfant)=\"C\",\"X\",\"\")","v":{"$error":"#NAME?"}},{"$f":"IF(INDEX(periode5,NEVAL,Nenfant)=\"B\",\"X\",\"\")","v":{"$error":"#NAME?"}},{"$f":"IF(INDEX(periode5,NEVAL,Nenfant)=\"A\",\"X\",\"\")","v":{"$error":"#NAME?"}},null,{"$f":"IF(INDEX(periode6,NEVAL,Nenfant)=\"D\",\"X\",\"\")","v":{"$error":"#NAME?"}},{"$f":"IF(INDEX(periode6,NEVAL,Nenfant)=\"C\",\"X\",\"\")","v":{"$error":"#NAME?"}},{"$f":"IF(INDEX(periode6,NEVAL,Nenfant)=\"B\",\"X\",\"\")","v":{"$error":"#NAME?"}},{"$f":"IF(INDEX(periode6,NEVAL,Nenfant)=\"A\",\"X\",\"\")","v":{"$error":"#NAME?"}}]
[164,{"$nulls":7},{"$f":"IF(INDEX(periode1,NEVAL,Nenfant)=\"D\",\"X\",\"\")","v":{"$error":"#NAME?"}},{"$f":"IF(INDEX(periode1,NEVAL,Nenfant)=\"C\",\"X\",\"\")","v":{"$error":"#NAME?"}},{"$f":"IF(INDEX(periode1,NEVAL,Nenfant)=\"B\",\"X\",\"\")","v":{"$error":"#NAME?"}},{"$f":"IF(INDEX(periode1,NEVAL,Nenfant)=\"A\",\"X\",\"\")","v":{"$error":"#NAME?"}},null,{"$f":"IF(INDEX(periode2,NEVAL,Nenfant)=\"D\",\"X\",\"\")","v":{"$error":"#NAME?"}},{"$f":"IF(INDEX(periode2,NEVAL,Nenfant)=\"C\",\"X\",\"\")","v":{"$error":"#NAME?"}},{"$f":"IF(INDEX(periode2,NEVAL,Nenfant)=\"B\",\"X\",\"\")","v":{"$error":"#NAME?"}},{"$f":"IF(INDEX(periode2,NEVAL,Nenfant)=\"A\",\"X\",\"\")","v":{"$error":"#NAME?"}},null,{"$f":"IF(INDEX(periode3,NEVAL,Nenfant)=\"D\",\"X\",\"\")","v":{"$error":"#NAME?"}},{"$f":"IF(INDEX(periode3,NEVAL,Nenfant)=\"C\",\"X\",\"\")","v":{"$error":"#NAME?"}},{"$f":"IF(INDEX(periode3,NEVAL,Nenfant)=\"B\",\"X\",\"\")","v":{"$error":"#NAME?"}},{"$f":"IF(INDEX(periode3,NEVAL,Nenfant)=\"A\",\"X\",\"\")","v":{"$error":"#NAME?"}},null,{"$f":"IF(INDEX(periode4,NEVAL,Nenfant)=\"D\",\"X\",\"\")","v":{"$error":"#NAME?"}},{"$f":"IF(INDEX(periode4,NEVAL,Nenfant)=\"C\",\"X\",\"\")","v":{"$error":"#NAME?"}},{"$f":"IF(INDEX(periode4,NEVAL,Nenfant)=\"B\",\"X\",\"\")","v":{"$error":"#NAME?"}},{"$f":"IF(INDEX(periode4,NEVAL,Nenfant)=\"A\",\"X\",\"\")","v":{"$error":"#NAME?"}},null,{"$f":"IF(INDEX(periode5,NEVAL,Nenfant)=\"D\",\"X\",\"\")","v":{"$error":"#NAME?"}},{"$f":"IF(INDEX(periode5,NEVAL,Nenfant)=\"C\",\"X\",\"\")","v":{"$error":"#NAME?"}},{"$f":"IF(INDEX(periode5,NEVAL,Nenfant)=\"B\",\"X\",\"\")","v":{"$error":"#NAME?"}},{"$f":"IF(INDEX(periode5,NEVAL,Nenfant)=\"A\",\"X\",\"\")","v":{"$error":"#NAME?"}},null,{"$f":"IF(INDEX(periode6,NEVAL,Nenfant)=\"D\",\"X\",\"\")","v":{"$error":"#NAME?"}},{"$f":"IF(INDEX(periode6,NEVAL,Nenfant)=\"C\",\"X\",\"\")","v":{"$error":"#NAME?"}},{"$f":"IF(INDEX(periode6,NEVAL,Nenfant)=\"B\",\"X\",\"\")","v":{"$error":"#NAME?"}},{"$f":"IF(INDEX(periode6,NEVAL,Nenfant)=\"A\",\"X\",\"\")","v":{"$error":"#NAME?"}}]
[165,{"$nulls":7},{"$f":"IF(INDEX(periode1,NEVAL,Nenfant)=\"D\",\"X\",\"\")","v":{"$error":"#NAME?"}},{"$f":"IF(INDEX(periode1,NEVAL,Nenfant)=\"C\",\"X\",\"\")","v":{"$error":"#NAME?"}},{"$f":"IF(INDEX(periode1,NEVAL,Nenfant)=\"B\",\"X\",\"\")","v":{"$error":"#NAME?"}},{"$f":"IF(INDEX(periode1,NEVAL,Nenfant)=\"A\",\"X\",\"\")","v":{"$error":"#NAME?"}},null,{"$f":"IF(INDEX(periode2,NEVAL,Nenfant)=\"D\",\"X\",\"\")","v":{"$error":"#NAME?"}},{"$f":"IF(INDEX(periode2,NEVAL,Nenfant)=\"C\",\"X\",\"\")","v":{"$error":"#NAME?"}},{"$f":"IF(INDEX(periode2,NEVAL,Nenfant)=\"B\",\"X\",\"\")","v":{"$error":"#NAME?"}},{"$f":"IF(INDEX(periode2,NEVAL,Nenfant)=\"A\",\"X\",\"\")","v":{"$error":"#NAME?"}},null,{"$f":"IF(INDEX(periode3,NEVAL,Nenfant)=\"D\",\"X\",\"\")","v":{"$error":"#NAME?"}},{"$f":"IF(INDEX(periode3,NEVAL,Nenfant)=\"C\",\"X\",\"\")","v":{"$error":"#NAME?"}},{"$f":"IF(INDEX(periode3,NEVAL,Nenfant)=\"B\",\"X\",\"\")","v":{"$error":"#NAME?"}},{"$f":"IF(INDEX(periode3,NEVAL,Nenfant)=\"A\",\"X\",\"\")","v":{"$error":"#NAME?"}},null,{"$f":"IF(INDEX(periode4,NEVAL,Nenfant)=\"D\",\"X\",\"\")","v":{"$error":"#NAME?"}},{"$f":"IF(INDEX(periode4,NEVAL,Nenfant)=\"C\",\"X\",\"\")","v":{"$error":"#NAME?"}},{"$f":"IF(INDEX(periode4,NEVAL,Nenfant)=\"B\",\"X\",\"\")","v":{"$error":"#NAME?"}},{"$f":"IF(INDEX(periode4,NEVAL,Nenfant)=\"A\",\"X\",\"\")","v":{"$error":"#NAME?"}},null,{"$f":"IF(INDEX(periode5,NEVAL,Nenfant)=\"D\",\"X\",\"\")","v":{"$error":"#NAME?"}},{"$f":"IF(INDEX(periode5,NEVAL,Nenfant)=\"C\",\"X\",\"\")","v":{"$error":"#NAME?"}},{"$f":"IF(INDEX(periode5,NEVAL,Nenfant)=\"B\",\"X\",\"\")","v":{"$error":"#NAME?"}},{"$f":"IF(INDEX(periode5,NEVAL,Nenfant)=\"A\",\"X\",\"\")","v":{"$error":"#NAME?"}},null,{"$f":"IF(INDEX(periode6,NEVAL,Nenfant)=\"D\",\"X\",\"\")","v":{"$error":"#NAME?"}},{"$f":"IF(INDEX(periode6,NEVAL,Nenfant)=\"C\",\"X\",\"\")","v":{"$error":"#NAME?"}},{"$f":"IF(INDEX(periode6,NEVAL,Nenfant)=\"B\",\"X\",\"\")","v":{"$error":"#NAME?"}},{"$f":"IF(INDEX(periode6,NEVAL,Nenfant)=\"A\",\"X\",\"\")","v":{"$error":"#NAME?"}}]
[166,{"$nulls":7},{"$f":"COUNTIF($G175:$G177,\"X\")","v":0},{"$f":"COUNTIF($H175:$H177,\"X\")","v":0},{"$f":"COUNTIF($I173:$I175,\"X\")","v":0},{"$f":"COUNTIF($J173:$J175,\"X\")","v":0},null,{"$f":"COUNTIF($G175:$G177,\"X\")","v":0},{"$f":"COUNTIF($H175:$H177,\"X\")","v":0},{"$f":"COUNTIF($I173:$I175,\"X\")","v":0},{"$f":"COUNTIF($J173:$J175,\"X\")","v":0},null,{"$f":"COUNTIF($G175:$G177,\"X\")","v":0},{"$f":"COUNTIF($H175:$H177,\"X\")","v":0},{"$f":"COUNTIF($I173:$I175,\"X\")","v":0},{"$f":"COUNTIF($J173:$J175,\"X\")","v":0},null,{"$f":"COUNTIF($G175:$G177,\"X\")","v":0},{"$f":"COUNTIF($H175:$H177,\"X\")","v":0},{"$f":"COUNTIF($I173:$I175,\"X\")","v":0},{"$f":"COUNTIF(AA173:AA175,\"X\")","v":0},null,{"$f":"COUNTIF($G175:$G177,\"X\")","v":0},{"$f":"COUNTIF($H175:$H177,\"X\")","v":0},{"$f":"COUNTIF($I173:$I175,\"X\")","v":0},{"$f":"COUNTIF($J173:$J175,\"X\")","v":0},null,{"$f":"COUNTIF($G175:$G177,\"X\")","v":0},{"$f":"COUNTIF($H175:$H177,\"X\")","v":0},{"$f":"COUNTIF($I173:$I175,\"X\")","v":0},{"$f":"COUNTIF($J173:$J175,\"X\")","v":0}]
[167,{"$nulls":7},{"$f":"IF(INDEX(periode1,NEVAL,Nenfant)=\"D\",\"X\",\"\")","v":{"$error":"#NAME?"}},{"$f":"IF(INDEX(periode1,NEVAL,Nenfant)=\"C\",\"X\",\"\")","v":{"$error":"#NAME?"}},{"$f":"IF(INDEX(periode1,NEVAL,Nenfant)=\"B\",\"X\",\"\")","v":{"$error":"#NAME?"}},{"$f":"IF(INDEX(periode1,NEVAL,Nenfant)=\"A\",\"X\",\"\")","v":{"$error":"#NAME?"}},null,{"$f":"IF(INDEX(periode2,NEVAL,Nenfant)=\"D\",\"X\",\"\")","v":{"$error":"#NAME?"}},{"$f":"IF(INDEX(periode2,NEVAL,Nenfant)=\"C\",\"X\",\"\")","v":{"$error":"#NAME?"}},{"$f":"IF(INDEX(periode2,NEVAL,Nenfant)=\"B\",\"X\",\"\")","v":{"$error":"#NAME?"}},{"$f":"IF(INDEX(periode2,NEVAL,Nenfant)=\"A\",\"X\",\"\")","v":{"$error":"#NAME?"}},null,{"$f":"IF(INDEX(periode3,NEVAL,Nenfant)=\"D\",\"X\",\"\")","v":{"$error":"#NAME?"}},{"$f":"IF(INDEX(periode3,NEVAL,Nenfant)=\"C\",\"X\",\"\")","v":{"$error":"#NAME?"}},{"$f":"IF(INDEX(periode3,NEVAL,Nenfant)=\"B\",\"X\",\"\")","v":{"$error":"#NAME?"}},{"$f":"IF(INDEX(periode3,NEVAL,Nenfant)=\"A\",\"X\",\"\")","v":{"$error":"#NAME?"}},null,{"$f":"IF(INDEX(periode4,NEVAL,Nenfant)=\"D\",\"X\",\"\")","v":{"$error":"#NAME?"}},{"$f":"IF(INDEX(periode4,NEVAL,Nenfant)=\"C\",\"X\",\"\")","v":{"$error":"#NAME?"}},{"$f":"IF(INDEX(periode4,NEVAL,Nenfant)=\"B\",\"X\",\"\")","v":{"$error":"#NAME?"}},{"$f":"IF(INDEX(periode4,NEVAL,Nenfant)=\"A\",\"X\",\"\")","v":{"$error":"#NAME?"}},null,{"$f":"IF(INDEX(periode5,NEVAL,Nenfant)=\"D\",\"X\",\"\")","v":{"$error":"#NAME?"}},{"$f":"IF(INDEX(periode5,NEVAL,Nenfant)=\"C\",\"X\",\"\")","v":{"$error":"#NAME?"}},{"$f":"IF(INDEX(periode5,NEVAL,Nenfant)=\"B\",\"X\",\"\")","v":{"$error":"#NAME?"}},{"$f":"IF(INDEX(periode5,NEVAL,Nenfant)=\"A\",\"X\",\"\")","v":{"$error":"#NAME?"}},null,{"$f":"IF(INDEX(periode6,NEVAL,Nenfant)=\"D\",\"X\",\"\")","v":{"$error":"#NAME?"}},{"$f":"IF(INDEX(periode6,NEVAL,Nenfant)=\"C\",\"X\",\"\")","v":{"$error":"#NAME?"}},{"$f":"IF(INDEX(periode6,NEVAL,Nenfant)=\"B\",\"X\",\"\")","v":{"$error":"#NAME?"}},{"$f":"IF(INDEX(periode6,NEVAL,Nenfant)=\"A\",\"X\",\"\")","v":{"$error":"#NAME?"}}]
[168,{"$nulls":7},{"$f":"IF(INDEX(periode1,NEVAL,Nenfant)=\"D\",\"X\",\"\")","v":{"$error":"#NAME?"}},{"$f":"IF(INDEX(periode1,NEVAL,Nenfant)=\"C\",\"X\",\"\")","v":{"$error":"#NAME?"}},{"$f":"IF(INDEX(periode1,NEVAL,Nenfant)=\"B\",\"X\",\"\")","v":{"$error":"#NAME?"}},{"$f":"IF(INDEX(periode1,NEVAL,Nenfant)=\"A\",\"X\",\"\")","v":{"$error":"#NAME?"}},null,{"$f":"IF(INDEX(periode2,NEVAL,Nenfant)=\"D\",\"X\",\"\")","v":{"$error":"#NAME?"}},{"$f":"IF(INDEX(periode2,NEVAL,Nenfant)=\"C\",\"X\",\"\")","v":{"$error":"#NAME?"}},{"$f":"IF(INDEX(periode2,NEVAL,Nenfant)=\"B\",\"X\",\"\")","v":{"$error":"#NAME?"}},{"$f":"IF(INDEX(periode2,NEVAL,Nenfant)=\"A\",\"X\",\"\")","v":{"$error":"#NAME?"}},null,{"$f":"IF(INDEX(periode3,NEVAL,Nenfant)=\"D\",\"X\",\"\")","v":{"$error":"#NAME?"}},{"$f":"IF(INDEX(periode3,NEVAL,Nenfant)=\"C\",\"X\",\"\")","v":{"$error":"#NAME?"}},{"$f":"IF(INDEX(periode3,NEVAL,Nenfant)=\"B\",\"X\",\"\")","v":{"$error":"#NAME?"}},{"$f":"IF(INDEX(periode3,NEVAL,Nenfant)=\"A\",\"X\",\"\")","v":{"$error":"#NAME?"}},null,{"$f":"IF(INDEX(periode4,NEVAL,Nenfant)=\"D\",\"X\",\"\")","v":{"$error":"#NAME?"}},{"$f":"IF(INDEX(periode4,NEVAL,Nenfant)=\"C\",\"X\",\"\")","v":{"$error":"#NAME?"}},{"$f":"IF(INDEX(periode4,NEVAL,Nenfant)=\"B\",\"X\",\"\")","v":{"$error":"#NAME?"}},{"$f":"IF(INDEX(periode4,NEVAL,Nenfant)=\"A\",\"X\",\"\")","v":{"$error":"#NAME?"}},null,{"$f":"IF(INDEX(periode5,NEVAL,Nenfant)=\"D\",\"X\",\"\")","v":{"$error":"#NAME?"}},{"$f":"IF(INDEX(periode5,NEVAL,Nenfant)=\"C\",\"X\",\"\")","v":{"$error":"#NAME?"}},{"$f":"IF(INDEX(periode5,NEVAL,Nenfant)=\"B\",\"X\",\"\")","v":{"$error":"#NAME?"}},{"$f":"IF(INDEX(periode5,NEVAL,Nenfant)=\"A\",\"X\",\"\")","v":{"$error":"#NAME?"}},null,{"$f":"IF(INDEX(periode6,NEVAL,Nenfant)=\"D\",\"X\",\"\")","v":{"$error":"#NAME?"}},{"$f":"IF(INDEX(periode6,NEVAL,Nenfant)=\"C\",\"X\",\"\")","v":{"$error":"#NAME?"}},{"$f":"IF(INDEX(periode6,NEVAL,Nenfant)=\"B\",\"X\",\"\")","v":{"$error":"#NAME?"}},{"$f":"IF(INDEX(periode6,NEVAL,Nenfant)=\"A\",\"X\",\"\")","v":{"$error":"#NAME?"}}]
[169,{"$nulls":7},{"$f":"IF(INDEX(periode1,NEVAL,Nenfant)=\"D\",\"X\",\"\")","v":{"$error":"#NAME?"}},{"$f":"IF(INDEX(periode1,NEVAL,Nenfant)=\"C\",\"X\",\"\")","v":{"$error":"#NAME?"}},{"$f":"IF(INDEX(periode1,NEVAL,Nenfant)=\"B\",\"X\",\"\")","v":{"$error":"#NAME?"}},{"$f":"IF(INDEX(periode1,NEVAL,Nenfant)=\"A\",\"X\",\"\")","v":{"$error":"#NAME?"}},null,{"$f":"IF(INDEX(periode2,NEVAL,Nenfant)=\"D\",\"X\",\"\")","v":{"$error":"#NAME?"}},{"$f":"IF(INDEX(periode2,NEVAL,Nenfant)=\"C\",\"X\",\"\")","v":{"$error":"#NAME?"}},{"$f":"IF(INDEX(periode2,NEVAL,Nenfant)=\"B\",\"X\",\"\")","v":{"$error":"#NAME?"}},{"$f":"IF(INDEX(periode2,NEVAL,Nenfant)=\"A\",\"X\",\"\")","v":{"$error":"#NAME?"}},null,{"$f":"IF(INDEX(periode3,NEVAL,Nenfant)=\"D\",\"X\",\"\")","v":{"$error":"#NAME?"}},{"$f":"IF(INDEX(periode3,NEVAL,Nenfant)=\"C\",\"X\",\"\")","v":{"$error":"#NAME?"}},{"$f":"IF(INDEX(periode3,NEVAL,Nenfant)=\"B\",\"X\",\"\")","v":{"$error":"#NAME?"}},{"$f":"IF(INDEX(periode3,NEVAL,Nenfant)=\"A\",\"X\",\"\")","v":{"$error":"#NAME?"}},null,{"$f":"IF(INDEX(periode4,NEVAL,Nenfant)=\"D\",\"X\",\"\")","v":{"$error":"#NAME?"}},{"$f":"IF(INDEX(periode4,NEVAL,Nenfant)=\"C\",\"X\",\"\")","v":{"$error":"#NAME?"}},{"$f":"IF(INDEX(periode4,NEVAL,Nenfant)=\"B\",\"X\",\"\")","v":{"$error":"#NAME?"}},{"$f":"IF(INDEX(periode4,NEVAL,Nenfant)=\"A\",\"X\",\"\")","v":{"$error":"#NAME?"}},null,{"$f":"IF(INDEX(periode5,NEVAL,Nenfant)=\"D\",\"X\",\"\")","v":{"$error":"#NAME?"}},{"$f":"IF(INDEX(periode5,NEVAL,Nenfant)=\"C\",\"X\",\"\")","v":{"$error":"#NAME?"}},{"$f":"IF(INDEX(periode5,NEVAL,Nenfant)=\"B\",\"X\",\"\")","v":{"$error":"#NAME?"}},{"$f":"IF(INDEX(periode5,NEVAL,Nenfant)=\"A\",\"X\",\"\")","v":{"$error":"#NAME?"}},null,{"$f":"IF(INDEX(periode6,NEVAL,Nenfant)=\"D\",\"X\",\"\")","v":{"$error":"#NAME?"}},{"$f":"IF(INDEX(periode6,NEVAL,Nenfant)=\"C\",\"X\",\"\")","v":{"$error":"#NAME?"}},{"$f":"IF(INDEX(periode6,NEVAL,Nenfant)=\"B\",\"X\",\"\")","v":{"$error":"#NAME?"}},{"$f":"IF(INDEX(periode6,NEVAL,Nenfant)=\"A\",\"X\",\"\")","v":{"$error":"#NAME?"}}]
[170,{"$nulls":7},{"$f":"COUNTIF($G179:$G181,\"X\")","v":0},{"$f":"COUNTIF($H179:$H181,\"X\")","v":0},{"$f":"COUNTIF($I177:$I179,\"X\")","v":0},{"$f":"COUNTIF($J177:$J179,\"X\")","v":0},null,{"$f":"COUNTIF($G179:$G181,\"X\")","v":0},{"$f":"COUNTIF($H179:$H181,\"X\")","v":0},{"$f":"COUNTIF($I177:$I179,\"X\")","v":0},{"$f":"COUNTIF($J177:$J179,\"X\")","v":0},null,{"$f":"COUNTIF($G179:$G181,\"X\")","v":0},{"$f":"COUNTIF($H179:$H181,\"X\")","v":0},{"$f":"COUNTIF($I177:$I179,\"X\")","v":0},{"$f":"COUNTIF($J177:$J179,\"X\")","v":0},null,{"$f":"COUNTIF($G179:$G181,\"X\")","v":0},{"$f":"COUNTIF($H179:$H181,\"X\")","v":0},{"$f":"COUNTIF($I177:$I179,\"X\")","v":0},{"$f":"COUNTIF(AA177:AA179,\"X\")","v":0},null,{"$f":"COUNTIF($G179:$G181,\"X\")","v":0},{"$f":"COUNTIF($H179:$H181,\"X\")","v":0},{"$f":"COUNTIF($I177:$I179,\"X\")","v":0},{"$f":"COUNTIF($J177:$J179,\"X\")","v":0},null,{"$f":"COUNTIF($G179:$G181,\"X\")","v":0},{"$f":"COUNTIF($H179:$H181,\"X\")","v":0},{"$f":"COUNTIF($I177:$I179,\"X\")","v":0},{"$f":"COUNTIF($J177:$J179,\"X\")","v":0}]
[171,{"$nulls":7},{"$f":"IF(INDEX(periode1,NEVAL,Nenfant)=\"D\",\"X\",\"\")","v":{"$error":"#NAME?"}},{"$f":"IF(INDEX(periode1,NEVAL,Nenfant)=\"C\",\"X\",\"\")","v":{"$error":"#NAME?"}},{"$f":"IF(INDEX(periode1,NEVAL,Nenfant)=\"B\",\"X\",\"\")","v":{"$error":"#NAME?"}},{"$f":"IF(INDEX(periode1,NEVAL,Nenfant)=\"A\",\"X\",\"\")","v":{"$error":"#NAME?"}},null,{"$f":"IF(INDEX(periode2,NEVAL,Nenfant)=\"D\",\"X\",\"\")","v":{"$error":"#NAME?"}},{"$f":"IF(INDEX(periode2,NEVAL,Nenfant)=\"C\",\"X\",\"\")","v":{"$error":"#NAME?"}},{"$f":"IF(INDEX(periode2,NEVAL,Nenfant)=\"B\",\"X\",\"\")","v":{"$error":"#NAME?"}},{"$f":"IF(INDEX(periode2,NEVAL,Nenfant)=\"A\",\"X\",\"\")","v":{"$error":"#NAME?"}},null,{"$f":"IF(INDEX(periode3,NEVAL,Nenfant)=\"D\",\"X\",\"\")","v":{"$error":"#NAME?"}},{"$f":"IF(INDEX(periode3,NEVAL,Nenfant)=\"C\",\"X\",\"\")","v":{"$error":"#NAME?"}},{"$f":"IF(INDEX(periode3,NEVAL,Nenfant)=\"B\",\"X\",\"\")","v":{"$error":"#NAME?"}},{"$f":"IF(INDEX(periode3,NEVAL,Nenfant)=\"A\",\"X\",\"\")","v":{"$error":"#NAME?"}},null,{"$f":"IF(INDEX(periode4,NEVAL,Nenfant)=\"D\",\"X\",\"\")","v":{"$error":"#NAME?"}},{"$f":"IF(INDEX(periode4,NEVAL,Nenfant)=\"C\",\"X\",\"\")","v":{"$error":"#NAME?"}},{"$f":"IF(INDEX(periode4,NEVAL,Nenfant)=\"B\",\"X\",\"\")","v":{"$error":"#NAME?"}},{"$f":"IF(INDEX(periode4,NEVAL,Nenfant)=\"A\",\"X\",\"\")","v":{"$error":"#NAME?"}},null,{"$f":"IF(INDEX(periode5,NEVAL,Nenfant)=\"D\",\"X\",\"\")","v":{"$error":"#NAME?"}},{"$f":"IF(INDEX(periode5,NEVAL,Nenfant)=\"C\",\"X\",\"\")","v":{"$error":"#NAME?"}},{"$f":"IF(INDEX(periode5,NEVAL,Nenfant)=\"B\",\"X\",\"\")","v":{"$error":"#NAME?"}},{"$f":"IF(INDEX(periode5,NEVAL,Nenfant)=\"A\",\"X\",\"\")","v":{"$error":"#NAME?"}},null,{"$f":"IF(INDEX(periode6,NEVAL,Nenfant)=\"D\",\"X\",\"\")","v":{"$error":"#NAME?"}},{"$f":"IF(INDEX(periode6,NEVAL,Nenfant)=\"C\",\"X\",\"\")","v":{"$error":"#NAME?"}},{"$f":"IF(INDEX(periode6,NEVAL,Nenfant)=\"B\",\"X\",\"\")","v":{"$error":"#NAME?"}},{"$f":"IF(INDEX(periode6,NEVAL,Nenfant)=\"A\",\"X\",\"\")","v":{"$error":"#NAME?"}}]
[172,{"$nulls":7},{"$f":"IF(INDEX(periode1,NEVAL,Nenfant)=\"D\",\"X\",\"\")","v":{"$error":"#NAME?"}},{"$f":"IF(INDEX(periode1,NEVAL,Nenfant)=\"C\",\"X\",\"\")","v":{"$error":"#NAME?"}},{"$f":"IF(INDEX(periode1,NEVAL,Nenfant)=\"B\",\"X\",\"\")","v":{"$error":"#NAME?"}},{"$f":"IF(INDEX(periode1,NEVAL,Nenfant)=\"A\",\"X\",\"\")","v":{"$error":"#NAME?"}},null,{"$f":"IF(INDEX(periode2,NEVAL,Nenfant)=\"D\",\"X\",\"\")","v":{"$error":"#NAME?"}},{"$f":"IF(INDEX(periode2,NEVAL,Nenfant)=\"C\",\"X\",\"\")","v":{"$error":"#NAME?"}},{"$f":"IF(INDEX(periode2,NEVAL,Nenfant)=\"B\",\"X\",\"\")","v":{"$error":"#NAME?"}},{"$f":"IF(INDEX(periode2,NEVAL,Nenfant)=\"A\",\"X\",\"\")","v":{"$error":"#NAME?"}},null,{"$f":"IF(INDEX(periode3,NEVAL,Nenfant)=\"D\",\"X\",\"\")","v":{"$error":"#NAME?"}},{"$f":"IF(INDEX(periode3,NEVAL,Nenfant)=\"C\",\"X\",\"\")","v":{"$error":"#NAME?"}},{"$f":"IF(INDEX(periode3,NEVAL,Nenfant)=\"B\",\"X\",\"\")","v":{"$error":"#NAME?"}},{"$f":"IF(INDEX(periode3,NEVAL,Nenfant)=\"A\",\"X\",\"\")","v":{"$error":"#NAME?"}},null,{"$f":"IF(INDEX(periode4,NEVAL,Nenfant)=\"D\",\"X\",\"\")","v":{"$error":"#NAME?"}},{"$f":"IF(INDEX(periode4,NEVAL,Nenfant)=\"C\",\"X\",\"\")","v":{"$error":"#NAME?"}},{"$f":"IF(INDEX(periode4,NEVAL,Nenfant)=\"B\",\"X\",\"\")","v":{"$error":"#NAME?"}},{"$f":"IF(INDEX(periode4,NEVAL,Nenfant)=\"A\",\"X\",\"\")","v":{"$error":"#NAME?"}},null,{"$f":"IF(INDEX(periode5,NEVAL,Nenfant)=\"D\",\"X\",\"\")","v":{"$error":"#NAME?"}},{"$f":"IF(INDEX(periode5,NEVAL,Nenfant)=\"C\",\"X\",\"\")","v":{"$error":"#NAME?"}},{"$f":"IF(INDEX(periode5,NEVAL,Nenfant)=\"B\",\"X\",\"\")","v":{"$error":"#NAME?"}},{"$f":"IF(INDEX(periode5,NEVAL,Nenfant)=\"A\",\"X\",\"\")","v":{"$error":"#NAME?"}},null,{"$f":"IF(INDEX(periode6,NEVAL,Nenfant)=\"D\",\"X\",\"\")","v":{"$error":"#NAME?"}},{"$f":"IF(INDEX(periode6,NEVAL,Nenfant)=\"C\",\"X\",\"\")","v":{"$error":"#NAME?"}},{"$f":"IF(INDEX(periode6,NEVAL,Nenfant)=\"B\",\"X\",\"\")","v":{"$error":"#NAME?"}},{"$f":"IF(INDEX(periode6,NEVAL,Nenfant)=\"A\",\"X\",\"\")","v":{"$error":"#NAME?"}}]
[173,{"$nulls":7},{"$f":"IF(INDEX(periode1,NEVAL,Nenfant)=\"D\",\"X\",\"\")","v":{"$error":"#NAME?"}},{"$f":"IF(INDEX(periode1,NEVAL,Nenfant)=\"C\",\"X\",\"\")","v":{"$error":"#NAME?"}},{"$f":"IF(INDEX(periode1,NEVAL,Nenfant)=\"B\",\"X\",\"\")","v":{"$error":"#NAME?"}},{"$f":"IF(INDEX(periode1,NEVAL,Nenfant)=\"A\",\"X\",\"\")","v":{"$error":"#NAME?"}},null,{"$f":"IF(INDEX(periode2,NEVAL,Nenfant)=\"D\",\"X\",\"\")","v":{"$error":"#NAME?"}},{"$f":"IF(INDEX(periode2,NEVAL,Nenfant)=\"C\",\"X\",\"\")","v":{"$error":"#NAME?"}},{"$f":"IF(INDEX(periode2,NEVAL,Nenfant)=\"B\",\"X\",\"\")","v":{"$error":"#NAME?"}},{"$f":"IF(INDEX(periode2,NEVAL,Nenfant)=\"A\",\"X\",\"\")","v":{"$error":"#NAME?"}},null,{"$f":"IF(INDEX(periode3,NEVAL,Nenfant)=\"D\",\"X\",\"\")","v":{"$error":"#NAME?"}},{"$f":"IF(INDEX(periode3,NEVAL,Nenfant)=\"C\",\"X\",\"\")","v":{"$error":"#NAME?"}},{"$f":"IF(INDEX(periode3,NEVAL,Nenfant)=\"B\",\"X\",\"\")","v":{"$error":"#NAME?"}},{"$f":"IF(INDEX(periode3,NEVAL,Nenfant)=\"A\",\"X\",\"\")","v":{"$error":"#NAME?"}},null,{"$f":"IF(INDEX(periode4,NEVAL,Nenfant)=\"D\",\"X\",\"\")","v":{"$error":"#NAME?"}},{"$f":"IF(INDEX(periode4,NEVAL,Nenfant)=\"C\",\"X\",\"\")","v":{"$error":"#NAME?"}},{"$f":"IF(INDEX(periode4,NEVAL,Nenfant)=\"B\",\"X\",\"\")","v":{"$error":"#NAME?"}},{"$f":"IF(INDEX(periode4,NEVAL,Nenfant)=\"A\",\"X\",\"\")","v":{"$error":"#NAME?"}},null,{"$f":"IF(INDEX(periode5,NEVAL,Nenfant)=\"D\",\"X\",\"\")","v":{"$error":"#NAME?"}},{"$f":"IF(INDEX(periode5,NEVAL,Nenfant)=\"C\",\"X\",\"\")","v":{"$error":"#NAME?"}},{"$f":"IF(INDEX(periode5,NEVAL,Nenfant)=\"B\",\"X\",\"\")","v":{"$error":"#NAME?"}},{"$f":"IF(INDEX(periode5,NEVAL,Nenfant)=\"A\",\"X\",\"\")","v":{"$error":"#NAME?"}},null,{"$f":"IF(INDEX(periode6,NEVAL,Nenfant)=\"D\",\"X\",\"\")","v":{"$error":"#NAME?"}},{"$f":"IF(INDEX(periode6,NEVAL,Nenfant)=\"C\",\"X\",\"\")","v":{"$error":"#NAME?"}},{"$f":"IF(INDEX(periode6,NEVAL,Nenfant)=\"B\",\"X\",\"\")","v":{"$error":"#NAME?"}},{"$f":"IF(INDEX(periode6,NEVAL,Nenfant)=\"A\",\"X\",\"\")","v":{"$error":"#NAME?"}}]
[174,{"$nulls":7},{"$f":"COUNTIF($G180:$G182,\"X\")","v":0},{"$f":"COUNTIF($H180:$H182,\"X\")","v":0},{"$f":"COUNTIF($I181:$I182,\"X\")","v":0},{"$f":"COUNTIF($J181:$J182,\"X\")","v":0},null,{"$f":"COUNTIF($G180:$G182,\"X\")","v":0},{"$f":"COUNTIF($H180:$H182,\"X\")","v":0},{"$f":"COUNTIF($I181:$I182,\"X\")","v":0},{"$f":"COUNTIF($J181:$J182,\"X\")","v":0},null,{"$f":"COUNTIF($G180:$G182,\"X\")","v":0},{"$f":"COUNTIF($H180:$H182,\"X\")","v":0},{"$f":"COUNTIF($I181:$I182,\"X\")","v":0},{"$f":"COUNTIF($J181:$J182,\"X\")","v":0},null,{"$f":"COUNTIF($G180:$G182,\"X\")","v":0},{"$f":"COUNTIF($H180:$H182,\"X\")","v":0},{"$f":"COUNTIF($I181:$I182,\"X\")","v":0},{"$f":"COUNTIF(AA181:AA182,\"X\")","v":0},null,{"$f":"COUNTIF($G180:$G182,\"X\")","v":0},{"$f":"COUNTIF($H180:$H182,\"X\")","v":0},{"$f":"COUNTIF($I181:$I182,\"X\")","v":0},{"$f":"COUNTIF($J181:$J182,\"X\")","v":0},null,{"$f":"COUNTIF($G180:$G182,\"X\")","v":0},{"$f":"COUNTIF($H180:$H182,\"X\")","v":0},{"$f":"COUNTIF($I181:$I182,\"X\")","v":0},{"$f":"COUNTIF($J181:$J182,\"X\")","v":0}]
[175,{"$nulls":7},{"$f":"IF(INDEX(periode1,NEVAL,Nenfant)=\"D\",\"X\",\"\")","v":{"$error":"#NAME?"}},{"$f":"IF(INDEX(periode1,NEVAL,Nenfant)=\"C\",\"X\",\"\")","v":{"$error":"#NAME?"}},{"$f":"IF(INDEX(periode1,NEVAL,Nenfant)=\"B\",\"X\",\"\")","v":{"$error":"#NAME?"}},{"$f":"IF(INDEX(periode1,NEVAL,Nenfant)=\"A\",\"X\",\"\")","v":{"$error":"#NAME?"}},null,{"$f":"IF(INDEX(periode2,NEVAL,Nenfant)=\"D\",\"X\",\"\")","v":{"$error":"#NAME?"}},{"$f":"IF(INDEX(periode2,NEVAL,Nenfant)=\"C\",\"X\",\"\")","v":{"$error":"#NAME?"}},{"$f":"IF(INDEX(periode2,NEVAL,Nenfant)=\"B\",\"X\",\"\")","v":{"$error":"#NAME?"}},{"$f":"IF(INDEX(periode2,NEVAL,Nenfant)=\"A\",\"X\",\"\")","v":{"$error":"#NAME?"}},null,{"$f":"IF(INDEX(periode3,NEVAL,Nenfant)=\"D\",\"X\",\"\")","v":{"$error":"#NAME?"}},{"$f":"IF(INDEX(periode3,NEVAL,Nenfant)=\"C\",\"X\",\"\")","v":{"$error":"#NAME?"}},{"$f":"IF(INDEX(periode3,NEVAL,Nenfant)=\"B\",\"X\",\"\")","v":{"$error":"#NAME?"}},{"$f":"IF(INDEX(periode3,NEVAL,Nenfant)=\"A\",\"X\",\"\")","v":{"$error":"#NAME?"}},null,{"$f":"IF(INDEX(periode4,NEVAL,Nenfant)=\"D\",\"X\",\"\")","v":{"$error":"#NAME?"}},{"$f":"IF(INDEX(periode4,NEVAL,Nenfant)=\"C\",\"X\",\"\")","v":{"$error":"#NAME?"}},{"$f":"IF(INDEX(periode4,NEVAL,Nenfant)=\"B\",\"X\",\"\")","v":{"$error":"#NAME?"}},{"$f":"IF(INDEX(periode4,NEVAL,Nenfant)=\"A\",\"X\",\"\")","v":{"$error":"#NAME?"}},null,{"$f":"IF(INDEX(periode5,NEVAL,Nenfant)=\"D\",\"X\",\"\")","v":{"$error":"#NAME?"}},{"$f":"IF(INDEX(periode5,NEVAL,Nenfant)=\"C\",\"X\",\"\")","v":{"$error":"#NAME?"}},{"$f":"IF(INDEX(periode5,NEVAL,Nenfant)=\"B\",\"X\",\"\")","v":{"$error":"#NAME?"}},{"$f":"IF(INDEX(periode5,NEVAL,Nenfant)=\"A\",\"X\",\"\")","v":{"$error":"#NAME?"}},null,{"$f":"IF(INDEX(periode6,NEVAL,Nenfant)=\"D\",\"X\",\"\")","v":{"$error":"#NAME?"}},{"$f":"IF(INDEX(periode6,NEVAL,Nenfant)=\"C\",\"X\",\"\")","v":{"$error":"#NAME?"}},{"$f":"IF(INDEX(periode6,NEVAL,Nenfant)=\"B\",\"X\",\"\")","v":{"$error":"#NAME?"}},{"$f":"IF(INDEX(periode6,NEVAL,Nenfant)=\"A\",\"X\",\"\")","v":{"$error":"#NAME?"}}]
[176,{"$nulls":7},{"$f":"IF(INDEX(periode1,NEVAL,Nenfant)=\"D\",\"X\",\"\")","v":{"$error":"#NAME?"}},{"$f":"IF(INDEX(periode1,NEVAL,Nenfant)=\"C\",\"X\",\"\")","v":{"$error":"#NAME?"}},{"$f":"IF(INDEX(periode1,NEVAL,Nenfant)=\"B\",\"X\",\"\")","v":{"$error":"#NAME?"}},{"$f":"IF(INDEX(periode1,NEVAL,Nenfant)=\"A\",\"X\",\"\")","v":{"$error":"#NAME?"}},null,{"$f":"IF(INDEX(periode2,NEVAL,Nenfant)=\"D\",\"X\",\"\")","v":{"$error":"#NAME?"}},{"$f":"IF(INDEX(periode2,NEVAL,Nenfant)=\"C\",\"X\",\"\")","v":{"$error":"#NAME?"}},{"$f":"IF(INDEX(periode2,NEVAL,Nenfant)=\"B\",\"X\",\"\")","v":{"$error":"#NAME?"}},{"$f":"IF(INDEX(periode2,NEVAL,Nenfant)=\"A\",\"X\",\"\")","v":{"$error":"#NAME?"}},null,{"$f":"IF(INDEX(periode3,NEVAL,Nenfant)=\"D\",\"X\",\"\")","v":{"$error":"#NAME?"}},{"$f":"IF(INDEX(periode3,NEVAL,Nenfant)=\"C\",\"X\",\"\")","v":{"$error":"#NAME?"}},{"$f":"IF(INDEX(periode3,NEVAL,Nenfant)=\"B\",\"X\",\"\")","v":{"$error":"#NAME?"}},{"$f":"IF(INDEX(periode3,NEVAL,Nenfant)=\"A\",\"X\",\"\")","v":{"$error":"#NAME?"}},null,{"$f":"IF(INDEX(periode4,NEVAL,Nenfant)=\"D\",\"X\",\"\")","v":{"$error":"#NAME?"}},{"$f":"IF(INDEX(periode4,NEVAL,Nenfant)=\"C\",\"X\",\"\")","v":{"$error":"#NAME?"}},{"$f":"IF(INDEX(periode4,NEVAL,Nenfant)=\"B\",\"X\",\"\")","v":{"$error":"#NAME?"}},{"$f":"IF(INDEX(periode4,NEVAL,Nenfant)=\"A\",\"X\",\"\")","v":{"$error":"#NAME?"}},null,{"$f":"IF(INDEX(periode5,NEVAL,Nenfant)=\"D\",\"X\",\"\")","v":{"$error":"#NAME?"}},{"$f":"IF(INDEX(periode5,NEVAL,Nenfant)=\"C\",\"X\",\"\")","v":{"$error":"#NAME?"}},{"$f":"IF(INDEX(periode5,NEVAL,Nenfant)=\"B\",\"X\",\"\")","v":{"$error":"#NAME?"}},{"$f":"IF(INDEX(periode5,NEVAL,Nenfant)=\"A\",\"X\",\"\")","v":{"$error":"#NAME?"}},null,{"$f":"IF(INDEX(periode6,NEVAL,Nenfant)=\"D\",\"X\",\"\")","v":{"$error":"#NAME?"}},{"$f":"IF(INDEX(periode6,NEVAL,Nenfant)=\"C\",\"X\",\"\")","v":{"$error":"#NAME?"}},{"$f":"IF(INDEX(periode6,NEVAL,Nenfant)=\"B\",\"X\",\"\")","v":{"$error":"#NAME?"}},{"$f":"IF(INDEX(periode6,NEVAL,Nenfant)=\"A\",\"X\",\"\")","v":{"$error":"#NAME?"}}]
[177,{"$nulls":7},{"$f":"COUNTIF($G186:$G188,\"X\")","v":0},{"$f":"COUNTIF($H186:$H188,\"X\")","v":0},{"$f":"COUNTIF($I184:$I186,\"X\")","v":0},{"$f":"COUNTIF($J184:$J186,\"X\")","v":0},null,{"$f":"COUNTIF($G186:$G188,\"X\")","v":0},{"$f":"COUNTIF($H186:$H188,\"X\")","v":0},{"$f":"COUNTIF($I184:$I186,\"X\")","v":0},{"$f":"COUNTIF($J184:$J186,\"X\")","v":0},null,{"$f":"COUNTIF($G186:$G188,\"X\")","v":0},{"$f":"COUNTIF($H186:$H188,\"X\")","v":0},{"$f":"COUNTIF($I184:$I186,\"X\")","v":0},{"$f":"COUNTIF($J184:$J186,\"X\")","v":0},null,{"$f":"COUNTIF($G186:$G188,\"X\")","v":0},{"$f":"COUNTIF($H186:$H188,\"X\")","v":0},{"$f":"COUNTIF($I184:$I186,\"X\")","v":0},{"$f":"COUNTIF(AA184:AA186,\"X\")","v":0},null,{"$f":"COUNTIF($G186:$G188,\"X\")","v":0},{"$f":"COUNTIF($H186:$H188,\"X\")","v":0},{"$f":"COUNTIF($I184:$I186,\"X\")","v":0},{"$f":"COUNTIF($J184:$J186,\"X\")","v":0},null,{"$f":"COUNTIF($G186:$G188,\"X\")","v":0},{"$f":"COUNTIF($H186:$H188,\"X\")","v":0},{"$f":"COUNTIF($I184:$I186,\"X\")","v":0},{"$f":"COUNTIF($J184:$J186,\"X\")","v":0}]
[178,{"$nulls":7},{"$f":"IF(INDEX(periode1,NEVAL,Nenfant)=\"D\",\"X\",\"\")","v":{"$error":"#NAME?"}},{"$f":"IF(INDEX(periode1,NEVAL,Nenfant)=\"C\",\"X\",\"\")","v":{"$error":"#NAME?"}},{"$f":"IF(INDEX(periode1,NEVAL,Nenfant)=\"B\",\"X\",\"\")","v":{"$error":"#NAME?"}},{"$f":"IF(INDEX(periode1,NEVAL,Nenfant)=\"A\",\"X\",\"\")","v":{"$error":"#NAME?"}},null,{"$f":"IF(INDEX(periode2,NEVAL,Nenfant)=\"D\",\"X\",\"\")","v":{"$error":"#NAME?"}},{"$f":"IF(INDEX(periode2,NEVAL,Nenfant)=\"C\",\"X\",\"\")","v":{"$error":"#NAME?"}},{"$f":"IF(INDEX(periode2,NEVAL,Nenfant)=\"B\",\"X\",\"\")","v":{"$error":"#NAME?"}},{"$f":"IF(INDEX(periode2,NEVAL,Nenfant)=\"A\",\"X\",\"\")","v":{"$error":"#NAME?"}},null,{"$f":"IF(INDEX(periode3,NEVAL,Nenfant)=\"D\",\"X\",\"\")","v":{"$error":"#NAME?"}},{"$f":"IF(INDEX(periode3,NEVAL,Nenfant)=\"C\",\"X\",\"\")","v":{"$error":"#NAME?"}},{"$f":"IF(INDEX(periode3,NEVAL,Nenfant)=\"B\",\"X\",\"\")","v":{"$error":"#NAME?"}},{"$f":"IF(INDEX(periode3,NEVAL,Nenfant)=\"A\",\"X\",\"\")","v":{"$error":"#NAME?"}},null,{"$f":"IF(INDEX(periode4,NEVAL,Nenfant)=\"D\",\"X\",\"\")","v":{"$error":"#NAME?"}},{"$f":"IF(INDEX(periode4,NEVAL,Nenfant)=\"C\",\"X\",\"\")","v":{"$error":"#NAME?"}},{"$f":"IF(INDEX(periode4,NEVAL,Nenfant)=\"B\",\"X\",\"\")","v":{"$error":"#NAME?"}},{"$f":"IF(INDEX(periode4,NEVAL,Nenfant)=\"A\",\"X\",\"\")","v":{"$error":"#NAME?"}},null,{"$f":"IF(INDEX(periode5,NEVAL,Nenfant)=\"D\",\"X\",\"\")","v":{"$error":"#NAME?"}},{"$f":"IF(INDEX(periode5,NEVAL,Nenfant)=\"C\",\"X\",\"\")","v":{"$error":"#NAME?"}},{"$f":"IF(INDEX(periode5,NEVAL,Nenfant)=\"B\",\"X\",\"\")","v":{"$error":"#NAME?"}},{"$f":"IF(INDEX(periode5,NEVAL,Nenfant)=\"A\",\"X\",\"\")","v":{"$error":"#NAME?"}},null,{"$f":"IF(INDEX(periode6,NEVAL,Nenfant)=\"D\",\"X\",\"\")","v":{"$error":"#NAME?"}},{"$f":"IF(INDEX(periode6,NEVAL,Nenfant)=\"C\",\"X\",\"\")","v":{"$error":"#NAME?"}},{"$f":"IF(INDEX(periode6,NEVAL,Nenfant)=\"B\",\"X\",\"\")","v":{"$error":"#NAME?"}},{"$f":"IF(INDEX(periode6,NEVAL,Nenfant)=\"A\",\"X\",\"\")","v":{"$error":"#NAME?"}}]
[179,{"$nulls":7},{"$f":"IF(INDEX(periode1,NEVAL,Nenfant)=\"D\",\"X\",\"\")","v":{"$error":"#NAME?"}},{"$f":"IF(INDEX(periode1,NEVAL,Nenfant)=\"C\",\"X\",\"\")","v":{"$error":"#NAME?"}},{"$f":"IF(INDEX(periode1,NEVAL,Nenfant)=\"B\",\"X\",\"\")","v":{"$error":"#NAME?"}},{"$f":"IF(INDEX(periode1,NEVAL,Nenfant)=\"A\",\"X\",\"\")","v":{"$error":"#NAME?"}},null,{"$f":"IF(INDEX(periode2,NEVAL,Nenfant)=\"D\",\"X\",\"\")","v":{"$error":"#NAME?"}},{"$f":"IF(INDEX(periode2,NEVAL,Nenfant)=\"C\",\"X\",\"\")","v":{"$error":"#NAME?"}},{"$f":"IF(INDEX(periode2,NEVAL,Nenfant)=\"B\",\"X\",\"\")","v":{"$error":"#NAME?"}},{"$f":"IF(INDEX(periode2,NEVAL,Nenfant)=\"A\",\"X\",\"\")","v":{"$error":"#NAME?"}},null,{"$f":"IF(INDEX(periode3,NEVAL,Nenfant)=\"D\",\"X\",\"\")","v":{"$error":"#NAME?"}},{"$f":"IF(INDEX(periode3,NEVAL,Nenfant)=\"C\",\"X\",\"\")","v":{"$error":"#NAME?"}},{"$f":"IF(INDEX(periode3,NEVAL,Nenfant)=\"B\",\"X\",\"\")","v":{"$error":"#NAME?"}},{"$f":"IF(INDEX(periode3,NEVAL,Nenfant)=\"A\",\"X\",\"\")","v":{"$error":"#NAME?"}},null,{"$f":"IF(INDEX(periode4,NEVAL,Nenfant)=\"D\",\"X\",\"\")","v":{"$error":"#NAME?"}},{"$f":"IF(INDEX(periode4,NEVAL,Nenfant)=\"C\",\"X\",\"\")","v":{"$error":"#NAME?"}},{"$f":"IF(INDEX(periode4,NEVAL,Nenfant)=\"B\",\"X\",\"\")","v":{"$error":"#NAME?"}},{"$f":"IF(INDEX(periode4,NEVAL,Nenfant)=\"A\",\"X\",\"\")","v":{"$error":"#NAME?"}},null,{"$f":"IF(INDEX(periode5,NEVAL,Nenfant)=\"D\",\"X\",\"\")","v":{"$error":"#NAME?"}},{"$f":"IF(INDEX(periode5,NEVAL,Nenfant)=\"C\",\"X\",\"\")","v":{"$error":"#NAME?"}},{"$f":"IF(INDEX(periode5,NEVAL,Nenfant)=\"B\",\"X\",\"\")","v":{"$error":"#NAME?"}},{"$f":"IF(INDEX(periode5,NEVAL,Nenfant)=\"A\",\"X\",\"\")","v":{"$error":"#NAME?"}},null,{"$f":"IF(INDEX(periode6,NEVAL,Nenfant)=\"D\",\"X\",\"\")","v":{"$error":"#NAME?"}},{"$f":"IF(INDEX(periode6,NEVAL,Nenfant)=\"C\",\"X\",\"\")","v":{"$error":"#NAME?"}},{"$f":"IF(INDEX(periode6,NEVAL,Nenfant)=\"B\",\"X\",\"\")","v":{"$error":"#NAME?"}},{"$f":"IF(INDEX(periode6,NEVAL,Nenfant)=\"A\",\"X\",\"\")","v":{"$error":"#NAME?"}}]
[180,{"$nulls":7},{"$f":"IF(INDEX(periode1,NEVAL,Nenfant)=\"D\",\"X\",\"\")","v":{"$error":"#NAME?"}},{"$f":"IF(INDEX(periode1,NEVAL,Nenfant)=\"C\",\"X\",\"\")","v":{"$error":"#NAME?"}},{"$f":"IF(INDEX(periode1,NEVAL,Nenfant)=\"B\",\"X\",\"\")","v":{"$error":"#NAME?"}},{"$f":"IF(INDEX(periode1,NEVAL,Nenfant)=\"A\",\"X\",\"\")","v":{"$error":"#NAME?"}},null,{"$f":"IF(INDEX(periode2,NEVAL,Nenfant)=\"D\",\"X\",\"\")","v":{"$error":"#NAME?"}},{"$f":"IF(INDEX(periode2,NEVAL,Nenfant)=\"C\",\"X\",\"\")","v":{"$error":"#NAME?"}},{"$f":"IF(INDEX(periode2,NEVAL,Nenfant)=\"B\",\"X\",\"\")","v":{"$error":"#NAME?"}},{"$f":"IF(INDEX(periode2,NEVAL,Nenfant)=\"A\",\"X\",\"\")","v":{"$error":"#NAME?"}},null,{"$f":"IF(INDEX(periode3,NEVAL,Nenfant)=\"D\",\"X\",\"\")","v":{"$error":"#NAME?"}},{"$f":"IF(INDEX(periode3,NEVAL,Nenfant)=\"C\",\"X\",\"\")","v":{"$error":"#NAME?"}},{"$f":"IF(INDEX(periode3,NEVAL,Nenfant)=\"B\",\"X\",\"\")","v":{"$error":"#NAME?"}},{"$f":"IF(INDEX(periode3,NEVAL,Nenfant)=\"A\",\"X\",\"\")","v":{"$error":"#NAME?"}},null,{"$f":"IF(INDEX(periode4,NEVAL,Nenfant)=\"D\",\"X\",\"\")","v":{"$error":"#NAME?"}},{"$f":"IF(INDEX(periode4,NEVAL,Nenfant)=\"C\",\"X\",\"\")","v":{"$error":"#NAME?"}},{"$f":"IF(INDEX(periode4,NEVAL,Nenfant)=\"B\",\"X\",\"\")","v":{"$error":"#NAME?"}},{"$f":"IF(INDEX(periode4,NEVAL,Nenfant)=\"A\",\"X\",\"\")","v":{"$error":"#NAME?"}},null,{"$f":"IF(INDEX(periode5,NEVAL,Nenfant)=\"D\",\"X\",\"\")","v":{"$error":"#NAME?"}},{"$f":"IF(INDEX(periode5,NEVAL,Nenfant)=\"C\",\"X\",\"\")","v":{"$error":"#NAME?"}},{"$f":"IF(INDEX(periode5,NEVAL,Nenfant)=\"B\",\"X\",\"\")","v":{"$error":"#NAME?"}},{"$f":"IF(INDEX(periode5,NEVAL,Nenfant)=\"A\",\"X\",\"\")","v":{"$error":"#NAME?"}},null,{"$f":"IF(INDEX(periode6,NEVAL,Nenfant)=\"D\",\"X\",\"\")","v":{"$error":"#NAME?"}},{"$f":"IF(INDEX(periode6,NEVAL,Nenfant)=\"C\",\"X\",\"\")","v":{"$error":"#NAME?"}},{"$f":"IF(INDEX(periode6,NEVAL,Nenfant)=\"B\",\"X\",\"\")","v":{"$error":"#NAME?"}},{"$f":"IF(INDEX(periode6,NEVAL,Nenfant)=\"A\",\"X\",\"\")","v":{"$error":"#NAME?"}}]
[181,{"$nulls":7},{"$f":"COUNTIF($G187:$G189,\"X\")","v":0},{"$f":"COUNTIF($H187:$H189,\"X\")","v":0},{"$f":"COUNTIF($I188:$I189,\"X\")","v":0},{"$f":"COUNTIF($J188:$J189,\"X\")","v":0},null,{"$f":"COUNTIF($G187:$G189,\"X\")","v":0},{"$f":"COUNTIF($H187:$H189,\"X\")","v":0},{"$f":"COUNTIF($I188:$I189,\"X\")","v":0},{"$f":"COUNTIF($J188:$J189,\"X\")","v":0},null,{"$f":"COUNTIF($G187:$G189,\"X\")","v":0},{"$f":"COUNTIF($H187:$H189,\"X\")","v":0},{"$f":"COUNTIF($I188:$I189,\"X\")","v":0},{"$f":"COUNTIF($J188:$J189,\"X\")","v":0},null,{"$f":"COUNTIF($G187:$G189,\"X\")","v":0},{"$f":"COUNTIF($H187:$H189,\"X\")","v":0},{"$f":"COUNTIF($I188:$I189,\"X\")","v":0},{"$f":"COUNTIF(AA188:AA189,\"X\")","v":0},null,{"$f":"COUNTIF($G187:$G189,\"X\")","v":0},{"$f":"COUNTIF($H187:$H189,\"X\")","v":0},{"$f":"COUNTIF($I188:$I189,\"X\")","v":0},{"$f":"COUNTIF($J188:$J189,\"X\")","v":0},null,{"$f":"COUNTIF($G187:$G189,\"X\")","v":0},{"$f":"COUNTIF($H187:$H189,\"X\")","v":0},{"$f":"COUNTIF($I188:$I189,\"X\")","v":0},{"$f":"COUNTIF($J188:$J189,\"X\")","v":0}]
[182,{"$nulls":7},{"$f":"IF(INDEX(periode1,NEVAL,Nenfant)=\"D\",\"X\",\"\")","v":{"$error":"#NAME?"}},{"$f":"IF(INDEX(periode1,NEVAL,Nenfant)=\"C\",\"X\",\"\")","v":{"$error":"#NAME?"}},{"$f":"IF(INDEX(periode1,NEVAL,Nenfant)=\"B\",\"X\",\"\")","v":{"$error":"#NAME?"}},{"$f":"IF(INDEX(periode1,NEVAL,Nenfant)=\"A\",\"X\",\"\")","v":{"$error":"#NAME?"}},null,{"$f":"IF(INDEX(periode2,NEVAL,Nenfant)=\"D\",\"X\",\"\")","v":{"$error":"#NAME?"}},{"$f":"IF(INDEX(periode2,NEVAL,Nenfant)=\"C\",\"X\",\"\")","v":{"$error":"#NAME?"}},{"$f":"IF(INDEX(periode2,NEVAL,Nenfant)=\"B\",\"X\",\"\")","v":{"$error":"#NAME?"}},{"$f":"IF(INDEX(periode2,NEVAL,Nenfant)=\"A\",\"X\",\"\")","v":{"$error":"#NAME?"}},null,{"$f":"IF(INDEX(periode3,NEVAL,Nenfant)=\"D\",\"X\",\"\")","v":{"$error":"#NAME?"}},{"$f":"IF(INDEX(periode3,NEVAL,Nenfant)=\"C\",\"X\",\"\")","v":{"$error":"#NAME?"}},{"$f":"IF(INDEX(periode3,NEVAL,Nenfant)=\"B\",\"X\",\"\")","v":{"$error":"#NAME?"}},{"$f":"IF(INDEX(periode3,NEVAL,Nenfant)=\"A\",\"X\",\"\")","v":{"$error":"#NAME?"}},null,{"$f":"IF(INDEX(periode4,NEVAL,Nenfant)=\"D\",\"X\",\"\")","v":{"$error":"#NAME?"}},{"$f":"IF(INDEX(periode4,NEVAL,Nenfant)=\"C\",\"X\",\"\")","v":{"$error":"#NAME?"}},{"$f":"IF(INDEX(periode4,NEVAL,Nenfant)=\"B\",\"X\",\"\")","v":{"$error":"#NAME?"}},{"$f":"IF(INDEX(periode4,NEVAL,Nenfant)=\"A\",\"X\",\"\")","v":{"$error":"#NAME?"}},null,{"$f":"IF(INDEX(periode5,NEVAL,Nenfant)=\"D\",\"X\",\"\")","v":{"$error":"#NAME?"}},{"$f":"IF(INDEX(periode5,NEVAL,Nenfant)=\"C\",\"X\",\"\")","v":{"$error":"#NAME?"}},{"$f":"IF(INDEX(periode5,NEVAL,Nenfant)=\"B\",\"X\",\"\")","v":{"$error":"#NAME?"}},{"$f":"IF(INDEX(periode5,NEVAL,Nenfant)=\"A\",\"X\",\"\")","v":{"$error":"#NAME?"}},null,{"$f":"IF(INDEX(periode6,NEVAL,Nenfant)=\"D\",\"X\",\"\")","v":{"$error":"#NAME?"}},{"$f":"IF(INDEX(periode6,NEVAL,Nenfant)=\"C\",\"X\",\"\")","v":{"$error":"#NAME?"}},{"$f":"IF(INDEX(periode6,NEVAL,Nenfant)=\"B\",\"X\",\"\")","v":{"$error":"#NAME?"}},{"$f":"IF(INDEX(periode6,NEVAL,Nenfant)=\"A\",\"X\",\"\")","v":{"$error":"#NAME?"}}]
[183,{"$nulls":7},{"$f":"IF(INDEX(periode1,NEVAL,Nenfant)=\"D\",\"X\",\"\")","v":{"$error":"#NAME?"}},{"$f":"IF(INDEX(periode1,NEVAL,Nenfant)=\"C\",\"X\",\"\")","v":{"$error":"#NAME?"}},{"$f":"IF(INDEX(periode1,NEVAL,Nenfant)=\"B\",\"X\",\"\")","v":{"$error":"#NAME?"}},{"$f":"IF(INDEX(periode1,NEVAL,Nenfant)=\"A\",\"X\",\"\")","v":{"$error":"#NAME?"}},null,{"$f":"IF(INDEX(periode2,NEVAL,Nenfant)=\"D\",\"X\",\"\")","v":{"$error":"#NAME?"}},{"$f":"IF(INDEX(periode2,NEVAL,Nenfant)=\"C\",\"X\",\"\")","v":{"$error":"#NAME?"}},{"$f":"IF(INDEX(periode2,NEVAL,Nenfant)=\"B\",\"X\",\"\")","v":{"$error":"#NAME?"}},{"$f":"IF(INDEX(periode2,NEVAL,Nenfant)=\"A\",\"X\",\"\")","v":{"$error":"#NAME?"}},null,{"$f":"IF(INDEX(periode3,NEVAL,Nenfant)=\"D\",\"X\",\"\")","v":{"$error":"#NAME?"}},{"$f":"IF(INDEX(periode3,NEVAL,Nenfant)=\"C\",\"X\",\"\")","v":{"$error":"#NAME?"}},{"$f":"IF(INDEX(periode3,NEVAL,Nenfant)=\"B\",\"X\",\"\")","v":{"$error":"#NAME?"}},{"$f":"IF(INDEX(periode3,NEVAL,Nenfant)=\"A\",\"X\",\"\")","v":{"$error":"#NAME?"}},null,{"$f":"IF(INDEX(periode4,NEVAL,Nenfant)=\"D\",\"X\",\"\")","v":{"$error":"#NAME?"}},{"$f":"IF(INDEX(periode4,NEVAL,Nenfant)=\"C\",\"X\",\"\")","v":{"$error":"#NAME?"}},{"$f":"IF(INDEX(periode4,NEVAL,Nenfant)=\"B\",\"X\",\"\")","v":{"$error":"#NAME?"}},{"$f":"IF(INDEX(periode4,NEVAL,Nenfant)=\"A\",\"X\",\"\")","v":{"$error":"#NAME?"}},null,{"$f":"IF(INDEX(periode5,NEVAL,Nenfant)=\"D\",\"X\",\"\")","v":{"$error":"#NAME?"}},{"$f":"IF(INDEX(periode5,NEVAL,Nenfant)=\"C\",\"X\",\"\")","v":{"$error":"#NAME?"}},{"$f":"IF(INDEX(periode5,NEVAL,Nenfant)=\"B\",\"X\",\"\")","v":{"$error":"#NAME?"}},{"$f":"IF(INDEX(periode5,NEVAL,Nenfant)=\"A\",\"X\",\"\")","v":{"$error":"#NAME?"}},null,{"$f":"IF(INDEX(periode6,NEVAL,Nenfant)=\"D\",\"X\",\"\")","v":{"$error":"#NAME?"}},{"$f":"IF(INDEX(periode6,NEVAL,Nenfant)=\"C\",\"X\",\"\")","v":{"$error":"#NAME?"}},{"$f":"IF(INDEX(periode6,NEVAL,Nenfant)=\"B\",\"X\",\"\")","v":{"$error":"#NAME?"}},{"$f":"IF(INDEX(periode6,NEVAL,Nenfant)=\"A\",\"X\",\"\")","v":{"$error":"#NAME?"}}]
[184,{"$nulls":7},{"$f":"COUNTIF($G190:$G192,\"X\")","v":0},{"$f":"COUNTIF($H190:$H192,\"X\")","v":0},{"$f":"COUNTIF($I191:$I192,\"X\")","v":0},{"$f":"COUNTIF($J191:$J192,\"X\")","v":0},null,{"$f":"COUNTIF($G190:$G192,\"X\")","v":0},{"$f":"COUNTIF($H190:$H192,\"X\")","v":0},{"$f":"COUNTIF($I191:$I192,\"X\")","v":0},{"$f":"COUNTIF($J191:$J192,\"X\")","v":0},null,{"$f":"COUNTIF($G190:$G192,\"X\")","v":0},{"$f":"COUNTIF($H190:$H192,\"X\")","v":0},{"$f":"COUNTIF($I191:$I192,\"X\")","v":0},{"$f":"COUNTIF($J191:$J192,\"X\")","v":0},null,{"$f":"COUNTIF($G190:$G192,\"X\")","v":0},{"$f":"COUNTIF($H190:$H192,\"X\")","v":0},{"$f":"COUNTIF($I191:$I192,\"X\")","v":0},{"$f":"COUNTIF(AA191:AA192,\"X\")","v":0},null,{"$f":"COUNTIF($G190:$G192,\"X\")","v":0},{"$f":"COUNTIF($H190:$H192,\"X\")","v":0},{"$f":"COUNTIF($I191:$I192,\"X\")","v":0},{"$f":"COUNTIF($J191:$J192,\"X\")","v":0},null,{"$f":"COUNTIF($G190:$G192,\"X\")","v":0},{"$f":"COUNTIF($H190:$H192,\"X\")","v":0},{"$f":"COUNTIF($I191:$I192,\"X\")","v":0},{"$f":"COUNTIF($J191:$J192,\"X\")","v":0}]
[185,{"$nulls":7},{"$f":"IF(INDEX(periode1,NEVAL,Nenfant)=\"D\",\"X\",\"\")","v":{"$error":"#NAME?"}},{"$f":"IF(INDEX(periode1,NEVAL,Nenfant)=\"C\",\"X\",\"\")","v":{"$error":"#NAME?"}},{"$f":"IF(INDEX(periode1,NEVAL,Nenfant)=\"B\",\"X\",\"\")","v":{"$error":"#NAME?"}},{"$f":"IF(INDEX(periode1,NEVAL,Nenfant)=\"A\",\"X\",\"\")","v":{"$error":"#NAME?"}},null,{"$f":"IF(INDEX(periode2,NEVAL,Nenfant)=\"D\",\"X\",\"\")","v":{"$error":"#NAME?"}},{"$f":"IF(INDEX(periode2,NEVAL,Nenfant)=\"C\",\"X\",\"\")","v":{"$error":"#NAME?"}},{"$f":"IF(INDEX(periode2,NEVAL,Nenfant)=\"B\",\"X\",\"\")","v":{"$error":"#NAME?"}},{"$f":"IF(INDEX(periode2,NEVAL,Nenfant)=\"A\",\"X\",\"\")","v":{"$error":"#NAME?"}},null,{"$f":"IF(INDEX(periode3,NEVAL,Nenfant)=\"D\",\"X\",\"\")","v":{"$error":"#NAME?"}},{"$f":"IF(INDEX(periode3,NEVAL,Nenfant)=\"C\",\"X\",\"\")","v":{"$error":"#NAME?"}},{"$f":"IF(INDEX(periode3,NEVAL,Nenfant)=\"B\",\"X\",\"\")","v":{"$error":"#NAME?"}},{"$f":"IF(INDEX(periode3,NEVAL,Nenfant)=\"A\",\"X\",\"\")","v":{"$error":"#NAME?"}},null,{"$f":"IF(INDEX(periode4,NEVAL,Nenfant)=\"D\",\"X\",\"\")","v":{"$error":"#NAME?"}},{"$f":"IF(INDEX(periode4,NEVAL,Nenfant)=\"C\",\"X\",\"\")","v":{"$error":"#NAME?"}},{"$f":"IF(INDEX(periode4,NEVAL,Nenfant)=\"B\",\"X\",\"\")","v":{"$error":"#NAME?"}},{"$f":"IF(INDEX(periode4,NEVAL,Nenfant)=\"A\",\"X\",\"\")","v":{"$error":"#NAME?"}},null,{"$f":"IF(INDEX(periode5,NEVAL,Nenfant)=\"D\",\"X\",\"\")","v":{"$error":"#NAME?"}},{"$f":"IF(INDEX(periode5,NEVAL,Nenfant)=\"C\",\"X\",\"\")","v":{"$error":"#NAME?"}},{"$f":"IF(INDEX(periode5,NEVAL,Nenfant)=\"B\",\"X\",\"\")","v":{"$error":"#NAME?"}},{"$f":"IF(INDEX(periode5,NEVAL,Nenfant)=\"A\",\"X\",\"\")","v":{"$error":"#NAME?"}},null,{"$f":"IF(INDEX(periode6,NEVAL,Nenfant)=\"D\",\"X\",\"\")","v":{"$error":"#NAME?"}},{"$f":"IF(INDEX(periode6,NEVAL,Nenfant)=\"C\",\"X\",\"\")","v":{"$error":"#NAME?"}},{"$f":"IF(INDEX(periode6,NEVAL,Nenfant)=\"B\",\"X\",\"\")","v":{"$error":"#NAME?"}},{"$f":"IF(INDEX(periode6,NEVAL,Nenfant)=\"A\",\"X\",\"\")","v":{"$error":"#NAME?"}}]
[186,{"$nulls":7},{"$f":"IF(INDEX(periode1,NEVAL,Nenfant)=\"D\",\"X\",\"\")","v":{"$error":"#NAME?"}},{"$f":"IF(INDEX(periode1,NEVAL,Nenfant)=\"C\",\"X\",\"\")","v":{"$error":"#NAME?"}},{"$f":"IF(INDEX(periode1,NEVAL,Nenfant)=\"B\",\"X\",\"\")","v":{"$error":"#NAME?"}},{"$f":"IF(INDEX(periode1,NEVAL,Nenfant)=\"A\",\"X\",\"\")","v":{"$error":"#NAME?"}},null,{"$f":"IF(INDEX(periode2,NEVAL,Nenfant)=\"D\",\"X\",\"\")","v":{"$error":"#NAME?"}},{"$f":"IF(INDEX(periode2,NEVAL,Nenfant)=\"C\",\"X\",\"\")","v":{"$error":"#NAME?"}},{"$f":"IF(INDEX(periode2,NEVAL,Nenfant)=\"B\",\"X\",\"\")","v":{"$error":"#NAME?"}},{"$f":"IF(INDEX(periode2,NEVAL,Nenfant)=\"A\",\"X\",\"\")","v":{"$error":"#NAME?"}},null,{"$f":"IF(INDEX(periode3,NEVAL,Nenfant)=\"D\",\"X\",\"\")","v":{"$error":"#NAME?"}},{"$f":"IF(INDEX(periode3,NEVAL,Nenfant)=\"C\",\"X\",\"\")","v":{"$error":"#NAME?"}},{"$f":"IF(INDEX(periode3,NEVAL,Nenfant)=\"B\",\"X\",\"\")","v":{"$error":"#NAME?"}},{"$f":"IF(INDEX(periode3,NEVAL,Nenfant)=\"A\",\"X\",\"\")","v":{"$error":"#NAME?"}},null,{"$f":"IF(INDEX(periode4,NEVAL,Nenfant)=\"D\",\"X\",\"\")","v":{"$error":"#NAME?"}},{"$f":"IF(INDEX(periode4,NEVAL,Nenfant)=\"C\",\"X\",\"\")","v":{"$error":"#NAME?"}},{"$f":"IF(INDEX(periode4,NEVAL,Nenfant)=\"B\",\"X\",\"\")","v":{"$error":"#NAME?"}},{"$f":"IF(INDEX(periode4,NEVAL,Nenfant)=\"A\",\"X\",\"\")","v":{"$error":"#NAME?"}},null,{"$f":"IF(INDEX(periode5,NEVAL,Nenfant)=\"D\",\"X\",\"\")","v":{"$error":"#NAME?"}},{"$f":"IF(INDEX(periode5,NEVAL,Nenfant)=\"C\",\"X\",\"\")","v":{"$error":"#NAME?"}},{"$f":"IF(INDEX(periode5,NEVAL,Nenfant)=\"B\",\"X\",\"\")","v":{"$error":"#NAME?"}},{"$f":"IF(INDEX(periode5,NEVAL,Nenfant)=\"A\",\"X\",\"\")","v":{"$error":"#NAME?"}},null,{"$f":"IF(INDEX(periode6,NEVAL,Nenfant)=\"D\",\"X\",\"\")","v":{"$error":"#NAME?"}},{"$f":"IF(INDEX(periode6,NEVAL,Nenfant)=\"C\",\"X\",\"\")","v":{"$error":"#NAME?"}},{"$f":"IF(INDEX(periode6,NEVAL,Nenfant)=\"B\",\"X\",\"\")","v":{"$error":"#NAME?"}},{"$f":"IF(INDEX(periode6,NEVAL,Nenfant)=\"A\",\"X\",\"\")","v":{"$error":"#NAME?"}}]
[187,{"$nulls":7},{"$f":"COUNTIF($G188,\"X\")","v":0},{"$f":"COUNTIF($H188,\"X\")","v":0},{"$f":"COUNTIF($I194,\"X\")","v":0},{"$f":"COUNTIF($J194,\"X\")","v":0},null,{"$f":"COUNTIF($G188,\"X\")","v":0},{"$f":"COUNTIF($H188,\"X\")","v":0},{"$f":"COUNTIF($I194,\"X\")","v":0},{"$f":"COUNTIF($J194,\"X\")","v":0},null,{"$f":"COUNTIF($G188,\"X\")","v":0},{"$f":"COUNTIF($H188,\"X\")","v":0},{"$f":"COUNTIF($I194,\"X\")","v":0},{"$f":"COUNTIF($J194,\"X\")","v":0},null,{"$f":"COUNTIF($G188,\"X\")","v":0},{"$f":"COUNTIF($H188,\"X\")","v":0},{"$f":"COUNTIF($I194,\"X\")","v":0},{"$f":"COUNTIF(AA194,\"X\")","v":0},null,{"$f":"COUNTIF($G188,\"X\")","v":0},{"$f":"COUNTIF($H188,\"X\")","v":0},{"$f":"COUNTIF($I194,\"X\")","v":0},{"$f":"COUNTIF($J194,\"X\")","v":0},null,{"$f":"COUNTIF($G188,\"X\")","v":0},{"$f":"COUNTIF($H188,\"X\")","v":0},{"$f":"COUNTIF($I194,\"X\")","v":0},{"$f":"COUNTIF($J194,\"X\")","v":0}]
[188,{"$nulls":7},{"$f":"IF(INDEX(periode1,NEVAL,Nenfant)=\"D\",\"X\",\"\")","v":{"$error":"#NAME?"}},{"$f":"IF(INDEX(periode1,NEVAL,Nenfant)=\"C\",\"X\",\"\")","v":{"$error":"#NAME?"}},{"$f":"IF(INDEX(periode1,NEVAL,Nenfant)=\"B\",\"X\",\"\")","v":{"$error":"#NAME?"}},{"$f":"IF(INDEX(periode1,NEVAL,Nenfant)=\"A\",\"X\",\"\")","v":{"$error":"#NAME?"}},null,{"$f":"IF(INDEX(periode2,NEVAL,Nenfant)=\"D\",\"X\",\"\")","v":{"$error":"#NAME?"}},{"$f":"IF(INDEX(periode2,NEVAL,Nenfant)=\"C\",\"X\",\"\")","v":{"$error":"#NAME?"}},{"$f":"IF(INDEX(periode2,NEVAL,Nenfant)=\"B\",\"X\",\"\")","v":{"$error":"#NAME?"}},{"$f":"IF(INDEX(periode2,NEVAL,Nenfant)=\"A\",\"X\",\"\")","v":{"$error":"#NAME?"}},null,{"$f":"IF(INDEX(periode3,NEVAL,Nenfant)=\"D\",\"X\",\"\")","v":{"$error":"#NAME?"}},{"$f":"IF(INDEX(periode3,NEVAL,Nenfant)=\"C\",\"X\",\"\")","v":{"$error":"#NAME?"}},{"$f":"IF(INDEX(periode3,NEVAL,Nenfant)=\"B\",\"X\",\"\")","v":{"$error":"#NAME?"}},{"$f":"IF(INDEX(periode3,NEVAL,Nenfant)=\"A\",\"X\",\"\")","v":{"$error":"#NAME?"}},null,{"$f":"IF(INDEX(periode4,NEVAL,Nenfant)=\"D\",\"X\",\"\")","v":{"$error":"#NAME?"}},{"$f":"IF(INDEX(periode4,NEVAL,Nenfant)=\"C\",\"X\",\"\")","v":{"$error":"#NAME?"}},{"$f":"IF(INDEX(periode4,NEVAL,Nenfant)=\"B\",\"X\",\"\")","v":{"$error":"#NAME?"}},{"$f":"IF(INDEX(periode4,NEVAL,Nenfant)=\"A\",\"X\",\"\")","v":{"$error":"#NAME?"}},null,{"$f":"IF(INDEX(periode5,NEVAL,Nenfant)=\"D\",\"X\",\"\")","v":{"$error":"#NAME?"}},{"$f":"IF(INDEX(periode5,NEVAL,Nenfant)=\"C\",\"X\",\"\")","v":{"$error":"#NAME?"}},{"$f":"IF(INDEX(periode5,NEVAL,Nenfant)=\"B\",\"X\",\"\")","v":{"$error":"#NAME?"}},{"$f":"IF(INDEX(periode5,NEVAL,Nenfant)=\"A\",\"X\",\"\")","v":{"$error":"#NAME?"}},null,{"$f":"IF(INDEX(periode6,NEVAL,Nenfant)=\"D\",\"X\",\"\")","v":{"$error":"#NAME?"}},{"$f":"IF(INDEX(periode6,NEVAL,Nenfant)=\"C\",\"X\",\"\")","v":{"$error":"#NAME?"}},{"$f":"IF(INDEX(periode6,NEVAL,Nenfant)=\"B\",\"X\",\"\")","v":{"$error":"#NAME?"}},{"$f":"IF(INDEX(periode6,NEVAL,Nenfant)=\"A\",\"X\",\"\")","v":{"$error":"#NAME?"}}]
[189,{"$nulls":7},{"$f":"IF(INDEX(periode1,NEVAL,Nenfant)=\"D\",\"X\",\"\")","v":{"$error":"#NAME?"}},{"$f":"IF(INDEX(periode1,NEVAL,Nenfant)=\"C\",\"X\",\"\")","v":{"$error":"#NAME?"}},{"$f":"IF(INDEX(periode1,NEVAL,Nenfant)=\"B\",\"X\",\"\")","v":{"$error":"#NAME?"}},{"$f":"IF(INDEX(periode1,NEVAL,Nenfant)=\"A\",\"X\",\"\")","v":{"$error":"#NAME?"}},null,{"$f":"IF(INDEX(periode2,NEVAL,Nenfant)=\"D\",\"X\",\"\")","v":{"$error":"#NAME?"}},{"$f":"IF(INDEX(periode2,NEVAL,Nenfant)=\"C\",\"X\",\"\")","v":{"$error":"#NAME?"}},{"$f":"IF(INDEX(periode2,NEVAL,Nenfant)=\"B\",\"X\",\"\")","v":{"$error":"#NAME?"}},{"$f":"IF(INDEX(periode2,NEVAL,Nenfant)=\"A\",\"X\",\"\")","v":{"$error":"#NAME?"}},null,{"$f":"IF(INDEX(periode3,NEVAL,Nenfant)=\"D\",\"X\",\"\")","v":{"$error":"#NAME?"}},{"$f":"IF(INDEX(periode3,NEVAL,Nenfant)=\"C\",\"X\",\"\")","v":{"$error":"#NAME?"}},{"$f":"IF(INDEX(periode3,NEVAL,Nenfant)=\"B\",\"X\",\"\")","v":{"$error":"#NAME?"}},{"$f":"IF(INDEX(periode3,NEVAL,Nenfant)=\"A\",\"X\",\"\")","v":{"$error":"#NAME?"}},null,{"$f":"IF(INDEX(periode4,NEVAL,Nenfant)=\"D\",\"X\",\"\")","v":{"$error":"#NAME?"}},{"$f":"IF(INDEX(periode4,NEVAL,Nenfant)=\"C\",\"X\",\"\")","v":{"$error":"#NAME?"}},{"$f":"IF(INDEX(periode4,NEVAL,Nenfant)=\"B\",\"X\",\"\")","v":{"$error":"#NAME?"}},{"$f":"IF(INDEX(periode4,NEVAL,Nenfant)=\"A\",\"X\",\"\")","v":{"$error":"#NAME?"}},null,{"$f":"IF(INDEX(periode5,NEVAL,Nenfant)=\"D\",\"X\",\"\")","v":{"$error":"#NAME?"}},{"$f":"IF(INDEX(periode5,NEVAL,Nenfant)=\"C\",\"X\",\"\")","v":{"$error":"#NAME?"}},{"$f":"IF(INDEX(periode5,NEVAL,Nenfant)=\"B\",\"X\",\"\")","v":{"$error":"#NAME?"}},{"$f":"IF(INDEX(periode5,NEVAL,Nenfant)=\"A\",\"X\",\"\")","v":{"$error":"#NAME?"}},null,{"$f":"IF(INDEX(periode6,NEVAL,Nenfant)=\"D\",\"X\",\"\")","v":{"$error":"#NAME?"}},{"$f":"IF(INDEX(periode6,NEVAL,Nenfant)=\"C\",\"X\",\"\")","v":{"$error":"#NAME?"}},{"$f":"IF(INDEX(periode6,NEVAL,Nenfant)=\"B\",\"X\",\"\")","v":{"$error":"#NAME?"}},{"$f":"IF(INDEX(periode6,NEVAL,Nenfant)=\"A\",\"X\",\"\")","v":{"$error":"#NAME?"}}]
[190,{"$nulls":7},{"$f":"IF(INDEX(periode1,NEVAL,Nenfant)=\"D\",\"X\",\"\")","v":{"$error":"#NAME?"}},{"$f":"IF(INDEX(periode1,NEVAL,Nenfant)=\"C\",\"X\",\"\")","v":{"$error":"#NAME?"}},{"$f":"IF(INDEX(periode1,NEVAL,Nenfant)=\"B\",\"X\",\"\")","v":{"$error":"#NAME?"}},{"$f":"IF(INDEX(periode1,NEVAL,Nenfant)=\"A\",\"X\",\"\")","v":{"$error":"#NAME?"}},null,{"$f":"IF(INDEX(periode2,NEVAL,Nenfant)=\"D\",\"X\",\"\")","v":{"$error":"#NAME?"}},{"$f":"IF(INDEX(periode2,NEVAL,Nenfant)=\"C\",\"X\",\"\")","v":{"$error":"#NAME?"}},{"$f":"IF(INDEX(periode2,NEVAL,Nenfant)=\"B\",\"X\",\"\")","v":{"$error":"#NAME?"}},{"$f":"IF(INDEX(periode2,NEVAL,Nenfant)=\"A\",\"X\",\"\")","v":{"$error":"#NAME?"}},null,{"$f":"IF(INDEX(periode3,NEVAL,Nenfant)=\"D\",\"X\",\"\")","v":{"$error":"#NAME?"}},{"$f":"IF(INDEX(periode3,NEVAL,Nenfant)=\"C\",\"X\",\"\")","v":{"$error":"#NAME?"}},{"$f":"IF(INDEX(periode3,NEVAL,Nenfant)=\"B\",\"X\",\"\")","v":{"$error":"#NAME?"}},{"$f":"IF(INDEX(periode3,NEVAL,Nenfant)=\"A\",\"X\",\"\")","v":{"$error":"#NAME?"}},null,{"$f":"IF(INDEX(periode4,NEVAL,Nenfant)=\"D\",\"X\",\"\")","v":{"$error":"#NAME?"}},{"$f":"IF(INDEX(periode4,NEVAL,Nenfant)=\"C\",\"X\",\"\")","v":{"$error":"#NAME?"}},{"$f":"IF(INDEX(periode4,NEVAL,Nenfant)=\"B\",\"X\",\"\")","v":{"$error":"#NAME?"}},{"$f":"IF(INDEX(periode4,NEVAL,Nenfant)=\"A\",\"X\",\"\")","v":{"$error":"#NAME?"}},null,{"$f":"IF(INDEX(periode5,NEVAL,Nenfant)=\"D\",\"X\",\"\")","v":{"$error":"#NAME?"}},{"$f":"IF(INDEX(periode5,NEVAL,Nenfant)=\"C\",\"X\",\"\")","v":{"$error":"#NAME?"}},{"$f":"IF(INDEX(periode5,NEVAL,Nenfant)=\"B\",\"X\",\"\")","v":{"$error":"#NAME?"}},{"$f":"IF(INDEX(periode5,NEVAL,Nenfant)=\"A\",\"X\",\"\")","v":{"$error":"#NAME?"}},null,{"$f":"IF(INDEX(periode6,NEVAL,Nenfant)=\"D\",\"X\",\"\")","v":{"$error":"#NAME?"}},{"$f":"IF(INDEX(periode6,NEVAL,Nenfant)=\"C\",\"X\",\"\")","v":{"$error":"#NAME?"}},{"$f":"IF(INDEX(periode6,NEVAL,Nenfant)=\"B\",\"X\",\"\")","v":{"$error":"#NAME?"}},{"$f":"IF(INDEX(periode6,NEVAL,Nenfant)=\"A\",\"X\",\"\")","v":{"$error":"#NAME?"}}]
[191,{"$nulls":7},{"$f":"IF(INDEX(periode1,NEVAL,Nenfant)=\"D\",\"X\",\"\")","v":{"$error":"#NAME?"}},{"$f":"IF(INDEX(periode1,NEVAL,Nenfant)=\"C\",\"X\",\"\")","v":{"$error":"#NAME?"}},{"$f":"IF(INDEX(periode1,NEVAL,Nenfant)=\"B\",\"X\",\"\")","v":{"$error":"#NAME?"}},{"$f":"IF(INDEX(periode1,NEVAL,Nenfant)=\"A\",\"X\",\"\")","v":{"$error":"#NAME?"}},null,{"$f":"IF(INDEX(periode2,NEVAL,Nenfant)=\"D\",\"X\",\"\")","v":{"$error":"#NAME?"}},{"$f":"IF(INDEX(periode2,NEVAL,Nenfant)=\"C\",\"X\",\"\")","v":{"$error":"#NAME?"}},{"$f":"IF(INDEX(periode2,NEVAL,Nenfant)=\"B\",\"X\",\"\")","v":{"$error":"#NAME?"}},{"$f":"IF(INDEX(periode2,NEVAL,Nenfant)=\"A\",\"X\",\"\")","v":{"$error":"#NAME?"}},null,{"$f":"IF(INDEX(periode3,NEVAL,Nenfant)=\"D\",\"X\",\"\")","v":{"$error":"#NAME?"}},{"$f":"IF(INDEX(periode3,NEVAL,Nenfant)=\"C\",\"X\",\"\")","v":{"$error":"#NAME?"}},{"$f":"IF(INDEX(periode3,NEVAL,Nenfant)=\"B\",\"X\",\"\")","v":{"$error":"#NAME?"}},{"$f":"IF(INDEX(periode3,NEVAL,Nenfant)=\"A\",\"X\",\"\")","v":{"$error":"#NAME?"}},null,{"$f":"IF(INDEX(periode4,NEVAL,Nenfant)=\"D\",\"X\",\"\")","v":{"$error":"#NAME?"}},{"$f":"IF(INDEX(periode4,NEVAL,Nenfant)=\"C\",\"X\",\"\")","v":{"$error":"#NAME?"}},{"$f":"IF(INDEX(periode4,NEVAL,Nenfant)=\"B\",\"X\",\"\")","v":{"$error":"#NAME?"}},{"$f":"IF(INDEX(periode4,NEVAL,Nenfant)=\"A\",\"X\",\"\")","v":{"$error":"#NAME?"}},null,{"$f":"IF(INDEX(periode5,NEVAL,Nenfant)=\"D\",\"X\",\"\")","v":{"$error":"#NAME?"}},{"$f":"IF(INDEX(periode5,NEVAL,Nenfant)=\"C\",\"X\",\"\")","v":{"$error":"#NAME?"}},{"$f":"IF(INDEX(periode5,NEVAL,Nenfant)=\"B\",\"X\",\"\")","v":{"$error":"#NAME?"}},{"$f":"IF(INDEX(periode5,NEVAL,Nenfant)=\"A\",\"X\",\"\")","v":{"$error":"#NAME?"}},null,{"$f":"IF(INDEX(periode6,NEVAL,Nenfant)=\"D\",\"X\",\"\")","v":{"$error":"#NAME?"}},{"$f":"IF(INDEX(periode6,NEVAL,Nenfant)=\"C\",\"X\",\"\")","v":{"$error":"#NAME?"}},{"$f":"IF(INDEX(periode6,NEVAL,Nenfant)=\"B\",\"X\",\"\")","v":{"$error":"#NAME?"}},{"$f":"IF(INDEX(periode6,NEVAL,Nenfant)=\"A\",\"X\",\"\")","v":{"$error":"#NAME?"}}]
[192,{"$nulls":7},{"$f":"COUNTIF($G201:$G203,\"X\")","v":0},{"$f":"COUNTIF($H201:$H203,\"X\")","v":0},{"$f":"COUNTIF($I199:$I201,\"X\")","v":0},{"$f":"COUNTIF($J199:$J201,\"X\")","v":0},null,{"$f":"COUNTIF($G201:$G203,\"X\")","v":0},{"$f":"COUNTIF($H201:$H203,\"X\")","v":0},{"$f":"COUNTIF($I199:$I201,\"X\")","v":0},{"$f":"COUNTIF($J199:$J201,\"X\")","v":0},null,{"$f":"COUNTIF($G201:$G203,\"X\")","v":0},{"$f":"COUNTIF($H201:$H203,\"X\")","v":0},{"$f":"COUNTIF($I199:$I201,\"X\")","v":0},{"$f":"COUNTIF($J199:$J201,\"X\")","v":0},null,{"$f":"COUNTIF($G201:$G203,\"X\")","v":0},{"$f":"COUNTIF($H201:$H203,\"X\")","v":0},{"$f":"COUNTIF($I199:$I201,\"X\")","v":0},{"$f":"COUNTIF(AA199:AA201,\"X\")","v":0},null,{"$f":"COUNTIF($G201:$G203,\"X\")","v":0},{"$f":"COUNTIF($H201:$H203,\"X\")","v":0},{"$f":"COUNTIF($I199:$I201,\"X\")","v":0},{"$f":"COUNTIF($J199:$J201,\"X\")","v":0},null,{"$f":"COUNTIF($G201:$G203,\"X\")","v":0},{"$f":"COUNTIF($H201:$H203,\"X\")","v":0},{"$f":"COUNTIF($I199:$I201,\"X\")","v":0},{"$f":"COUNTIF($J199:$J201,\"X\")","v":0}]
[193,{"$nulls":7},{"$f":"IF(INDEX(periode1,NEVAL,Nenfant)=\"D\",\"X\",\"\")","v":{"$error":"#NAME?"}},{"$f":"IF(INDEX(periode1,NEVAL,Nenfant)=\"C\",\"X\",\"\")","v":{"$error":"#NAME?"}},{"$f":"IF(INDEX(periode1,NEVAL,Nenfant)=\"B\",\"X\",\"\")","v":{"$error":"#NAME?"}},{"$f":"IF(INDEX(periode1,NEVAL,Nenfant)=\"A\",\"X\",\"\")","v":{"$error":"#NAME?"}},null,{"$f":"IF(INDEX(periode2,NEVAL,Nenfant)=\"D\",\"X\",\"\")","v":{"$error":"#NAME?"}},{"$f":"IF(INDEX(periode2,NEVAL,Nenfant)=\"C\",\"X\",\"\")","v":{"$error":"#NAME?"}},{"$f":"IF(INDEX(periode2,NEVAL,Nenfant)=\"B\",\"X\",\"\")","v":{"$error":"#NAME?"}},{"$f":"IF(INDEX(periode2,NEVAL,Nenfant)=\"A\",\"X\",\"\")","v":{"$error":"#NAME?"}},null,{"$f":"IF(INDEX(periode3,NEVAL,Nenfant)=\"D\",\"X\",\"\")","v":{"$error":"#NAME?"}},{"$f":"IF(INDEX(periode3,NEVAL,Nenfant)=\"C\",\"X\",\"\")","v":{"$error":"#NAME?"}},{"$f":"IF(INDEX(periode3,NEVAL,Nenfant)=\"B\",\"X\",\"\")","v":{"$error":"#NAME?"}},{"$f":"IF(INDEX(periode3,NEVAL,Nenfant)=\"A\",\"X\",\"\")","v":{"$error":"#NAME?"}},null,{"$f":"IF(INDEX(periode4,NEVAL,Nenfant)=\"D\",\"X\",\"\")","v":{"$error":"#NAME?"}},{"$f":"IF(INDEX(periode4,NEVAL,Nenfant)=\"C\",\"X\",\"\")","v":{"$error":"#NAME?"}},{"$f":"IF(INDEX(periode4,NEVAL,Nenfant)=\"B\",\"X\",\"\")","v":{"$error":"#NAME?"}},{"$f":"IF(INDEX(periode4,NEVAL,Nenfant)=\"A\",\"X\",\"\")","v":{"$error":"#NAME?"}},null,{"$f":"IF(INDEX(periode5,NEVAL,Nenfant)=\"D\",\"X\",\"\")","v":{"$error":"#NAME?"}},{"$f":"IF(INDEX(periode5,NEVAL,Nenfant)=\"C\",\"X\",\"\")","v":{"$error":"#NAME?"}},{"$f":"IF(INDEX(periode5,NEVAL,Nenfant)=\"B\",\"X\",\"\")","v":{"$error":"#NAME?"}},{"$f":"IF(INDEX(periode5,NEVAL,Nenfant)=\"A\",\"X\",\"\")","v":{"$error":"#NAME?"}},null,{"$f":"IF(INDEX(periode6,NEVAL,Nenfant)=\"D\",\"X\",\"\")","v":{"$error":"#NAME?"}},{"$f":"IF(INDEX(periode6,NEVAL,Nenfant)=\"C\",\"X\",\"\")","v":{"$error":"#NAME?"}},{"$f":"IF(INDEX(periode6,NEVAL,Nenfant)=\"B\",\"X\",\"\")","v":{"$error":"#NAME?"}},{"$f":"IF(INDEX(periode6,NEVAL,Nenfant)=\"A\",\"X\",\"\")","v":{"$error":"#NAME?"}}]
[194,{"$nulls":7},{"$f":"IF(INDEX(periode1,NEVAL,Nenfant)=\"D\",\"X\",\"\")","v":{"$error":"#NAME?"}},{"$f":"IF(INDEX(periode1,NEVAL,Nenfant)=\"C\",\"X\",\"\")","v":{"$error":"#NAME?"}},{"$f":"IF(INDEX(periode1,NEVAL,Nenfant)=\"B\",\"X\",\"\")","v":{"$error":"#NAME?"}},{"$f":"IF(INDEX(periode1,NEVAL,Nenfant)=\"A\",\"X\",\"\")","v":{"$error":"#NAME?"}},null,{"$f":"IF(INDEX(periode2,NEVAL,Nenfant)=\"D\",\"X\",\"\")","v":{"$error":"#NAME?"}},{"$f":"IF(INDEX(periode2,NEVAL,Nenfant)=\"C\",\"X\",\"\")","v":{"$error":"#NAME?"}},{"$f":"IF(INDEX(periode2,NEVAL,Nenfant)=\"B\",\"X\",\"\")","v":{"$error":"#NAME?"}},{"$f":"IF(INDEX(periode2,NEVAL,Nenfant)=\"A\",\"X\",\"\")","v":{"$error":"#NAME?"}},null,{"$f":"IF(INDEX(periode3,NEVAL,Nenfant)=\"D\",\"X\",\"\")","v":{"$error":"#NAME?"}},{"$f":"IF(INDEX(periode3,NEVAL,Nenfant)=\"C\",\"X\",\"\")","v":{"$error":"#NAME?"}},{"$f":"IF(INDEX(periode3,NEVAL,Nenfant)=\"B\",\"X\",\"\")","v":{"$error":"#NAME?"}},{"$f":"IF(INDEX(periode3,NEVAL,Nenfant)=\"A\",\"X\",\"\")","v":{"$error":"#NAME?"}},null,{"$f":"IF(INDEX(periode4,NEVAL,Nenfant)=\"D\",\"X\",\"\")","v":{"$error":"#NAME?"}},{"$f":"IF(INDEX(periode4,NEVAL,Nenfant)=\"C\",\"X\",\"\")","v":{"$error":"#NAME?"}},{"$f":"IF(INDEX(periode4,NEVAL,Nenfant)=\"B\",\"X\",\"\")","v":{"$error":"#NAME?"}},{"$f":"IF(INDEX(periode4,NEVAL,Nenfant)=\"A\",\"X\",\"\")","v":{"$error":"#NAME?"}},null,{"$f":"IF(INDEX(periode5,NEVAL,Nenfant)=\"D\",\"X\",\"\")","v":{"$error":"#NAME?"}},{"$f":"IF(INDEX(periode5,NEVAL,Nenfant)=\"C\",\"X\",\"\")","v":{"$error":"#NAME?"}},{"$f":"IF(INDEX(periode5,NEVAL,Nenfant)=\"B\",\"X\",\"\")","v":{"$error":"#NAME?"}},{"$f":"IF(INDEX(periode5,NEVAL,Nenfant)=\"A\",\"X\",\"\")","v":{"$error":"#NAME?"}},null,{"$f":"IF(INDEX(periode6,NEVAL,Nenfant)=\"D\",\"X\",\"\")","v":{"$error":"#NAME?"}},{"$f":"IF(INDEX(periode6,NEVAL,Nenfant)=\"C\",\"X\",\"\")","v":{"$error":"#NAME?"}},{"$f":"IF(INDEX(periode6,NEVAL,Nenfant)=\"B\",\"X\",\"\")","v":{"$error":"#NAME?"}},{"$f":"IF(INDEX(periode6,NEVAL,Nenfant)=\"A\",\"X\",\"\")","v":{"$error":"#NAME?"}}]
[195,{"$nulls":7},{"$f":"IF(INDEX(periode1,NEVAL,Nenfant)=\"D\",\"X\",\"\")","v":{"$error":"#NAME?"}},{"$f":"IF(INDEX(periode1,NEVAL,Nenfant)=\"C\",\"X\",\"\")","v":{"$error":"#NAME?"}},{"$f":"IF(INDEX(periode1,NEVAL,Nenfant)=\"B\",\"X\",\"\")","v":{"$error":"#NAME?"}},{"$f":"IF(INDEX(periode1,NEVAL,Nenfant)=\"A\",\"X\",\"\")","v":{"$error":"#NAME?"}},null,{"$f":"IF(INDEX(periode2,NEVAL,Nenfant)=\"D\",\"X\",\"\")","v":{"$error":"#NAME?"}},{"$f":"IF(INDEX(periode2,NEVAL,Nenfant)=\"C\",\"X\",\"\")","v":{"$error":"#NAME?"}},{"$f":"IF(INDEX(periode2,NEVAL,Nenfant)=\"B\",\"X\",\"\")","v":{"$error":"#NAME?"}},{"$f":"IF(INDEX(periode2,NEVAL,Nenfant)=\"A\",\"X\",\"\")","v":{"$error":"#NAME?"}},null,{"$f":"IF(INDEX(periode3,NEVAL,Nenfant)=\"D\",\"X\",\"\")","v":{"$error":"#NAME?"}},{"$f":"IF(INDEX(periode3,NEVAL,Nenfant)=\"C\",\"X\",\"\")","v":{"$error":"#NAME?"}},{"$f":"IF(INDEX(periode3,NEVAL,Nenfant)=\"B\",\"X\",\"\")","v":{"$error":"#NAME?"}},{"$f":"IF(INDEX(periode3,NEVAL,Nenfant)=\"A\",\"X\",\"\")","v":{"$error":"#NAME?"}},null,{"$f":"IF(INDEX(periode4,NEVAL,Nenfant)=\"D\",\"X\",\"\")","v":{"$error":"#NAME?"}},{"$f":"IF(INDEX(periode4,NEVAL,Nenfant)=\"C\",\"X\",\"\")","v":{"$error":"#NAME?"}},{"$f":"IF(INDEX(periode4,NEVAL,Nenfant)=\"B\",\"X\",\"\")","v":{"$error":"#NAME?"}},{"$f":"IF(INDEX(periode4,NEVAL,Nenfant)=\"A\",\"X\",\"\")","v":{"$error":"#NAME?"}},null,{"$f":"IF(INDEX(periode5,NEVAL,Nenfant)=\"D\",\"X\",\"\")","v":{"$error":"#NAME?"}},{"$f":"IF(INDEX(periode5,NEVAL,Nenfant)=\"C\",\"X\",\"\")","v":{"$error":"#NAME?"}},{"$f":"IF(INDEX(periode5,NEVAL,Nenfant)=\"B\",\"X\",\"\")","v":{"$error":"#NAME?"}},{"$f":"IF(INDEX(periode5,NEVAL,Nenfant)=\"A\",\"X\",\"\")","v":{"$error":"#NAME?"}},null,{"$f":"IF(INDEX(periode6,NEVAL,Nenfant)=\"D\",\"X\",\"\")","v":{"$error":"#NAME?"}},{"$f":"IF(INDEX(periode6,NEVAL,Nenfant)=\"C\",\"X\",\"\")","v":{"$error":"#NAME?"}},{"$f":"IF(INDEX(periode6,NEVAL,Nenfant)=\"B\",\"X\",\"\")","v":{"$error":"#NAME?"}},{"$f":"IF(INDEX(periode6,NEVAL,Nenfant)=\"A\",\"X\",\"\")","v":{"$error":"#NAME?"}}]
[196,{"$nulls":7},{"$f":"COUNTIF($G205:$G207,\"X\")","v":0},{"$f":"COUNTIF($H205:$H207,\"X\")","v":0},{"$f":"COUNTIF($I203:$I205,\"X\")","v":0},{"$f":"COUNTIF($J203:$J205,\"X\")","v":0},null,{"$f":"COUNTIF($G205:$G207,\"X\")","v":0},{"$f":"COUNTIF($H205:$H207,\"X\")","v":0},{"$f":"COUNTIF($I203:$I205,\"X\")","v":0},{"$f":"COUNTIF($J203:$J205,\"X\")","v":0},null,{"$f":"COUNTIF($G205:$G207,\"X\")","v":0},{"$f":"COUNTIF($H205:$H207,\"X\")","v":0},{"$f":"COUNTIF($I203:$I205,\"X\")","v":0},{"$f":"COUNTIF($J203:$J205,\"X\")","v":0},null,{"$f":"COUNTIF($G205:$G207,\"X\")","v":0},{"$f":"COUNTIF($H205:$H207,\"X\")","v":0},{"$f":"COUNTIF($I203:$I205,\"X\")","v":0},{"$f":"COUNTIF(AA203:AA205,\"X\")","v":0},null,{"$f":"COUNTIF($G205:$G207,\"X\")","v":0},{"$f":"COUNTIF($H205:$H207,\"X\")","v":0},{"$f":"COUNTIF($I203:$I205,\"X\")","v":0},{"$f":"COUNTIF($J203:$J205,\"X\")","v":0},null,{"$f":"COUNTIF($G205:$G207,\"X\")","v":0},{"$f":"COUNTIF($H205:$H207,\"X\")","v":0},{"$f":"COUNTIF($I203:$I205,\"X\")","v":0},{"$f":"COUNTIF($J203:$J205,\"X\")","v":0}]
[197,{"$nulls":7},{"$f":"IF(INDEX(periode1,NEVAL,Nenfant)=\"D\",\"X\",\"\")","v":{"$error":"#NAME?"}},{"$f":"IF(INDEX(periode1,NEVAL,Nenfant)=\"C\",\"X\",\"\")","v":{"$error":"#NAME?"}},{"$f":"IF(INDEX(periode1,NEVAL,Nenfant)=\"B\",\"X\",\"\")","v":{"$error":"#NAME?"}},{"$f":"IF(INDEX(periode1,NEVAL,Nenfant)=\"A\",\"X\",\"\")","v":{"$error":"#NAME?"}},null,{"$f":"IF(INDEX(periode2,NEVAL,Nenfant)=\"D\",\"X\",\"\")","v":{"$error":"#NAME?"}},{"$f":"IF(INDEX(periode2,NEVAL,Nenfant)=\"C\",\"X\",\"\")","v":{"$error":"#NAME?"}},{"$f":"IF(INDEX(periode2,NEVAL,Nenfant)=\"B\",\"X\",\"\")","v":{"$error":"#NAME?"}},{"$f":"IF(INDEX(periode2,NEVAL,Nenfant)=\"A\",\"X\",\"\")","v":{"$error":"#NAME?"}},null,{"$f":"IF(INDEX(periode3,NEVAL,Nenfant)=\"D\",\"X\",\"\")","v":{"$error":"#NAME?"}},{"$f":"IF(INDEX(periode3,NEVAL,Nenfant)=\"C\",\"X\",\"\")","v":{"$error":"#NAME?"}},{"$f":"IF(INDEX(periode3,NEVAL,Nenfant)=\"B\",\"X\",\"\")","v":{"$error":"#NAME?"}},{"$f":"IF(INDEX(periode3,NEVAL,Nenfant)=\"A\",\"X\",\"\")","v":{"$error":"#NAME?"}},null,{"$f":"IF(INDEX(periode4,NEVAL,Nenfant)=\"D\",\"X\",\"\")","v":{"$error":"#NAME?"}},{"$f":"IF(INDEX(periode4,NEVAL,Nenfant)=\"C\",\"X\",\"\")","v":{"$error":"#NAME?"}},{"$f":"IF(INDEX(periode4,NEVAL,Nenfant)=\"B\",\"X\",\"\")","v":{"$error":"#NAME?"}},{"$f":"IF(INDEX(periode4,NEVAL,Nenfant)=\"A\",\"X\",\"\")","v":{"$error":"#NAME?"}},null,{"$f":"IF(INDEX(periode5,NEVAL,Nenfant)=\"D\",\"X\",\"\")","v":{"$error":"#NAME?"}},{"$f":"IF(INDEX(periode5,NEVAL,Nenfant)=\"C\",\"X\",\"\")","v":{"$error":"#NAME?"}},{"$f":"IF(INDEX(periode5,NEVAL,Nenfant)=\"B\",\"X\",\"\")","v":{"$error":"#NAME?"}},{"$f":"IF(INDEX(periode5,NEVAL,Nenfant)=\"A\",\"X\",\"\")","v":{"$error":"#NAME?"}},null,{"$f":"IF(INDEX(periode6,NEVAL,Nenfant)=\"D\",\"X\",\"\")","v":{"$error":"#NAME?"}},{"$f":"IF(INDEX(periode6,NEVAL,Nenfant)=\"C\",\"X\",\"\")","v":{"$error":"#NAME?"}},{"$f":"IF(INDEX(periode6,NEVAL,Nenfant)=\"B\",\"X\",\"\")","v":{"$error":"#NAME?"}},{"$f":"IF(INDEX(periode6,NEVAL,Nenfant)=\"A\",\"X\",\"\")","v":{"$error":"#NAME?"}}]
[198,{"$nulls":7},{"$f":"IF(INDEX(periode1,NEVAL,Nenfant)=\"D\",\"X\",\"\")","v":{"$error":"#NAME?"}},{"$f":"IF(INDEX(periode1,NEVAL,Nenfant)=\"C\",\"X\",\"\")","v":{"$error":"#NAME?"}},{"$f":"IF(INDEX(periode1,NEVAL,Nenfant)=\"B\",\"X\",\"\")","v":{"$error":"#NAME?"}},{"$f":"IF(INDEX(periode1,NEVAL,Nenfant)=\"A\",\"X\",\"\")","v":{"$error":"#NAME?"}},null,{"$f":"IF(INDEX(periode2,NEVAL,Nenfant)=\"D\",\"X\",\"\")","v":{"$error":"#NAME?"}},{"$f":"IF(INDEX(periode2,NEVAL,Nenfant)=\"C\",\"X\",\"\")","v":{"$error":"#NAME?"}},{"$f":"IF(INDEX(periode2,NEVAL,Nenfant)=\"B\",\"X\",\"\")","v":{"$error":"#NAME?"}},{"$f":"IF(INDEX(periode2,NEVAL,Nenfant)=\"A\",\"X\",\"\")","v":{"$error":"#NAME?"}},null,{"$f":"IF(INDEX(periode3,NEVAL,Nenfant)=\"D\",\"X\",\"\")","v":{"$error":"#NAME?"}},{"$f":"IF(INDEX(periode3,NEVAL,Nenfant)=\"C\",\"X\",\"\")","v":{"$error":"#NAME?"}},{"$f":"IF(INDEX(periode3,NEVAL,Nenfant)=\"B\",\"X\",\"\")","v":{"$error":"#NAME?"}},{"$f":"IF(INDEX(periode3,NEVAL,Nenfant)=\"A\",\"X\",\"\")","v":{"$error":"#NAME?"}},null,{"$f":"IF(INDEX(periode4,NEVAL,Nenfant)=\"D\",\"X\",\"\")","v":{"$error":"#NAME?"}},{"$f":"IF(INDEX(periode4,NEVAL,Nenfant)=\"C\",\"X\",\"\")","v":{"$error":"#NAME?"}},{"$f":"IF(INDEX(periode4,NEVAL,Nenfant)=\"B\",\"X\",\"\")","v":{"$error":"#NAME?"}},{"$f":"IF(INDEX(periode4,NEVAL,Nenfant)=\"A\",\"X\",\"\")","v":{"$error":"#NAME?"}},null,{"$f":"IF(INDEX(periode5,NEVAL,Nenfant)=\"D\",\"X\",\"\")","v":{"$error":"#NAME?"}},{"$f":"IF(INDEX(periode5,NEVAL,Nenfant)=\"C\",\"X\",\"\")","v":{"$error":"#NAME?"}},{"$f":"IF(INDEX(periode5,NEVAL,Nenfant)=\"B\",\"X\",\"\")","v":{"$error":"#NAME?"}},{"$f":"IF(INDEX(periode5,NEVAL,Nenfant)=\"A\",\"X\",\"\")","v":{"$error":"#NAME?"}},null,{"$f":"IF(INDEX(periode6,NEVAL,Nenfant)=\"D\",\"X\",\"\")","v":{"$error":"#NAME?"}},{"$f":"IF(INDEX(periode6,NEVAL,Nenfant)=\"C\",\"X\",\"\")","v":{"$error":"#NAME?"}},{"$f":"IF(INDEX(periode6,NEVAL,Nenfant)=\"B\",\"X\",\"\")","v":{"$error":"#NAME?"}},{"$f":"IF(INDEX(periode6,NEVAL,Nenfant)=\"A\",\"X\",\"\")","v":{"$error":"#NAME?"}}]
[199,{"$nulls":7},{"$f":"IF(INDEX(periode1,NEVAL,Nenfant)=\"D\",\"X\",\"\")","v":{"$error":"#NAME?"}},{"$f":"IF(INDEX(periode1,NEVAL,Nenfant)=\"C\",\"X\",\"\")","v":{"$error":"#NAME?"}},{"$f":"IF(INDEX(periode1,NEVAL,Nenfant)=\"B\",\"X\",\"\")","v":{"$error":"#NAME?"}},{"$f":"IF(INDEX(periode1,NEVAL,Nenfant)=\"A\",\"X\",\"\")","v":{"$error":"#NAME?"}},null,{"$f":"IF(INDEX(periode2,NEVAL,Nenfant)=\"D\",\"X\",\"\")","v":{"$error":"#NAME?"}},{"$f":"IF(INDEX(periode2,NEVAL,Nenfant)=\"C\",\"X\",\"\")","v":{"$error":"#NAME?"}},{"$f":"IF(INDEX(periode2,NEVAL,Nenfant)=\"B\",\"X\",\"\")","v":{"$error":"#NAME?"}},{"$f":"IF(INDEX(periode2,NEVAL,Nenfant)=\"A\",\"X\",\"\")","v":{"$error":"#NAME?"}},null,{"$f":"IF(INDEX(periode3,NEVAL,Nenfant)=\"D\",\"X\",\"\")","v":{"$error":"#NAME?"}},{"$f":"IF(INDEX(periode3,NEVAL,Nenfant)=\"C\",\"X\",\"\")","v":{"$error":"#NAME?"}},{"$f":"IF(INDEX(periode3,NEVAL,Nenfant)=\"B\",\"X\",\"\")","v":{"$error":"#NAME?"}},{"$f":"IF(INDEX(periode3,NEVAL,Nenfant)=\"A\",\"X\",\"\")","v":{"$error":"#NAME?"}},null,{"$f":"IF(INDEX(periode4,NEVAL,Nenfant)=\"D\",\"X\",\"\")","v":{"$error":"#NAME?"}},{"$f":"IF(INDEX(periode4,NEVAL,Nenfant)=\"C\",\"X\",\"\")","v":{"$error":"#NAME?"}},{"$f":"IF(INDEX(periode4,NEVAL,Nenfant)=\"B\",\"X\",\"\")","v":{"$error":"#NAME?"}},{"$f":"IF(INDEX(periode4,NEVAL,Nenfant)=\"A\",\"X\",\"\")","v":{"$error":"#NAME?"}},null,{"$f":"IF(INDEX(periode5,NEVAL,Nenfant)=\"D\",\"X\",\"\")","v":{"$error":"#NAME?"}},{"$f":"IF(INDEX(periode5,NEVAL,Nenfant)=\"C\",\"X\",\"\")","v":{"$error":"#NAME?"}},{"$f":"IF(INDEX(periode5,NEVAL,Nenfant)=\"B\",\"X\",\"\")","v":{"$error":"#NAME?"}},{"$f":"IF(INDEX(periode5,NEVAL,Nenfant)=\"A\",\"X\",\"\")","v":{"$error":"#NAME?"}},null,{"$f":"IF(INDEX(periode6,NEVAL,Nenfant)=\"D\",\"X\",\"\")","v":{"$error":"#NAME?"}},{"$f":"IF(INDEX(periode6,NEVAL,Nenfant)=\"C\",\"X\",\"\")","v":{"$error":"#NAME?"}},{"$f":"IF(INDEX(periode6,NEVAL,Nenfant)=\"B\",\"X\",\"\")","v":{"$error":"#NAME?"}},{"$f":"IF(INDEX(periode6,NEVAL,Nenfant)=\"A\",\"X\",\"\")","v":{"$error":"#NAME?"}}]
[200,{"$nulls":7},{"$f":"COUNTIF($G201,\"X\")","v":0},{"$f":"COUNTIF($H201,\"X\")","v":0},{"$f":"COUNTIF($I207,\"X\")","v":0},{"$f":"COUNTIF($J207,\"X\")","v":0},null,{"$f":"COUNTIF($G201,\"X\")","v":0},{"$f":"COUNTIF($H201,\"X\")","v":0},{"$f":"COUNTIF($I207,\"X\")","v":0},{"$f":"COUNTIF($J207,\"X\")","v":0},null,{"$f":"COUNTIF($G201,\"X\")","v":0},{"$f":"COUNTIF($H201,\"X\")","v":0},{"$f":"COUNTIF($I207,\"X\")","v":0},{"$f":"COUNTIF($J207,\"X\")","v":0},null,{"$f":"COUNTIF($G201,\"X\")","v":0},{"$f":"COUNTIF($H201,\"X\")","v":0},{"$f":"COUNTIF($I207,\"X\")","v":0},{"$f":"COUNTIF(AA207,\"X\")","v":0},null,{"$f":"COUNTIF($G201,\"X\")","v":0},{"$f":"COUNTIF($H201,\"X\")","v":0},{"$f":"COUNTIF($I207,\"X\")","v":0},{"$f":"COUNTIF($J207,\"X\")","v":0},null,{"$f":"COUNTIF($G201,\"X\")","v":0},{"$f":"COUNTIF($H201,\"X\")","v":0},{"$f":"COUNTIF($I207,\"X\")","v":0},{"$f":"COUNTIF($J207,\"X\")","v":0}]
[201,{"$nulls":7},{"$f":"IF(INDEX(periode1,NEVAL,Nenfant)=\"D\",\"X\",\"\")","v":{"$error":"#NAME?"}},{"$f":"IF(INDEX(periode1,NEVAL,Nenfant)=\"C\",\"X\",\"\")","v":{"$error":"#NAME?"}},{"$f":"IF(INDEX(periode1,NEVAL,Nenfant)=\"B\",\"X\",\"\")","v":{"$error":"#NAME?"}},{"$f":"IF(INDEX(periode1,NEVAL,Nenfant)=\"A\",\"X\",\"\")","v":{"$error":"#NAME?"}},null,{"$f":"IF(INDEX(periode2,NEVAL,Nenfant)=\"D\",\"X\",\"\")","v":{"$error":"#NAME?"}},{"$f":"IF(INDEX(periode2,NEVAL,Nenfant)=\"C\",\"X\",\"\")","v":{"$error":"#NAME?"}},{"$f":"IF(INDEX(periode2,NEVAL,Nenfant)=\"B\",\"X\",\"\")","v":{"$error":"#NAME?"}},{"$f":"IF(INDEX(periode2,NEVAL,Nenfant)=\"A\",\"X\",\"\")","v":{"$error":"#NAME?"}},null,{"$f":"IF(INDEX(periode3,NEVAL,Nenfant)=\"D\",\"X\",\"\")","v":{"$error":"#NAME?"}},{"$f":"IF(INDEX(periode3,NEVAL,Nenfant)=\"C\",\"X\",\"\")","v":{"$error":"#NAME?"}},{"$f":"IF(INDEX(periode3,NEVAL,Nenfant)=\"B\",\"X\",\"\")","v":{"$error":"#NAME?"}},{"$f":"IF(INDEX(periode3,NEVAL,Nenfant)=\"A\",\"X\",\"\")","v":{"$error":"#NAME?"}},null,{"$f":"IF(INDEX(periode4,NEVAL,Nenfant)=\"D\",\"X\",\"\")","v":{"$error":"#NAME?"}},{"$f":"IF(INDEX(periode4,NEVAL,Nenfant)=\"C\",\"X\",\"\")","v":{"$error":"#NAME?"}},{"$f":"IF(INDEX(periode4,NEVAL,Nenfant)=\"B\",\"X\",\"\")","v":{"$error":"#NAME?"}},{"$f":"IF(INDEX(periode4,NEVAL,Nenfant)=\"A\",\"X\",\"\")","v":{"$error":"#NAME?"}},null,{"$f":"IF(INDEX(periode5,NEVAL,Nenfant)=\"D\",\"X\",\"\")","v":{"$error":"#NAME?"}},{"$f":"IF(INDEX(periode5,NEVAL,Nenfant)=\"C\",\"X\",\"\")","v":{"$error":"#NAME?"}},{"$f":"IF(INDEX(periode5,NEVAL,Nenfant)=\"B\",\"X\",\"\")","v":{"$error":"#NAME?"}},{"$f":"IF(INDEX(periode5,NEVAL,Nenfant)=\"A\",\"X\",\"\")","v":{"$error":"#NAME?"}},null,{"$f":"IF(INDEX(periode6,NEVAL,Nenfant)=\"D\",\"X\",\"\")","v":{"$error":"#NAME?"}},{"$f":"IF(INDEX(periode6,NEVAL,Nenfant)=\"C\",\"X\",\"\")","v":{"$error":"#NAME?"}},{"$f":"IF(INDEX(periode6,NEVAL,Nenfant)=\"B\",\"X\",\"\")","v":{"$error":"#NAME?"}},{"$f":"IF(INDEX(periode6,NEVAL,Nenfant)=\"A\",\"X\",\"\")","v":{"$error":"#NAME?"}}]
[202,{"$nulls":7},{"$f":"IF(INDEX(periode1,NEVAL,Nenfant)=\"D\",\"X\",\"\")","v":{"$error":"#NAME?"}},{"$f":"IF(INDEX(periode1,NEVAL,Nenfant)=\"C\",\"X\",\"\")","v":{"$error":"#NAME?"}},{"$f":"IF(INDEX(periode1,NEVAL,Nenfant)=\"B\",\"X\",\"\")","v":{"$error":"#NAME?"}},{"$f":"IF(INDEX(periode1,NEVAL,Nenfant)=\"A\",\"X\",\"\")","v":{"$error":"#NAME?"}},null,{"$f":"IF(INDEX(periode2,NEVAL,Nenfant)=\"D\",\"X\",\"\")","v":{"$error":"#NAME?"}},{"$f":"IF(INDEX(periode2,NEVAL,Nenfant)=\"C\",\"X\",\"\")","v":{"$error":"#NAME?"}},{"$f":"IF(INDEX(periode2,NEVAL,Nenfant)=\"B\",\"X\",\"\")","v":{"$error":"#NAME?"}},{"$f":"IF(INDEX(periode2,NEVAL,Nenfant)=\"A\",\"X\",\"\")","v":{"$error":"#NAME?"}},null,{"$f":"IF(INDEX(periode3,NEVAL,Nenfant)=\"D\",\"X\",\"\")","v":{"$error":"#NAME?"}},{"$f":"IF(INDEX(periode3,NEVAL,Nenfant)=\"C\",\"X\",\"\")","v":{"$error":"#NAME?"}},{"$f":"IF(INDEX(periode3,NEVAL,Nenfant)=\"B\",\"X\",\"\")","v":{"$error":"#NAME?"}},{"$f":"IF(INDEX(periode3,NEVAL,Nenfant)=\"A\",\"X\",\"\")","v":{"$error":"#NAME?"}},null,{"$f":"IF(INDEX(periode4,NEVAL,Nenfant)=\"D\",\"X\",\"\")","v":{"$error":"#NAME?"}},{"$f":"IF(INDEX(periode4,NEVAL,Nenfant)=\"C\",\"X\",\"\")","v":{"$error":"#NAME?"}},{"$f":"IF(INDEX(periode4,NEVAL,Nenfant)=\"B\",\"X\",\"\")","v":{"$error":"#NAME?"}},{"$f":"IF(INDEX(periode4,NEVAL,Nenfant)=\"A\",\"X\",\"\")","v":{"$error":"#NAME?"}},null,{"$f":"IF(INDEX(periode5,NEVAL,Nenfant)=\"D\",\"X\",\"\")","v":{"$error":"#NAME?"}},{"$f":"IF(INDEX(periode5,NEVAL,Nenfant)=\"C\",\"X\",\"\")","v":{"$error":"#NAME?"}},{"$f":"IF(INDEX(periode5,NEVAL,Nenfant)=\"B\",\"X\",\"\")","v":{"$error":"#NAME?"}},{"$f":"IF(INDEX(periode5,NEVAL,Nenfant)=\"A\",\"X\",\"\")","v":{"$error":"#NAME?"}},null,{"$f":"IF(INDEX(periode6,NEVAL,Nenfant)=\"D\",\"X\",\"\")","v":{"$error":"#NAME?"}},{"$f":"IF(INDEX(periode6,NEVAL,Nenfant)=\"C\",\"X\",\"\")","v":{"$error":"#NAME?"}},{"$f":"IF(INDEX(periode6,NEVAL,Nenfant)=\"B\",\"X\",\"\")","v":{"$error":"#NAME?"}},{"$f":"IF(INDEX(periode6,NEVAL,Nenfant)=\"A\",\"X\",\"\")","v":{"$error":"#NAME?"}}]
[203,{"$nulls":7},{"$f":"IF(INDEX(periode1,NEVAL,Nenfant)=\"D\",\"X\",\"\")","v":{"$error":"#NAME?"}},{"$f":"IF(INDEX(periode1,NEVAL,Nenfant)=\"C\",\"X\",\"\")","v":{"$error":"#NAME?"}},{"$f":"IF(INDEX(periode1,NEVAL,Nenfant)=\"B\",\"X\",\"\")","v":{"$error":"#NAME?"}},{"$f":"IF(INDEX(periode1,NEVAL,Nenfant)=\"A\",\"X\",\"\")","v":{"$error":"#NAME?"}},null,{"$f":"IF(INDEX(periode2,NEVAL,Nenfant)=\"D\",\"X\",\"\")","v":{"$error":"#NAME?"}},{"$f":"IF(INDEX(periode2,NEVAL,Nenfant)=\"C\",\"X\",\"\")","v":{"$error":"#NAME?"}},{"$f":"IF(INDEX(periode2,NEVAL,Nenfant)=\"B\",\"X\",\"\")","v":{"$error":"#NAME?"}},{"$f":"IF(INDEX(periode2,NEVAL,Nenfant)=\"A\",\"X\",\"\")","v":{"$error":"#NAME?"}},null,{"$f":"IF(INDEX(periode3,NEVAL,Nenfant)=\"D\",\"X\",\"\")","v":{"$error":"#NAME?"}},{"$f":"IF(INDEX(periode3,NEVAL,Nenfant)=\"C\",\"X\",\"\")","v":{"$error":"#NAME?"}},{"$f":"IF(INDEX(periode3,NEVAL,Nenfant)=\"B\",\"X\",\"\")","v":{"$error":"#NAME?"}},{"$f":"IF(INDEX(periode3,NEVAL,Nenfant)=\"A\",\"X\",\"\")","v":{"$error":"#NAME?"}},null,{"$f":"IF(INDEX(periode4,NEVAL,Nenfant)=\"D\",\"X\",\"\")","v":{"$error":"#NAME?"}},{"$f":"IF(INDEX(periode4,NEVAL,Nenfant)=\"C\",\"X\",\"\")","v":{"$error":"#NAME?"}},{"$f":"IF(INDEX(periode4,NEVAL,Nenfant)=\"B\",\"X\",\"\")","v":{"$error":"#NAME?"}},{"$f":"IF(INDEX(periode4,NEVAL,Nenfant)=\"A\",\"X\",\"\")","v":{"$error":"#NAME?"}},null,{"$f":"IF(INDEX(periode5,NEVAL,Nenfant)=\"D\",\"X\",\"\")","v":{"$error":"#NAME?"}},{"$f":"IF(INDEX(periode5,NEVAL,Nenfant)=\"C\",\"X\",\"\")","v":{"$error":"#NAME?"}},{"$f":"IF(INDEX(periode5,NEVAL,Nenfant)=\"B\",\"X\",\"\")","v":{"$error":"#NAME?"}},{"$f":"IF(INDEX(periode5,NEVAL,Nenfant)=\"A\",\"X\",\"\")","v":{"$error":"#NAME?"}},null,{"$f":"IF(INDEX(periode6,NEVAL,Nenfant)=\"D\",\"X\",\"\")","v":{"$error":"#NAME?"}},{"$f":"IF(INDEX(periode6,NEVAL,Nenfant)=\"C\",\"X\",\"\")","v":{"$error":"#NAME?"}},{"$f":"IF(INDEX(periode6,NEVAL,Nenfant)=\"B\",\"X\",\"\")","v":{"$error":"#NAME?"}},{"$f":"IF(INDEX(periode6,NEVAL,Nenfant)=\"A\",\"X\",\"\")","v":{"$error":"#NAME?"}}]
[204,{"$nulls":7},{"$f":"IF(INDEX(periode1,NEVAL,Nenfant)=\"D\",\"X\",\"\")","v":{"$error":"#NAME?"}},{"$f":"IF(INDEX(periode1,NEVAL,Nenfant)=\"C\",\"X\",\"\")","v":{"$error":"#NAME?"}},{"$f":"IF(INDEX(periode1,NEVAL,Nenfant)=\"B\",\"X\",\"\")","v":{"$error":"#NAME?"}},{"$f":"IF(INDEX(periode1,NEVAL,Nenfant)=\"A\",\"X\",\"\")","v":{"$error":"#NAME?"}},null,{"$f":"IF(INDEX(periode2,NEVAL,Nenfant)=\"D\",\"X\",\"\")","v":{"$error":"#NAME?"}},{"$f":"IF(INDEX(periode2,NEVAL,Nenfant)=\"C\",\"X\",\"\")","v":{"$error":"#NAME?"}},{"$f":"IF(INDEX(periode2,NEVAL,Nenfant)=\"B\",\"X\",\"\")","v":{"$error":"#NAME?"}},{"$f":"IF(INDEX(periode2,NEVAL,Nenfant)=\"A\",\"X\",\"\")","v":{"$error":"#NAME?"}},null,{"$f":"IF(INDEX(periode3,NEVAL,Nenfant)=\"D\",\"X\",\"\")","v":{"$error":"#NAME?"}},{"$f":"IF(INDEX(periode3,NEVAL,Nenfant)=\"C\",\"X\",\"\")","v":{"$error":"#NAME?"}},{"$f":"IF(INDEX(periode3,NEVAL,Nenfant)=\"B\",\"X\",\"\")","v":{"$error":"#NAME?"}},{"$f":"IF(INDEX(periode3,NEVAL,Nenfant)=\"A\",\"X\",\"\")","v":{"$error":"#NAME?"}},null,{"$f":"IF(INDEX(periode4,NEVAL,Nenfant)=\"D\",\"X\",\"\")","v":{"$error":"#NAME?"}},{"$f":"IF(INDEX(periode4,NEVAL,Nenfant)=\"C\",\"X\",\"\")","v":{"$error":"#NAME?"}},{"$f":"IF(INDEX(periode4,NEVAL,Nenfant)=\"B\",\"X\",\"\")","v":{"$error":"#NAME?"}},{"$f":"IF(INDEX(periode4,NEVAL,Nenfant)=\"A\",\"X\",\"\")","v":{"$error":"#NAME?"}},null,{"$f":"IF(INDEX(periode5,NEVAL,Nenfant)=\"D\",\"X\",\"\")","v":{"$error":"#NAME?"}},{"$f":"IF(INDEX(periode5,NEVAL,Nenfant)=\"C\",\"X\",\"\")","v":{"$error":"#NAME?"}},{"$f":"IF(INDEX(periode5,NEVAL,Nenfant)=\"B\",\"X\",\"\")","v":{"$error":"#NAME?"}},{"$f":"IF(INDEX(periode5,NEVAL,Nenfant)=\"A\",\"X\",\"\")","v":{"$error":"#NAME?"}},null,{"$f":"IF(INDEX(periode6,NEVAL,Nenfant)=\"D\",\"X\",\"\")","v":{"$error":"#NAME?"}},{"$f":"IF(INDEX(periode6,NEVAL,Nenfant)=\"C\",\"X\",\"\")","v":{"$error":"#NAME?"}},{"$f":"IF(INDEX(periode6,NEVAL,Nenfant)=\"B\",\"X\",\"\")","v":{"$error":"#NAME?"}},{"$f":"IF(INDEX(periode6,NEVAL,Nenfant)=\"A\",\"X\",\"\")","v":{"$error":"#NAME?"}}]
[205,{"$nulls":7},{"$f":"COUNTIF($G214:$G216,\"X\")","v":0},{"$f":"COUNTIF($H214:$H216,\"X\")","v":0},{"$f":"COUNTIF($I212:$I214,\"X\")","v":0},{"$f":"COUNTIF($J212:$J214,\"X\")","v":0},null,{"$f":"COUNTIF($G214:$G216,\"X\")","v":0},{"$f":"COUNTIF($H214:$H216,\"X\")","v":0},{"$f":"COUNTIF($I212:$I214,\"X\")","v":0},{"$f":"COUNTIF($J212:$J214,\"X\")","v":0},null,{"$f":"COUNTIF($G214:$G216,\"X\")","v":0},{"$f":"COUNTIF($H214:$H216,\"X\")","v":0},{"$f":"COUNTIF($I212:$I214,\"X\")","v":0},{"$f":"COUNTIF($J212:$J214,\"X\")","v":0},null,{"$f":"COUNTIF($G214:$G216,\"X\")","v":0},{"$f":"COUNTIF($H214:$H216,\"X\")","v":0},{"$f":"COUNTIF($I212:$I214,\"X\")","v":0},{"$f":"COUNTIF(AA212:AA214,\"X\")","v":0},null,{"$f":"COUNTIF($G214:$G216,\"X\")","v":0},{"$f":"COUNTIF($H214:$H216,\"X\")","v":0},{"$f":"COUNTIF($I212:$I214,\"X\")","v":0},{"$f":"COUNTIF($J212:$J214,\"X\")","v":0},null,{"$f":"COUNTIF($G214:$G216,\"X\")","v":0},{"$f":"COUNTIF($H214:$H216,\"X\")","v":0},{"$f":"COUNTIF($I212:$I214,\"X\")","v":0},{"$f":"COUNTIF($J212:$J214,\"X\")","v":0}]
[206,{"$nulls":7},{"$f":"IF(INDEX(periode1,NEVAL,Nenfant)=\"D\",\"X\",\"\")","v":{"$error":"#NAME?"}},{"$f":"IF(INDEX(periode1,NEVAL,Nenfant)=\"C\",\"X\",\"\")","v":{"$error":"#NAME?"}},{"$f":"IF(INDEX(periode1,NEVAL,Nenfant)=\"B\",\"X\",\"\")","v":{"$error":"#NAME?"}},{"$f":"IF(INDEX(periode1,NEVAL,Nenfant)=\"A\",\"X\",\"\")","v":{"$error":"#NAME?"}},null,{"$f":"IF(INDEX(periode2,NEVAL,Nenfant)=\"D\",\"X\",\"\")","v":{"$error":"#NAME?"}},{"$f":"IF(INDEX(periode2,NEVAL,Nenfant)=\"C\",\"X\",\"\")","v":{"$error":"#NAME?"}},{"$f":"IF(INDEX(periode2,NEVAL,Nenfant)=\"B\",\"X\",\"\")","v":{"$error":"#NAME?"}},{"$f":"IF(INDEX(periode2,NEVAL,Nenfant)=\"A\",\"X\",\"\")","v":{"$error":"#NAME?"}},null,{"$f":"IF(INDEX(periode3,NEVAL,Nenfant)=\"D\",\"X\",\"\")","v":{"$error":"#NAME?"}},{"$f":"IF(INDEX(periode3,NEVAL,Nenfant)=\"C\",\"X\",\"\")","v":{"$error":"#NAME?"}},{"$f":"IF(INDEX(periode3,NEVAL,Nenfant)=\"B\",\"X\",\"\")","v":{"$error":"#NAME?"}},{"$f":"IF(INDEX(periode3,NEVAL,Nenfant)=\"A\",\"X\",\"\")","v":{"$error":"#NAME?"}},null,{"$f":"IF(INDEX(periode4,NEVAL,Nenfant)=\"D\",\"X\",\"\")","v":{"$error":"#NAME?"}},{"$f":"IF(INDEX(periode4,NEVAL,Nenfant)=\"C\",\"X\",\"\")","v":{"$error":"#NAME?"}},{"$f":"IF(INDEX(periode4,NEVAL,Nenfant)=\"B\",\"X\",\"\")","v":{"$error":"#NAME?"}},{"$f":"IF(INDEX(periode4,NEVAL,Nenfant)=\"A\",\"X\",\"\")","v":{"$error":"#NAME?"}},null,{"$f":"IF(INDEX(periode5,NEVAL,Nenfant)=\"D\",\"X\",\"\")","v":{"$error":"#NAME?"}},{"$f":"IF(INDEX(periode5,NEVAL,Nenfant)=\"C\",\"X\",\"\")","v":{"$error":"#NAME?"}},{"$f":"IF(INDEX(periode5,NEVAL,Nenfant)=\"B\",\"X\",\"\")","v":{"$error":"#NAME?"}},{"$f":"IF(INDEX(periode5,NEVAL,Nenfant)=\"A\",\"X\",\"\")","v":{"$error":"#NAME?"}},null,{"$f":"IF(INDEX(periode6,NEVAL,Nenfant)=\"D\",\"X\",\"\")","v":{"$error":"#NAME?"}},{"$f":"IF(INDEX(periode6,NEVAL,Nenfant)=\"C\",\"X\",\"\")","v":{"$error":"#NAME?"}},{"$f":"IF(INDEX(periode6,NEVAL,Nenfant)=\"B\",\"X\",\"\")","v":{"$error":"#NAME?"}},{"$f":"IF(INDEX(periode6,NEVAL,Nenfant)=\"A\",\"X\",\"\")","v":{"$error":"#NAME?"}}]
[207,{"$nulls":7},{"$f":"IF(INDEX(periode1,NEVAL,Nenfant)=\"D\",\"X\",\"\")","v":{"$error":"#NAME?"}},{"$f":"IF(INDEX(periode1,NEVAL,Nenfant)=\"C\",\"X\",\"\")","v":{"$error":"#NAME?"}},{"$f":"IF(INDEX(periode1,NEVAL,Nenfant)=\"B\",\"X\",\"\")","v":{"$error":"#NAME?"}},{"$f":"IF(INDEX(periode1,NEVAL,Nenfant)=\"A\",\"X\",\"\")","v":{"$error":"#NAME?"}},null,{"$f":"IF(INDEX(periode2,NEVAL,Nenfant)=\"D\",\"X\",\"\")","v":{"$error":"#NAME?"}},{"$f":"IF(INDEX(periode2,NEVAL,Nenfant)=\"C\",\"X\",\"\")","v":{"$error":"#NAME?"}},{"$f":"IF(INDEX(periode2,NEVAL,Nenfant)=\"B\",\"X\",\"\")","v":{"$error":"#NAME?"}},{"$f":"IF(INDEX(periode2,NEVAL,Nenfant)=\"A\",\"X\",\"\")","v":{"$error":"#NAME?"}},null,{"$f":"IF(INDEX(periode3,NEVAL,Nenfant)=\"D\",\"X\",\"\")","v":{"$error":"#NAME?"}},{"$f":"IF(INDEX(periode3,NEVAL,Nenfant)=\"C\",\"X\",\"\")","v":{"$error":"#NAME?"}},{"$f":"IF(INDEX(periode3,NEVAL,Nenfant)=\"B\",\"X\",\"\")","v":{"$error":"#NAME?"}},{"$f":"IF(INDEX(periode3,NEVAL,Nenfant)=\"A\",\"X\",\"\")","v":{"$error":"#NAME?"}},null,{"$f":"IF(INDEX(periode4,NEVAL,Nenfant)=\"D\",\"X\",\"\")","v":{"$error":"#NAME?"}},{"$f":"IF(INDEX(periode4,NEVAL,Nenfant)=\"C\",\"X\",\"\")","v":{"$error":"#NAME?"}},{"$f":"IF(INDEX(periode4,NEVAL,Nenfant)=\"B\",\"X\",\"\")","v":{"$error":"#NAME?"}},{"$f":"IF(INDEX(periode4,NEVAL,Nenfant)=\"A\",\"X\",\"\")","v":{"$error":"#NAME?"}},null,{"$f":"IF(INDEX(periode5,NEVAL,Nenfant)=\"D\",\"X\",\"\")","v":{"$error":"#NAME?"}},{"$f":"IF(INDEX(periode5,NEVAL,Nenfant)=\"C\",\"X\",\"\")","v":{"$error":"#NAME?"}},{"$f":"IF(INDEX(periode5,NEVAL,Nenfant)=\"B\",\"X\",\"\")","v":{"$error":"#NAME?"}},{"$f":"IF(INDEX(periode5,NEVAL,Nenfant)=\"A\",\"X\",\"\")","v":{"$error":"#NAME?"}},null,{"$f":"IF(INDEX(periode6,NEVAL,Nenfant)=\"D\",\"X\",\"\")","v":{"$error":"#NAME?"}},{"$f":"IF(INDEX(periode6,NEVAL,Nenfant)=\"C\",\"X\",\"\")","v":{"$error":"#NAME?"}},{"$f":"IF(INDEX(periode6,NEVAL,Nenfant)=\"B\",\"X\",\"\")","v":{"$error":"#NAME?"}},{"$f":"IF(INDEX(periode6,NEVAL,Nenfant)=\"A\",\"X\",\"\")","v":{"$error":"#NAME?"}}]
[208,{"$nulls":7},{"$f":"IF(INDEX(periode1,NEVAL,Nenfant)=\"D\",\"X\",\"\")","v":{"$error":"#NAME?"}},{"$f":"IF(INDEX(periode1,NEVAL,Nenfant)=\"C\",\"X\",\"\")","v":{"$error":"#NAME?"}},{"$f":"IF(INDEX(periode1,NEVAL,Nenfant)=\"B\",\"X\",\"\")","v":{"$error":"#NAME?"}},{"$f":"IF(INDEX(periode1,NEVAL,Nenfant)=\"A\",\"X\",\"\")","v":{"$error":"#NAME?"}},null,{"$f":"IF(INDEX(periode2,NEVAL,Nenfant)=\"D\",\"X\",\"\")","v":{"$error":"#NAME?"}},{"$f":"IF(INDEX(periode2,NEVAL,Nenfant)=\"C\",\"X\",\"\")","v":{"$error":"#NAME?"}},{"$f":"IF(INDEX(periode2,NEVAL,Nenfant)=\"B\",\"X\",\"\")","v":{"$error":"#NAME?"}},{"$f":"IF(INDEX(periode2,NEVAL,Nenfant)=\"A\",\"X\",\"\")","v":{"$error":"#NAME?"}},null,{"$f":"IF(INDEX(periode3,NEVAL,Nenfant)=\"D\",\"X\",\"\")","v":{"$error":"#NAME?"}},{"$f":"IF(INDEX(periode3,NEVAL,Nenfant)=\"C\",\"X\",\"\")","v":{"$error":"#NAME?"}},{"$f":"IF(INDEX(periode3,NEVAL,Nenfant)=\"B\",\"X\",\"\")","v":{"$error":"#NAME?"}},{"$f":"IF(INDEX(periode3,NEVAL,Nenfant)=\"A\",\"X\",\"\")","v":{"$error":"#NAME?"}},null,{"$f":"IF(INDEX(periode4,NEVAL,Nenfant)=\"D\",\"X\",\"\")","v":{"$error":"#NAME?"}},{"$f":"IF(INDEX(periode4,NEVAL,Nenfant)=\"C\",\"X\",\"\")","v":{"$error":"#NAME?"}},{"$f":"IF(INDEX(periode4,NEVAL,Nenfant)=\"B\",\"X\",\"\")","v":{"$error":"#NAME?"}},{"$f":"IF(INDEX(periode4,NEVAL,Nenfant)=\"A\",\"X\",\"\")","v":{"$error":"#NAME?"}},null,{"$f":"IF(INDEX(periode5,NEVAL,Nenfant)=\"D\",\"X\",\"\")","v":{"$error":"#NAME?"}},{"$f":"IF(INDEX(periode5,NEVAL,Nenfant)=\"C\",\"X\",\"\")","v":{"$error":"#NAME?"}},{"$f":"IF(INDEX(periode5,NEVAL,Nenfant)=\"B\",\"X\",\"\")","v":{"$error":"#NAME?"}},{"$f":"IF(INDEX(periode5,NEVAL,Nenfant)=\"A\",\"X\",\"\")","v":{"$error":"#NAME?"}},null,{"$f":"IF(INDEX(periode6,NEVAL,Nenfant)=\"D\",\"X\",\"\")","v":{"$error":"#NAME?"}},{"$f":"IF(INDEX(periode6,NEVAL,Nenfant)=\"C\",\"X\",\"\")","v":{"$error":"#NAME?"}},{"$f":"IF(INDEX(periode6,NEVAL,Nenfant)=\"B\",\"X\",\"\")","v":{"$error":"#NAME?"}},{"$f":"IF(INDEX(periode6,NEVAL,Nenfant)=\"A\",\"X\",\"\")","v":{"$error":"#NAME?"}}]
[209,{"$nulls":7},{"$f":"COUNTIF($G215:$G217,\"X\")","v":0},{"$f":"COUNTIF($H215:$H217,\"X\")","v":0},{"$f":"COUNTIF($I216:$I217,\"X\")","v":0},{"$f":"COUNTIF($J216:$J217,\"X\")","v":0},null,{"$f":"COUNTIF($G215:$G217,\"X\")","v":0},{"$f":"COUNTIF($H215:$H217,\"X\")","v":0},{"$f":"COUNTIF($I216:$I217,\"X\")","v":0},{"$f":"COUNTIF($J216:$J217,\"X\")","v":0},null,{"$f":"COUNTIF($G215:$G217,\"X\")","v":0},{"$f":"COUNTIF($H215:$H217,\"X\")","v":0},{"$f":"COUNTIF($I216:$I217,\"X\")","v":0},{"$f":"COUNTIF($J216:$J217,\"X\")","v":0},null,{"$f":"COUNTIF($G215:$G217,\"X\")","v":0},{"$f":"COUNTIF($H215:$H217,\"X\")","v":0},{"$f":"COUNTIF($I216:$I217,\"X\")","v":0},{"$f":"COUNTIF(AA216:AA217,\"X\")","v":0},null,{"$f":"COUNTIF($G215:$G217,\"X\")","v":0},{"$f":"COUNTIF($H215:$H217,\"X\")","v":0},{"$f":"COUNTIF($I216:$I217,\"X\")","v":0},{"$f":"COUNTIF($J216:$J217,\"X\")","v":0},null,{"$f":"COUNTIF($G215:$G217,\"X\")","v":0},{"$f":"COUNTIF($H215:$H217,\"X\")","v":0},{"$f":"COUNTIF($I216:$I217,\"X\")","v":0},{"$f":"COUNTIF($J216:$J217,\"X\")","v":0}]
[210,{"$nulls":7},{"$f":"IF(INDEX(periode1,NEVAL,Nenfant)=\"D\",\"X\",\"\")","v":{"$error":"#NAME?"}},{"$f":"IF(INDEX(periode1,NEVAL,Nenfant)=\"C\",\"X\",\"\")","v":{"$error":"#NAME?"}},{"$f":"IF(INDEX(periode1,NEVAL,Nenfant)=\"B\",\"X\",\"\")","v":{"$error":"#NAME?"}},{"$f":"IF(INDEX(periode1,NEVAL,Nenfant)=\"A\",\"X\",\"\")","v":{"$error":"#NAME?"}},null,{"$f":"IF(INDEX(periode2,NEVAL,Nenfant)=\"D\",\"X\",\"\")","v":{"$error":"#NAME?"}},{"$f":"IF(INDEX(periode2,NEVAL,Nenfant)=\"C\",\"X\",\"\")","v":{"$error":"#NAME?"}},{"$f":"IF(INDEX(periode2,NEVAL,Nenfant)=\"B\",\"X\",\"\")","v":{"$error":"#NAME?"}},{"$f":"IF(INDEX(periode2,NEVAL,Nenfant)=\"A\",\"X\",\"\")","v":{"$error":"#NAME?"}},null,{"$f":"IF(INDEX(periode3,NEVAL,Nenfant)=\"D\",\"X\",\"\")","v":{"$error":"#NAME?"}},{"$f":"IF(INDEX(periode3,NEVAL,Nenfant)=\"C\",\"X\",\"\")","v":{"$error":"#NAME?"}},{"$f":"IF(INDEX(periode3,NEVAL,Nenfant)=\"B\",\"X\",\"\")","v":{"$error":"#NAME?"}},{"$f":"IF(INDEX(periode3,NEVAL,Nenfant)=\"A\",\"X\",\"\")","v":{"$error":"#NAME?"}},null,{"$f":"IF(INDEX(periode4,NEVAL,Nenfant)=\"D\",\"X\",\"\")","v":{"$error":"#NAME?"}},{"$f":"IF(INDEX(periode4,NEVAL,Nenfant)=\"C\",\"X\",\"\")","v":{"$error":"#NAME?"}},{"$f":"IF(INDEX(periode4,NEVAL,Nenfant)=\"B\",\"X\",\"\")","v":{"$error":"#NAME?"}},{"$f":"IF(INDEX(periode4,NEVAL,Nenfant)=\"A\",\"X\",\"\")","v":{"$error":"#NAME?"}},null,{"$f":"IF(INDEX(periode5,NEVAL,Nenfant)=\"D\",\"X\",\"\")","v":{"$error":"#NAME?"}},{"$f":"IF(INDEX(periode5,NEVAL,Nenfant)=\"C\",\"X\",\"\")","v":{"$error":"#NAME?"}},{"$f":"IF(INDEX(periode5,NEVAL,Nenfant)=\"B\",\"X\",\"\")","v":{"$error":"#NAME?"}},{"$f":"IF(INDEX(periode5,NEVAL,Nenfant)=\"A\",\"X\",\"\")","v":{"$error":"#NAME?"}},null,{"$f":"IF(INDEX(periode6,NEVAL,Nenfant)=\"D\",\"X\",\"\")","v":{"$error":"#NAME?"}},{"$f":"IF(INDEX(periode6,NEVAL,Nenfant)=\"C\",\"X\",\"\")","v":{"$error":"#NAME?"}},{"$f":"IF(INDEX(periode6,NEVAL,Nenfant)=\"B\",\"X\",\"\")","v":{"$error":"#NAME?"}},{"$f":"IF(INDEX(periode6,NEVAL,Nenfant)=\"A\",\"X\",\"\")","v":{"$error":"#NAME?"}}]
[211,{"$nulls":7},{"$f":"IF(INDEX(periode1,NEVAL,Nenfant)=\"D\",\"X\",\"\")","v":{"$error":"#NAME?"}},{"$f":"IF(INDEX(periode1,NEVAL,Nenfant)=\"C\",\"X\",\"\")","v":{"$error":"#NAME?"}},{"$f":"IF(INDEX(periode1,NEVAL,Nenfant)=\"B\",\"X\",\"\")","v":{"$error":"#NAME?"}},{"$f":"IF(INDEX(periode1,NEVAL,Nenfant)=\"A\",\"X\",\"\")","v":{"$error":"#NAME?"}},null,{"$f":"IF(INDEX(periode2,NEVAL,Nenfant)=\"D\",\"X\",\"\")","v":{"$error":"#NAME?"}},{"$f":"IF(INDEX(periode2,NEVAL,Nenfant)=\"C\",\"X\",\"\")","v":{"$error":"#NAME?"}},{"$f":"IF(INDEX(periode2,NEVAL,Nenfant)=\"B\",\"X\",\"\")","v":{"$error":"#NAME?"}},{"$f":"IF(INDEX(periode2,NEVAL,Nenfant)=\"A\",\"X\",\"\")","v":{"$error":"#NAME?"}},null,{"$f":"IF(INDEX(periode3,NEVAL,Nenfant)=\"D\",\"X\",\"\")","v":{"$error":"#NAME?"}},{"$f":"IF(INDEX(periode3,NEVAL,Nenfant)=\"C\",\"X\",\"\")","v":{"$error":"#NAME?"}},{"$f":"IF(INDEX(periode3,NEVAL,Nenfant)=\"B\",\"X\",\"\")","v":{"$error":"#NAME?"}},{"$f":"IF(INDEX(periode3,NEVAL,Nenfant)=\"A\",\"X\",\"\")","v":{"$error":"#NAME?"}},null,{"$f":"IF(INDEX(periode4,NEVAL,Nenfant)=\"D\",\"X\",\"\")","v":{"$error":"#NAME?"}},{"$f":"IF(INDEX(periode4,NEVAL,Nenfant)=\"C\",\"X\",\"\")","v":{"$error":"#NAME?"}},{"$f":"IF(INDEX(periode4,NEVAL,Nenfant)=\"B\",\"X\",\"\")","v":{"$error":"#NAME?"}},{"$f":"IF(INDEX(periode4,NEVAL,Nenfant)=\"A\",\"X\",\"\")","v":{"$error":"#NAME?"}},null,{"$f":"IF(INDEX(periode5,NEVAL,Nenfant)=\"D\",\"X\",\"\")","v":{"$error":"#NAME?"}},{"$f":"IF(INDEX(periode5,NEVAL,Nenfant)=\"C\",\"X\",\"\")","v":{"$error":"#NAME?"}},{"$f":"IF(INDEX(periode5,NEVAL,Nenfant)=\"B\",\"X\",\"\")","v":{"$error":"#NAME?"}},{"$f":"IF(INDEX(periode5,NEVAL,Nenfant)=\"A\",\"X\",\"\")","v":{"$error":"#NAME?"}},null,{"$f":"IF(INDEX(periode6,NEVAL,Nenfant)=\"D\",\"X\",\"\")","v":{"$error":"#NAME?"}},{"$f":"IF(INDEX(periode6,NEVAL,Nenfant)=\"C\",\"X\",\"\")","v":{"$error":"#NAME?"}},{"$f":"IF(INDEX(periode6,NEVAL,Nenfant)=\"B\",\"X\",\"\")","v":{"$error":"#NAME?"}},{"$f":"IF(INDEX(periode6,NEVAL,Nenfant)=\"A\",\"X\",\"\")","v":{"$error":"#NAME?"}}]
[212,{"$nulls":7},{"$f":"COUNTIF($G220:$G222,\"X\")","v":0},{"$f":"COUNTIF($H220:$H222,\"X\")","v":0},{"$f":"COUNTIF($I219:$I224,\"X\")","v":0},{"$f":"COUNTIF($J219:$J224,\"X\")","v":0},null,{"$f":"COUNTIF($G220:$G222,\"X\")","v":0},{"$f":"COUNTIF($H220:$H222,\"X\")","v":0},{"$f":"COUNTIF($I219:$I224,\"X\")","v":0},{"$f":"COUNTIF($J219:$J224,\"X\")","v":0},null,{"$f":"COUNTIF($G220:$G222,\"X\")","v":0},{"$f":"COUNTIF($H220:$H222,\"X\")","v":0},{"$f":"COUNTIF($I219:$I224,\"X\")","v":0},{"$f":"COUNTIF($J219:$J224,\"X\")","v":0},null,{"$f":"COUNTIF($G220:$G222,\"X\")","v":0},{"$f":"COUNTIF($H220:$H222,\"X\")","v":0},{"$f":"COUNTIF($I219:$I224,\"X\")","v":0},{"$f":"COUNTIF(AA219:AA224,\"X\")","v":0},null,{"$f":"COUNTIF($G220:$G222,\"X\")","v":0},{"$f":"COUNTIF($H220:$H222,\"X\")","v":0},{"$f":"COUNTIF($I219:$I224,\"X\")","v":0},{"$f":"COUNTIF($J219:$J224,\"X\")","v":0},null,{"$f":"COUNTIF($G220:$G222,\"X\")","v":0},{"$f":"COUNTIF($H220:$H222,\"X\")","v":0},{"$f":"COUNTIF($I219:$I224,\"X\")","v":0},{"$f":"COUNTIF($J219:$J224,\"X\")","v":0}]
[213,{"$nulls":7},{"$f":"IF(INDEX(periode1,NEVAL,Nenfant)=\"D\",\"X\",\"\")","v":{"$error":"#NAME?"}},{"$f":"IF(INDEX(periode1,NEVAL,Nenfant)=\"C\",\"X\",\"\")","v":{"$error":"#NAME?"}},{"$f":"IF(INDEX(periode1,NEVAL,Nenfant)=\"B\",\"X\",\"\")","v":{"$error":"#NAME?"}},{"$f":"IF(INDEX(periode1,NEVAL,Nenfant)=\"A\",\"X\",\"\")","v":{"$error":"#NAME?"}},null,{"$f":"IF(INDEX(periode2,NEVAL,Nenfant)=\"D\",\"X\",\"\")","v":{"$error":"#NAME?"}},{"$f":"IF(INDEX(periode2,NEVAL,Nenfant)=\"C\",\"X\",\"\")","v":{"$error":"#NAME?"}},{"$f":"IF(INDEX(periode2,NEVAL,Nenfant)=\"B\",\"X\",\"\")","v":{"$error":"#NAME?"}},{"$f":"IF(INDEX(periode2,NEVAL,Nenfant)=\"A\",\"X\",\"\")","v":{"$error":"#NAME?"}},null,{"$f":"IF(INDEX(periode3,NEVAL,Nenfant)=\"D\",\"X\",\"\")","v":{"$error":"#NAME?"}},{"$f":"IF(INDEX(periode3,NEVAL,Nenfant)=\"C\",\"X\",\"\")","v":{"$error":"#NAME?"}},{"$f":"IF(INDEX(periode3,NEVAL,Nenfant)=\"B\",\"X\",\"\")","v":{"$error":"#NAME?"}},{"$f":"IF(INDEX(periode3,NEVAL,Nenfant)=\"A\",\"X\",\"\")","v":{"$error":"#NAME?"}},null,{"$f":"IF(INDEX(periode4,NEVAL,Nenfant)=\"D\",\"X\",\"\")","v":{"$error":"#NAME?"}},{"$f":"IF(INDEX(periode4,NEVAL,Nenfant)=\"C\",\"X\",\"\")","v":{"$error":"#NAME?"}},{"$f":"IF(INDEX(periode4,NEVAL,Nenfant)=\"B\",\"X\",\"\")","v":{"$error":"#NAME?"}},{"$f":"IF(INDEX(periode4,NEVAL,Nenfant)=\"A\",\"X\",\"\")","v":{"$error":"#NAME?"}},null,{"$f":"IF(INDEX(periode5,NEVAL,Nenfant)=\"D\",\"X\",\"\")","v":{"$error":"#NAME?"}},{"$f":"IF(INDEX(periode5,NEVAL,Nenfant)=\"C\",\"X\",\"\")","v":{"$error":"#NAME?"}},{"$f":"IF(INDEX(periode5,NEVAL,Nenfant)=\"B\",\"X\",\"\")","v":{"$error":"#NAME?"}},{"$f":"IF(INDEX(periode5,NEVAL,Nenfant)=\"A\",\"X\",\"\")","v":{"$error":"#NAME?"}},null,{"$f":"IF(INDEX(periode6,NEVAL,Nenfant)=\"D\",\"X\",\"\")","v":{"$error":"#NAME?"}},{"$f":"IF(INDEX(periode6,NEVAL,Nenfant)=\"C\",\"X\",\"\")","v":{"$error":"#NAME?"}},{"$f":"IF(INDEX(periode6,NEVAL,Nenfant)=\"B\",\"X\",\"\")","v":{"$error":"#NAME?"}},{"$f":"IF(INDEX(periode6,NEVAL,Nenfant)=\"A\",\"X\",\"\")","v":{"$error":"#NAME?"}}]
[214,{"$nulls":7},{"$error":"#NAME?"},{"$error":"#NAME?"},{"$error":"#NAME?"},{"$error":"#NAME?"},null,{"$error":"#NAME?"},{"$error":"#NAME?"},{"$error":"#NAME?"},{"$error":"#NAME?"},null,{"$error":"#NAME?"},{"$error":"#NAME?"},{"$error":"#NAME?"},{"$error":"#NAME?"},null,{"$error":"#NAME?"},{"$error":"#NAME?"},{"$error":"#NAME?"},{"$error":"#NAME?"},null,{"$error":"#NAME?"},{"$error":"#NAME?"},{"$error":"#NAME?"},{"$error":"#NAME?"},null,{"$error":"#NAME?"},{"$error":"#NAME?"},{"$error":"#NAME?"},{"$error":"#NAME?"}]
[215,{"$nulls":7},{"$error":"#NAME?"},{"$error":"#NAME?"},{"$error":"#NAME?"},{"$error":"#NAME?"},null,{"$error":"#NAME?"},{"$error":"#NAME?"},{"$error":"#NAME?"},{"$error":"#NAME?"},null,{"$error":"#NAME?"},{"$error":"#NAME?"},{"$error":"#NAME?"},{"$error":"#NAME?"},null,{"$error":"#NAME?"},{"$error":"#NAME?"},{"$error":"#NAME?"},{"$error":"#NAME?"},null,{"$error":"#NAME?"},{"$error":"#NAME?"},{"$error":"#NAME?"},{"$error":"#NAME?"},null,{"$error":"#NAME?"},{"$error":"#NAME?"},{"$error":"#NAME?"},{"$error":"#NAME?"}]
[216,{"$nulls":7},{"$error":"#NAME?"},{"$error":"#NAME?"},{"$error":"#NAME?"},{"$error":"#NAME?"},null,{"$error":"#NAME?"},{"$error":"#NAME?"},{"$error":"#NAME?"},{"$error":"#NAME?"},null,{"$error":"#NAME?"},{"$error":"#NAME?"},{"$error":"#NAME?"},{"$error":"#NAME?"},null,{"$error":"#NAME?"},{"$error":"#NAME?"},{"$error":"#NAME?"},{"$error":"#NAME?"},null,{"$error":"#NAME?"},{"$error":"#NAME?"},{"$error":"#NAME?"},{"$error":"#NAME?"},null,{"$error":"#NAME?"},{"$error":"#NAME?"},{"$error":"#NAME?"},{"$error":"#NAME?"}]
[217,{"$nulls":7},{"$error":"#NAME?"},{"$error":"#NAME?"},{"$error":"#NAME?"},{"$error":"#NAME?"},null,{"$error":"#NAME?"},{"$error":"#NAME?"},{"$error":"#NAME?"},{"$error":"#NAME?"},null,{"$error":"#NAME?"},{"$error":"#NAME?"},{"$error":"#NAME?"},{"$error":"#NAME?"},null,{"$error":"#NAME?"},{"$error":"#NAME?"},{"$error":"#NAME?"},{"$error":"#NAME?"},null,{"$error":"#NAME?"},{"$error":"#NAME?"},{"$error":"#NAME?"},{"$error":"#NAME?"},null,{"$error":"#NAME?"},{"$error":"#NAME?"},{"$error":"#NAME?"},{"$error":"#NAME?"}]
[218,{"$nulls":7},{"$error":"#NAME?"},{"$error":"#NAME?"},{"$error":"#NAME?"},{"$error":"#NAME?"},null,{"$error":"#NAME?"},{"$error":"#NAME?"},{"$error":"#NAME?"},{"$error":"#NAME?"},null,{"$error":"#NAME?"},{"$error":"#NAME?"},{"$error":"#NAME?"},{"$error":"#NAME?"},null,{"$error":"#NAME?"},{"$error":"#NAME?"},{"$error":"#NAME?"},{"$error":"#NAME?"},null,{"$error":"#NAME?"},{"$error":"#NAME?"},{"$error":"#NAME?"},{"$error":"#NAME?"},null,{"$error":"#NAME?"},{"$error":"#NAME?"},{"$error":"#NAME?"},{"$error":"#NAME?"}]
[219]
[220]
[221]
[222]
[223]
[224]
[225]
[226]
[227]
[228]
[229]
[230]
[231]
[232]
[233]
[234]
[235]
[236]
[237]
[238]
[239]
[240]
[241]
[242]
[243]
[244]
[245]
[246]
[247]
[248]
[249]
[250]
[251]
[252]
[253]
[254]
[255]
[256]
[257]
[258]
[259]
[260]
[261]
[262]
[263]
[264]
[265]
[266]
[267]
[268]
[269]
[270]
[271]
[272]
[273]
[274]
[275]
[276]
[277]
[278]
[279]
[280]
[281]
[282]
[283]
[284]
[285]
[286]
[287]
[288]
[289]
[290]
[291]
[292]
[293]
[294]
[295]
[296]
[297]
[298]
[299]
[300]
[301]
[302]
[303]
[304]
[305]
[306]
[307]
[308]
[309]
[310]
[311]
[312]
[313]
[314]
[315]
[316]
[317]
[318]
[319]
[320]
[321]
[322]
[323]
[324]
[325]
[326]
[327]
[328]
[329]
[330]
[331]
[332]
[333]
[334]
[335]
[336]
[337]
[338]
[339]
[340]
[341]
[342]
[343]
[344]
[345]
[346]
[347]
[348]
[349]
[350]
[351]
[352]
[353]
[354]
[355]
[356]
[357]
[358]
[359]
[360]
[361]
[362]
[363]
[364]
[365]
[366]
[367]
[368]
[369]
[370]
[371]
[372]
[373]
[374]
[375]
[376]
[377]
[378]
[379]
[380]
[381]
[382]
[383]
[384]
[385]
[386]
[387]
[388]
[389]
[390]
[391]
[392]
[393]
[394]
[395]
[396]
[397]
[398]
[399]
[400]
[401]
[402]
[403]
[404]
[405]
[406]
[407]
[408]
[409]
[410]
[411]
[412]
[413]
[414]
[415]
[416]
[417]
[418]
[419]
[420]
[421]
[422]
[423]
[424]
[425]
[426]
[427]
[428]
[429]
[430]
[431]
[432]
[433]
[434]
[435]
[436]
[437]
[438]
[439]
[440]
[441]
[442]
[443]
[444]
[445]
[446]
[447]
[448]
[449]
[450]
[451]
[452]
[453]
[454]
[455]
[456]
[457]
[458]
[459]
[460]
[461]
[462]
[463]
[464]
[465]
[466]
[467]
[468]
[469]
[470]
[471]
[472]
[473]
[474]
[475]
[476]
[477]
[478]
[479]
[480]
[481]
[482]
[483]
[484]
[485]
[486]
[487]
[488]
[489]
[490]
[491]
[492]
[493]
[494]
[495]
[496]
[497]
[498]
[499]
[500]
[501]
[502]
[503]
[504]
[505]
[506]
[507]
[508]
[509]
[510]
[511]
[512]
[513]
[514]
[515]
[516]
[517]
[518]
[519]
[520]
[521]
[522]
[523]
[524]
[525]
[526]
[527]
[528]
[529]
[530]
[531]
[532]
[533]
[534]
[535]
[536]
[537]
[538]
[539]
[540]
[541]
[542]
[543]
[544]
[545]
[546]
[547]
[548]
[549]
[550]
[551]
[552]
[553]
[554]
[555]
[556]
[557]
[558]
[559]
[560]
[561]
[562]
[563]
[564]
[565]
[566]
[567]
[568]
[569]
[570]
[571]
[572]
[573]
[574]
[575]
[576]
[577]
[578]
[579]
[580]
[581]
[582]
[583]
[584]
[585]
[586]
[587]
[588]
[589]
[590]
[591]
[592]
[593]
[594]
[595]
[596]
[597]
[598]
[599]
[600]
[601]
[602]
[603]
[604]
[605]
[606]
[607]
[608]
[609]
[610]
[611]
[612]
[613]
[614]
[615]
[616]
[617]
[618]
[619]
[620]
[621]
[622]
[623]
[624]
[625]
[626]
[627]
[628]
[629]
[630]
[631]
[632]
[633]
[634]
[635]
[636]
[637]
[638]
[639]
[640]
[641]
[642]
[643]
[644]
[645]
[646]
[647]
[648]
[649]
[650]
[651]
[652]
[653]
[654]
[655]
[656]
[657]
[658]
[659]
[660]
[661]
[662]
[663]
[664]
[665]
[666]
[667]
[668]
[669]
[670]
[671]
[672]
[673]
[674]
[675]
[676]
[677]
[678]
[679]
[680]
[681]
[682]
[683]
[684]
[685]
[686]
[687]
[688]
[689]
[690]
[691]
[692]
[693]
[694]
[695]
[696]
[697]
[698]
[699]
[700]
[701]
[702]
[703]
[704]
[705]
[706]
[707]
[708]
[709]
[710]
[711]
[712]
[713]
[714]
[715]
[716]
[717]
[718]
[719]
[720]
[721]
[722]
[723]
[724]
[725]
[726]
[727]
[728]
[729]
[730]
[731]
[732]
[733]
[734]
[735]
[736]
[737]
[738]
[739]
[740]
[741]
[742]
[743]
[744]
[745]
[746]
[747]
[748]
[749]
[750]
[751]
[752]
[753]
[754]
[755]
[756]
[757]
[758]
[759]
[760]
[761]
[762]
[763]
[764]
[765]
[766]
[767]
[768]
[769]
[770]
[771]
[772]
[773]
[774]
[775]
[776]
[777]
[778]
[779]
[780]
[781]
[782]
[783]
[784]
[785]
[786]
[787]
[788]
[789]
[790]
[791]
[792]
[793]
[794]
[795]
[796]
[797]
[798]
[799]
[800]

{"sheet":"Appréciations","index":6,"n_rows":36,"n_cols":16,"rows_kept":36}
[]
[{"$nulls":4},"PERIODE 1","Jours d'absences","PERIODE 2 \n","Jours d'absences","PERIODE 3","Jours d'absences","PERIODE 4\n","Jours d'absences","PERIODE 5\n","Jours d'absences","Décision du conseil des maîtres concernant les passages","Jours d'absences l'année"]
[]
[null,{"$f":"Renseignements!C16","v":"Marc"},{"$f":"Renseignements!D16","v":"Aurèle"},null,"appreciation P1",3,"appréciation P2",4,"appréciation P3",5,"appréciation P4",6,"appréciation P5",7,"Passe en CM2",{"$f":"N4+L4+J4+H4+F4","v":25}]
[null,{"$f":"Renseignements!C17","v":"Jérôme"},{"$f":"Renseignements!D17","v":"Lenoir"},null,"appréciation lenoir P1",null,"appréciation lenoir P2",null,"appréciation lenoir P3",null,"appréciation lenoir P4",null,"appréciation lenoir P5",null,null,{"$f":"N5+L5+J5+H5+F5","v":0}]
[null,{"$f":"Renseignements!C18","v":"Fabien"},{"$f":"Renseignements!D18","v":"Léglise"},{"$nulls":12},0]
[null,{"$f":"Renseignements!C19","v":"Aicha"},{"$f":"Renseignements!D19","v":"Samarahoui"},{"$nulls":12},0]
[null,{"$f":"Renseignements!C20","v":"Karim"},{"$f":"Renseignements!D20","v":"Maha"},{"$nulls":12},0]
[null,{"$f":"Renseignements!C21","v":0},{"$f":"Renseignements!D21","v":0},{"$nulls":12},0]
[null,{"$f":"Renseignements!C22","v":0},{"$f":"Renseignements!D22","v":0},{"$nulls":12},0]
[null,{"$f":"Renseignements!C23","v":0},{"$f":"Renseignements!D23","v":0},{"$nulls":12},0]
[null,{"$f":"Renseignements!C24","v":0},{"$f":"Renseignements!D24","v":0},{"$nulls":12},0]
[null,{"$f":"Renseignements!C25","v":0},{"$f":"Renseignements!D25","v":0},{"$nulls":12},0]
[null,{"$f":"Renseignements!C26","v":0},{"$f":"Renseignements!D26","v":0},{"$nulls":12},0]
[null,{"$f":"Renseignements!C27","v":0},{"$f":"Renseignements!D27","v":0},{"$nulls":12},0]
[null,{"$f":"Renseignements!C28","v":0},{"$f":"Renseignements!D28","v":0},{"$nulls":12},0]
[null,{"$f":"Renseignements!C29","v":0},{"$f":"Renseignements!D29","v":0},{"$nulls":12},0]
[null,{"$f":"Renseignements!C30","v":0},{"$f":"Renseignements!D30","v":0},{"$nulls":12},0]
[null,{"$f":"Renseignements!C31","v":0},{"$f":"Renseignements!D31","v":0},{"$nulls":12},0]
[null,{"$f":"Renseignements!C32","v":0},{"$f":"Renseignements!D32","v":0},{"$nulls":12},0]
[null,{"$f":"Renseignements!C33","v":0},{"$f":"Renseignements!D33","v":0},{"$nulls":12},0]
[null,{"$f":"Renseignements!C34","v":0},{"$f":"Renseignements!D34","v":0},{"$nulls":12},0]
[null,{"$f":"Renseignements!C35","v":0},{"$f":"Renseignements!D35","v":0},{"$nulls":12},0]
[null,{"$f":"Renseignements!C36","v":0},{"$f":"Renseignements!D36","v":0},{"$nulls":12},0]
[null,{"$f":"Renseignements!C37","v":0},{"$f":"Renseignements!D37","v":0},{"$nulls":12},0]
[null,{"$f":"Renseignements!C38","v":0},{"$f":"Renseignements!D38","v":0},{"$nulls":12},0]
[null,{"$f":"Renseignements!C39","v":0},{"$f":"Renseignements!D39","v":0},{"$nulls":12},0]
[null,{"$f":"Renseignements!C40","v":0},{"$f":"Renseignements!D40","v":0},{"$nulls":12},0]
[null,{"$f":"Renseignements!C41","v":0},{"$f":"Renseignements!D41","v":0},{"$nulls":12},0]
[null,{"$f":"Renseignements!C42","v":0},{"$f":"Renseignements!D42","v":0},{"$nulls":12},0]
[null,{"$f":"Renseignements!C43","v":0},{"$f":"Renseignements!D43","v":0},{"$nulls":12},0]
[null,{"$f":"Renseignements!C44","v":0},{"$f":"Renseignements!D44","v":0},{"$nulls":12},0]
[null,{"$f":"Renseignements!C45","v":0},{"$f":"Renseignements!D45","v":0},{"$nulls":12},0]
[null,{"$f":"Renseignements!C46","v":0},{"$f":"Renseignements!D46","v":0},{"$nulls":12},0]
[null,{"$f":"Renseignements!C47","v":0},{"$f":"Renseignements!D47","v":0},{"$nulls":12},0]
[null,{"$f":"Renseignements!C48","v":0},{"$f":"Renseignements!D48","v":0},{"$nulls":12},0]

{"sheet":"Synt","index":7,"n_rows":215,"n_cols":36,"rows_kept":215,"hidden":true,"merged":[[4,1,26,1],[27,1,53,1],[54,1,91,1],[92,1,128,1],[129,1,151,1],[152,1,169,1],[170,1,182,1],[183,1,187,1],[188,1,207,1],[208,1,214,1]]}
[]
[]
[]
[]
[4,"FRANCAIS","LANGAGE ORAL",{"$f":"SUM(D6:D9)/$A5","v":1},{"$f":"SUM(E6:E9)/$A5","v":0.875},0,0,0,0,0,0,0,0,0,0,0,0,0,0,0,0,0,0,0,0,0,0,0,0,0,0,0,0,0,0,0]
[null,null,"Écouter pour comprendre un message oral, un propos, un discours, un texte lu.",1,0.5]
[null,null,"Parler en prenant en compte son auditoire.",1,1]
[null,null,"Participer à des échanges dans des situations diversifiées.",1,1]
[null,null,"Adopter une attitude critique par rapport au langage produit.",1,1]
[4,null,"LIRE",{"$f":"SUM(D11:D14)/$A10","v":1},1,0,0,0,0,0,0,0,0,0,0,0,0,0,0,0,0,0,0,0,0,0,0,0,0,0,0,0,0,0,0,0]
[null,null,"Lire avec fluidité.",1,1]
[null,null,"Comprendre un texte littéraire et l’interpréter.",1,1]
[null,null,"Comprendre des textes, des documents et des images et les interpréter. ",1,1]
[null,null,"Contrôler sa compréhension, être un lecteur autonome.",1,1]
[6,null,"ECRIRE",{"$f":"SUM(D16:D21)/$A15","v":1},{"$f":"SUM(E16:E21)/$A15","v":1},0,0,0,0,0,0,0,0,0,0,0,0,0,0,0,0,0,0,0,0,0,0,0,0,0,0,0,0,0,0,0]
[null,null,"Écrire à la main de manière fluide et efficace.",1,1]
[null,null,"Écrire avec un clavier rapidement et efficacement. ",1,1]
[null,null,"Recourir à l’écriture pour réfléchir et pour apprendre. ",1,1]
[null,null,"Produire des écrits variés.",1,1]
[null,null,"Réécrire à partir de nouvelles consignes ou faire évoluer son texte.",1,1]
[null,null,"Prendre en compte les normes de l’écrit pour formuler, transcrire et réviser.",1,1]
[5,null,"ETUDE DE LA LANGUE",{"$f":"SUM(D23:D27)/$A22","v":0},0,0,0,0,0,0,0,0,0,0,0,0,0,0,0,0,0,0,0,0,0,0,0,0,0,0,0,0,0,0,0,0]
[null,null,"Maitriser les relations entre l’oral et l’écrit."]
[null,null,"Acquérir la structure, le sens et l’orthographe des mots."]
[null,null,"Maitriser la forme des mots en lien avec la syntaxe."]
[null,null,"Observer le fonctionnement du verbe et l’orthographier."]
[null,null,"Identifier les constituants d’une phrase simple en relation avec son sens ; distinguer phrase simple et phrase complexe."]
[3,"MATHEMATIQUES","NOMBRES ET CALCUL",{"$f":"SUM(D29:D31)/$A28","v":0},0,0,0,0,0,0,0,0,0,0,0,0,0,0,0,0,0,0,0,0,0,0,0,0,0,0,0,0,0,0,0,0]
[null,null,"Calculer avec des nombres décimaux."]
[null,null,"Contrôler la vraisemblance de ses résultats. "]
[null,null,"Utiliser une calculatrice pour trouver ou vérifier un résultat."]
[3,null,"CHERCHER",{"$f":"SUM(D33:D35)/$A32","v":0},{"$f":"SUM(E33:E35)/$A32","v":0},0,0,0,0,0,0,0,0,0,0,0,0,0,0,0,0,0,0,0,0,0,0,0,0,0,0,0,0,0,0,0]
[null,null,"Prélever et organiser les informations nécessaires à la résolution de problèmes."]
[null,null,"S’engager dans une démarche, observer, questionner, manipuler, expérimenter, émettre des hypothèses."]
[null,null,"Tester, essayer plusieurs pistes de résolution."]
[4,null,"MODELISER",{"$f":"SUM(D37:D40)/$A36","v":0},{"$f":"SUM(E37:E40)/$A36","v":0},0,0,0,0,0,0,0,0,0,0,0,0,0,0,0,0,0,0,0,0,0,0,0,0,0,0,0,0,0,0,0]
[null,null,"Résoudre quelques problèmes issus de situations de la vie quotidienne. "]
[null,null,"Reconnaitre et distinguer des problèmes relevant de situations additives, multiplicatives, de proportionnalité. "]
[null,null,"Reconnaitre des situations réelles pouvant être modélisées par des relations géométriques (alignement, parallélisme, perpendicularité, symétrie)."]
[null,null,"Utiliser des propriétés géométriques pour reconnaitre des objets."]
[5,null,"REPRESENTER",{"$f":"SUM(D42:D46)/$A41","v":0},{"$f":"SUM(E42:E46)/$A41","v":0},0,0,0,0,0,0,0,0,0,0,0,0,0,0,0,0,0,0,0,0,0,0,0,0,0,0,0,0,0,0,0]
[null,null,"Utiliser des outils pour représenter un problème : dessins, schémas, diagrammes, graphiques, écritures avec parenthésages, …"]
[null,null,"Produire et utiliser diverses représentations des fractions simples et des nombres décimaux."]
[null,null,"Analyser une figure plane sous différents aspects (surface, contour de celle-ci, lignes et points)."]
[null,null,"Reconnaitre et utiliser des premiers éléments de codages d’une figure plane ou d’un solide."]
[null,null,"Utiliser et produire des représentations de solides et de situations spatiales."]
[4,null,"RAISONNER",{"$f":"SUM(D48:D51)/$A47","v":0},{"$f":"SUM(E48:E51)/$A47","v":0},0,0,0,0,0,0,0,0,0,0,0,0,0,0,0,0,0,0,0,0,0,0,0,0,0,0,0,0,0,0,0]
[null,null,"Résoudre des problèmes complexes"]
[null,null,"En géométrie, passer progressivement de la perception au contrôle par les instruments pour amorcer des raisonnements s’appuyant uniquement sur des propriétés des figures et sur des relations entre objets."]
[null,null,"Progresser collectivement dans une investigation en sachant prendre en compte le point de vue d’autrui."]
[null,null,"Justifier ses affirmations et rechercher la validité des informations dont on dispose."]
[2,null,"COMMUNIQUER",{"$f":"SUM(D53:D54)/$A52","v":0},0,0,0,0,0,0,0,0,0,0,0,0,0,0,0,0,0,0,0,0,0,0,0,0,0,0,0,0,0,0,0,0]
[null,null,"Utiliser un vocabulaire adéquat et/ou des notations adaptées pour décrire une situation, exposer une argumentation."]
[null,null,"Expliquer sa démarche ou son raisonnement, comprendre les explications d’un autre et argumenter dans l’échange."]
[5,"HISTOIRE ET GEOGRAPHIE","SE REPERER DANS LE TEMPS, CONSTRUIRE DES REPERES HISTORIQUES",{"$f":"SUM(D56:D60)/$A55","v":0},{"$f":"SUM(E56:E60)/$A55","v":0},0,0,0,0,0,0,0,0,0,0,0,0,0,0,0,0,0,0,0,0,0,0,0,0,0,0,0,0,0,0,0]
[null,null,"Situer chronologiquement des grandes périodes historiques. "]
[null,null,"Ordonner des faits les uns par rapport aux autres et les situer dans une époque ou une période donnée."]
[null,null,"Manipuler et réinvestir le repère historique dans différents contextes."]
[null,null,"Utiliser des documents donnant à voir une représentation du temps."]
[null,null,"Mémoriser les repères historiques liés au programme"]
[6,null,"SE REPERER DANS L'ESPACE, CONSTRUIRE DES REPERES GEOGRAPHIQUES",{"$f":"SUM(D62:D66)/$A61","v":0},{"$f":"SUM(E62:E66)/$A61","v":0},0,0,0,0,0,0,0,0,0,0,0,0,0,0,0,0,0,0,0,0,0,0,0,0,0,0,0,0,0,0,0]
[null,null,"Nommer et localiser les grands repères géographiques."]
[null,null,"Nommer et localiser un lieu dans un espace géographique."]
[null,null,"Nommer, localiser et caractériser des espaces."]
[null,null,"Situer des lieux et des espaces les uns par rapport aux autres."]
[null,null,"Appréhender la notion d’échelle géographique."]
[null,null,"Mémoriser les repères géographiques liés au programme."]
[4,null,"RAISONNER, JUSTIFIER UNE DEMARCHE ET LES CHOIX EFFECTUES",{"$f":"SUM(D69:D72)/$A68","v":0},{"$f":"SUM(E69:E72)/$A68","v":0},0,0,0,0,0,0,0,0,0,0,0,0,0,0,0,0,0,0,0,0,0,0,0,0,0,0,0,0,0,0,0]
[null,null,"Poser des questions, se poser des questions."]
[null,null,"Formuler des hypothèses."]
[null,null,"Vérifier."]
[null,null,"Justifier."]
[3,null,"S'INFORMER DANS LE MONDE NUMERIQUE",{"$f":"SUM(D74:D76)/$A73","v":0},{"$f":"SUM(E74:E76)/$A73","v":0},0,0,0,0,0,0,0,0,0,0,0,0,0,0,0,0,0,0,0,0,0,0,0,0,0,0,0,0,0,0,0]
[null,null,"Connaitre différents systèmes d’information, les utiliser."]
[null,null,"Trouver, sélectionner et exploiter des informations dans une ressource numérique."]
[null,null," Identifier la ressource numérique utilisée"]
[4,null,"COMPRENDRE UN DOCUMENT",{"$f":"SUM(D78:D81)/$A77","v":0},{"$f":"SUM(E78:E81)/$A77","v":0},0,0,0,0,0,0,0,0,0,0,0,0,0,0,0,0,0,0,0,0,0,0,0,0,0,0,0,0,0,0,0]
[null,null,"Comprendre le sens général d’un document."]
[null,null,"Identifier le document et savoir pourquoi il doit être identifié."]
[null,null,"Extraire des informations pertinentes pour répondre à une question."]
[null,null,"Savoir que le document exprime un point de vue, identifier et questionner le sens implicite d’un document."]
[6,null,"PRATIQUER DIFFERENTS LANGAGES EN HISTOIRE ET EN GEOGRAPHIE",{"$f":"SUM(D83:D88)/$A82","v":0},{"$f":"SUM(E83:E88)/$A82","v":0},0,0,0,0,0,0,0,0,0,0,0,0,0,0,0,0,0,0,0,0,0,0,0,0,0,0,0,0,0,0,0]
[null,null,"Écrire pour structurer sa pensée et son savoir, pour argumenter et écrire pour communiquer et échanger."]
[null,null,"Reconnaitre un récit historique."]
[null,null,"S’exprimer à l’oral pour penser, communiquer et échanger."]
[null,null,"S’approprier et utiliser un lexique historique et géographique approprié."]
[null,null,"Réaliser ou compléter des productions graphiques."]
[null,null,"Utiliser des cartes analogiques et numériques à différentes échelles, des photographies de paysages ou de lieux."]
[3,null,"COOPERER ET MUTUALISER",{"$f":"SUM(D90:D92)/$A89","v":0},0,0,0,0,0,0,0,0,0,0,0,0,0,0,0,0,0,0,0,0,0,0,0,0,0,0,0,0,0,0,0,0]
[null,null,"Organiser son travail dans le cadre d’un groupe pour élaborer une tâche commune."]
[null,null,"Travailler en commun pour faciliter les apprentissages individuels. "]
[null,null,"Apprendre à utiliser les outils numériques qui peuvent conduire à des réalisations collectives."]
[6,"SCIENCES ET TECHNOLOGIE","PRATIQUE LA DEMARCHE SCIENTIFIQUE",{"$f":"SUM(D94:D99)/$A93","v":0},{"$f":"SUM(E94:E99)/$A93","v":0},0,0,0,0,0,0,0,0,0,0,0,0,0,0,0,0,0,0,0,0,0,0,0,0,0,0,0,0,0,0,0]
[null,null,"Proposer, avec l’aide du professeur, une démarche pour résoudre un problème ou répondre à une question de nature scientifique ou technologique :"]
[null,null,"Formuler une question ou une problématique scientifique ou technologique simple ;"]
[null,null,"Proposer une ou des hypothèses pour répondre à une question ou un problème ;"]
[null,null,"Pproposer des expériences simples pour tester une hypothèse ;"]
[null,null,"Interpréter un résultat, en tirer une conclusion ;"]
[null,null,"Formaliser une partie de sa recherche sous une forme écrite ou orale."]
[5,null,"PERCEVOIR, CREER , REALISER",{"$f":"SUM(D101:D105)/$A100","v":0},{"$f":"SUM(E101:E105)/$A100","v":0},0,0,0,0,0,0,0,0,0,0,0,0,0,0,0,0,0,0,0,0,0,0,0,0,0,0,0,0,0,0,0]
[null,null,"Identifier les évolutions des besoins et des objets techniques dans leur contexte."]
[null,null,"Identifier les principales familles de matériaux."]
[null,null,"Décrire le fonctionnement d’objets techniques, leurs fonctions et leurs composants."]
[null,null,"Réaliser en équipe tout ou une partie d’un objet technique répondant à un besoin."]
[null,null,"Repérer et comprendre la communication et la gestion de l’information."]
[6,null,"S'APPROPRIER DES OUTILS ET DES METHODES",{"$f":"SUM(D107:D112)/$A106","v":0},{"$f":"SUM(E107:E112)/$A106","v":0},0,0,0,0,0,0,0,0,0,0,0,0,0,0,0,0,0,0,0,0,0,0,0,0,0,0,0,0,0,0,0]
[null,null,"Choisir ou utiliser le matériel adapté pour mener une observation, effectuer une mesure, réaliser une expérience ou une production. "]
[null,null,"Faire le lien entre la mesure réalisée, les unités et l’outil utilisés."]
[null,null,"Garder une trace écrite ou numérique des recherches, des observations et des expériences réalisées."]
[null,null,"Organiser seul ou en groupe un espace de réalisation expérimentale."]
[null,null,"Effectuer des recherches bibliographiques simples et ciblées. Extraire les informations pertinentes d’un document et les mettre en relation pour répondre à une question."]
[null,null,"Utiliser les outils mathématiques adaptés."]
[4,null,"PRATIQUER DES LANGAGES",{"$f":"SUM(D114:D117)/$A113","v":0},{"$f":"SUM(E114:E117)/$A113","v":0},0,0,0,0,0,0,0,0,0,0,0,0,0,0,0,0,0,0,0,0,0,0,0,0,0,0,0,0,0,0,0]
[null,null,"Rendre compte des observations, expériences, hypothèses, conclusions en utilisant un vocabulaire précis."]
[null,null,"Exploiter un document constitué de divers supports (texte, schéma, graphique, tableau, algorithme simple)."]
[null,null,"Utiliser différents modes de représentation formalisés (schéma, dessin, croquis, tableau, graphique, texte). "]
[null,null,"Expliquer un phénomène à l’oral et à l’écrit."]
[5,null,"MOBILISER LES OUTILS NUMERIQUES",{"$f":"SUM(D119:D123)/$A118","v":0},{"$f":"SUM(E119:E123)/$A118","v":0},0,0,0,0,0,0,0,0,0,0,0,0,0,0,0,0,0,0,0,0,0,0,0,0,0,0,0,0,0,0,0]
[null,null,"Communiquer des résultats ;"]
[null,null,"Traiter des données ;"]
[null,null,"Simuler des phénomènes ;"]
[null,null,"RIeprésenter des objets techniques."]
[null,null,"Identifier des sources d’informations fiables."]
[2,null,"ADOPTER UN COMPORTEMENT ETHIQUE ET RESPONSABLE",{"$f":"SUM(D125:D126)/$A124","v":0},{"$f":"SUM(E125:E126)/$A124","v":0},0,0,0,0,0,0,0,0,0,0,0,0,0,0,0,0,0,0,0,0,0,0,0,0,0,0,0,0,0,0,0]
[null,null,"Relier des connaissances acquises en sciences et technologie à des questions de santé, de sécurité et d’environnement."]
[null,null,"Mettre en œuvre une action responsable et citoyenne, "]
[2,null,"SE SITUER DANS L'ESPACE ET DANS LE TEMPS",{"$f":"SUM(D128:D129)/$A127","v":0},{"$f":"SUM(E128:E129)/$A127","v":0},0,0,0,0,0,0,0,0,0,0,0,0,0,0,0,0,0,0,0,0,0,0,0,0,0,0,0,0,0,0,0]
[null,null,"Replacer des évolutions scientifiques et technologiques dans un contexte historique, géographique, économique et culturel."]
[null,null,"Se situer dans l’environnement et maitriser les notions d’échelle."]
[3,"LVE","ECOUTER ET COMPRENDRE",{"$f":"SUM(D131:D133)/$A130","v":0},{"$f":"SUM(E131:E133)/$A130","v":0},0,0,0,0,0,0,0,0,0,0,0,0,0,0,0,0,0,0,0,0,0,0,0,0,0,0,0,0,0,0,0]
[null,null,"Écouter et comprendre des messages oraux simples relevant de la vie quotidienne, des histoires simples. "]
[null,null,"Exercer sa mémoire auditive à court et à long terme pour mémoriser des mots, des expressions courantes."]
[null,null,"Utiliser des indices sonores et visuels pour déduire le sens de mots inconnus, d’un message."]
[4,null,"LIRE ET COMPRENDRE",{"$f":"SUM(D135:D138)/$A134","v":0},{"$f":"SUM(E135:E138)/$A134","v":0},0,0,0,0,0,0,0,0,0,0,0,0,0,0,0,0,0,0,0,0,0,0,0,0,0,0,0,0,0,0,0]
[null,null,"Utiliser le contexte, les illustrations et les connaissances pour comprendre un texte."]
[null,null,"Reconnaitre des mots isolés dans un énoncé, un court texte."]
[null,null,"S’appuyer sur des mots outils, des structures simples, des expressions rituelles."]
[null,null,"Percevoir la relation entre certains graphèmes et phonèmes spécifiques à la langue."]
[3,null,"PARLER EN CONTINUE",{"$f":"SUM(D140:D142)/$A139","v":0},{"$f":"SUM(E140:E142)/$A139","v":0},0,0,0,0,0,0,0,0,0,0,0,0,0,0,0,0,0,0,0,0,0,0,0,0,0,0,0,0,0,0,0]
[null,null,"Mémoriser et reproduire des énoncés."]
[null,null,"S’exprimer de manière audible, en modulant débit et voix."]
[null,null,"Participer à des échanges simples ,pour être entendu et compris dans quelques situations diversifiées de la vie quotidienne."]
[2,null,"ECRIRE",{"$f":"SUM(D144:D145)/$A143","v":0.5},0.5,0,0,0,0,0,0,0,0,0,0,0,0,0,0,0,0,0,0,0,0,0,0,0,0,0,0,0,0,0,0,0]
[null,null,"Écrire des mots et des expressions dont l’orthographe et la syntaxe ont été mémorisées. "]
[null,null,"Mobiliser des structures simples pour écrire des phrases en s’appuyant sur une trame connue.",1,1]
[3,null,"REAGIR ET DIALOGUER",{"$f":"SUM(D147:D149)/$A146","v":1},1,0,0,0,0,0,0,0,0,0,0,0,0,0,0,0,0,0,0,0,0,0,0,0,0,0,0,0,0,0,0,0]
[null,null,"Poser des questions simples.",1,1]
[null,null,"Mobiliser des énoncés adéquats au contexte dans une succession d’échanges ritualisés.",1,1]
[null,null,"Utiliser des procédés très simples pour commencer, poursuivre et terminer une conversation brève.",1,1]
[2,null,"ASPECTS CULTURELS",{"$f":"SUM(D151:D152)/$A150","v":0},0,0,0,0,0,0,0,0,0,0,0,0,0,0,0,0,0,0,0,0,0,0,0,0,0,0,0,0,0,0,0,0]
[null,null,"Identifier quelques grands repères culturels de l’environnement quotidien des élèves du même âge dans les pays ou régions étudiés."]
[null,null,"Mobiliser ses connaissances culturelles pour décrire ou raconter des personnages réels ou imaginaires."]
[4,"ARTS PLASTIQUES","EXPERIMENTER, PRODUIRE, CRÉER",{"$f":"SUM(D154:D157)/$A153","v":0},{"$f":"SUM(E154:E157)/$A153","v":0},0,0,0,0,0,0,0,0,0,0,0,0,0,0,0,0,0,0,0,0,0,0,0,0,0,0,0,0,0,0,0]
[null,null,"Choisir, organiser et mobiliser des gestes, des outils et des matériaux en fonction des effets qu’ils produisent."]
[null,null,"Représenter le monde environnant ou donner forme à son imaginaire en explorant divers domaines."]
[null,null,"Rechercher une expression personnelle en s’éloignant des stéréotypes."]
[null,null,"Intégrer l’usage des outils informatiques de travail de l’image et de recherche d’information, au service de la pratique plastique."]
[4,null,"METTRE EN OEUVRE UN PROJET ARTISTIQUE",{"$f":"SUM(D159:D162)/$A158","v":0},{"$f":"SUM(E159:E162)/$A158","v":0},0,0,0,0,0,0,0,0,0,0,0,0,0,0,0,0,0,0,0,0,0,0,0,0,0,0,0,0,0,0,0]
[null,null,"Identifier les principaux outils et compétences nécessaires à la réalisation d’un projet artistique."]
[null,null,"Se repérer dans les étapes de la réalisation d’une production plastique individuelle ou collective, anticiper les difficultés éventuelles."]
[null,null,"Identifier et assumer sa part de responsabilité dans un processus coopératif de création."]
[null,null,"Adapter son projet en fonction des contraintes de réalisation et de la prise en compte du spectateur."]
[3,null,"S'EXPRIMER, ANALYSER SA PRATIQUE, CELLE DE SES PAIRS",{"$f":"SUM(D164:D166)/$A163","v":0},0,0,0,0,0,0,0,0,0,0,0,0,0,0,0,0,0,0,0,0,0,0,0,0,0,0,0,0,0,0,0,0]
[null,null,"Décrire et interroger à l’aide d’un vocabulaire spécifique ses productions plastiques, celles de ses pairs et des œuvres d’art étudiées en classe."]
[null,null,"Justifier des choix pour rendre compte du cheminement qui conduit de l’intention à la réalisation."]
[null,null,"Formuler une expression juste de ses émotions, en prenant appui sur ses propres réalisations plastiques, celles des autres élèves et des œuvres d’art."]
[3,null,"SE REPERER DANS LES DOMAINES LIES AUX ARTS PLASTIQUES",{"$f":"SUM(D168:D170)/$A167","v":0},0,0,0,0,0,0,0,0,0,0,0,0,0,0,0,0,0,0,0,0,0,0,0,0,0,0,0,0,0,0,0,0]
[null,null,"Repérer, pour les dépasser, certains a priori et stéréotypes culturels et artistiques."]
[null,null,"Identifier quelques caractéristiques qui inscrivent une œuvre d’art dans une aire géographique ou culturelle et dans un temps historique, contemporain, proche ou lointain."]
[null,null,"Décrire des œuvres d’art, en proposer une compréhension personnelle argumentée."]
[2,"EDUCATION MUSICALE","CHANTER ET INTERPRETER",{"$f":"SUM(D172:D173)/$A171","v":0},0,0,0,0,0,0,0,0,0,0,0,0,0,0,0,0,0,0,0,0,0,0,0,0,0,0,0,0,0,0,0,0]
[null,null,"Reproduire et interpréter un modèle mélodique et rythmique."]
[null,null,"Interpréter un répertoire varié avec expressivité."]
[3,null,"ECOUTER, COMPARER ET COMMENTER",{"$f":"SUM(D175:D177)/$A174","v":0},0,0,0,0,0,0,0,0,0,0,0,0,0,0,0,0,0,0,0,0,0,0,0,0,0,0,0,0,0,0,0,0]
[null,null,"Décrire et comparer des éléments sonores issus de contextes musicaux différents."]
[null,null,"Identifier et nommer ressemblances et différences dans deux extraits musicaux."]
[null,null,"Identifier quelques caractéristiques qui inscrivent une œuvre musicale dans une aire géographique ou culturelle et dans un temps historique contemporain, proche ou lointain."]
[2,null,"EXPLORER, IMAGINER",{"$f":"SUM(D179:D180)/$A178","v":0},0,0,0,0,0,0,0,0,0,0,0,0,0,0,0,0,0,0,0,0,0,0,0,0,0,0,0,0,0,0,0,0]
[null,null,"Imaginer l’organisation de différents éléments sonores."]
[null,null,"Faire des propositions personnelles lors de moments de création, d’invention et d’interprétation."]
[2,null,"ECHANGER, PARTAGER",{"$f":"SUM(D182:D183)/$A181","v":0},{"$f":"SUM(E182:E183)/$A181","v":0},0,0,0,0,0,0,0,0,0,0,0,0,0,0,0,0,0,0,0,0,0,0,0,0,0,0,0,0,0,0,0]
[null,null,"Argumenter un jugement sur une musique."]
[null,null,"Écouter et respecter le point de vue des autres et l’expression de leur sensibilité."]
[null,null,"HISTOIRE DES ARTS"]
[1,null,"Identifier : donner un avis argumenté sur ce que représente ou exprime une œuvre d’art. "]
[1,null,"Analyser : dégager d’une œuvre d’art, par l’observation ou l’écoute, ses principales caractéristiques techniques et formelles."]
[1,null,"Situer : relier des caractéristiques d’une œuvre d’art à des usages ainsi qu’au contexte historique et culturel de sa création."]
[1,null,"Se repérer dans un musée, un lieu d’art, un site patrimonial."]
[3,"EPS","DEVELOPPER SA MOTRICITE, LE LANGAGE DU CORPS ",{"$f":"SUM(D190:D192)/$A189","v":0},0,0,0,0,0,0,0,0,0,0,0,0,0,0,0,0,0,0,0,0,0,0,0,0,0,0,0,0,0,0,0,0]
[null,null,"Adapter sa motricité à des situations variées."]
[null,null,"Acquérir des techniques spécifiques pour améliorer son efficacité."]
[null,null,"Mobiliser différentes ressources (physiologique, biomécanique, psychologique, émotionnelle) pour agir de manière efficiente."]
[3,null,"S’APPROPRIER LES MÉTHODES ET OUTILS POUR APPRENDRE",{"$f":"SUM(D194:D196)/$A193","v":0},0,0,0,0,0,0,0,0,0,0,0,0,0,0,0,0,0,0,0,0,0,0,0,0,0,0,0,0,0,0,0,0]
[null,null,"Apprendre par l’action, l’observation, l’analyse de son activité et de celle des autres. "]
[null,null,"Répéter un geste pour le stabiliser et le rendre plus efficace."]
[null,null,"Utiliser des outils numériques pour observer, évaluer et modifier ses actions."]
[4,null,"PARTAGER DES RÈGLES, ASSUMER DES RÔLES ",{"$f":"SUM(D198:D201)/$A197","v":0},{"$f":"SUM(E198:E201)/$A197","v":0},0,0,0,0,0,0,0,0,0,0,0,0,0,0,0,0,0,0,0,0,0,0,0,0,0,0,0,0,0,0,0]
[null,null,"Assumer les rôles sociaux  (joueur, arbitre,…)."]
[null,null,"Comprendre, respecter et faire respecter règles et règlements."]
[null,null,"Assurer sa sécurité et celle d’autrui dans des situations variées."]
[null,null,"S’engager dans les activités sportives et artistiques collectives."]
[3,null,"ENTRETENIR SA SANTÉ ",{"$f":"SUM(D203:D205)/$A202","v":0},0,0,0,0,0,0,0,0,0,0,0,0,0,0,0,0,0,0,0,0,0,0,0,0,0,0,0,0,0,0,0,0]
[null,null,"Évaluer la quantité et la qualité de son activité physique quotidienne dans et hors l’école."]
[null,null,"Connaitre et appliquer des principes d’une bonne hygiène de vie."]
[null,null,"Adapter l’intensité de son engagement physique à ses possibilités pour ne pas se mettre en danger."]
[2,null,"S’APPROPRIER UNE CULTURE PHYSIQUE SPORTIVE ET ARTISTIQUE ",{"$f":"SUM(D207:D208)/$A206","v":0},0,0,0,0,0,0,0,0,0,0,0,0,0,0,0,0,0,0,0,0,0,0,0,0,0,0,0,0,0,0,0,0]
[null,null,"Savoir situer des performances à l’échelle de la performance humaine."]
[null,null,"Comprendre et respecter l’environnement des pratiques physiques et sportives."]
[6,"EMC","ENSEIGNEMENT CIVIQUE ET MORAL",{"$f":"SUM(D210:D215)/$A209","v":0},{"$f":"SUM(E210:E215)/$A209","v":0},0,0,0,0,0,0,0,0,0,0,0,0,0,0,0,0,0,0,0,0,0,0,0,0,0,0,0,0,0,0,0]
[null,null," Identifier et partager des émotions, des sentiments dans des situations et à propos d'objets diversifiés."]
[null,null,"Se situer et s'exprimer en respectant les codes de la communication orale, les règles de l'échange et le statut de l'interlocuteur."]
[null,null,"Prendre soin de soi et des autres."]
[null,null,"Accepter les différences. "]
[null,null,"Identifier les symboles de la République présents dans l'école. "]
[null,null,"Apprendre à coopérer. "]

{"sheet":"Socle","index":8,"n_rows":26,"n_cols":85,"rows_kept":26,"merged":[[5,45,9,50],[7,3,7,42],[7,52,12,52],[7,53,12,53],[7,54,12,54],[7,55,12,55],[7,56,12,56],[7,57,12,57],[7,58,12,58],[7,59,12,59],[7,60,12,60],[7,61,12,61],[7,62,12,62],[7,63,12,63],[7,64,12,64],[7,65,12,65],[7,66,12,66],[7,67,12,67],[7,68,12,68],[7,69,12,69],[7,70,12,70],[7,71,12,71],[7,72,12,72],[7,73,12,73],[7,74,12,74],[7,75,12,75],[7,76,12,76],[7,77,12,77],[7,78,12,78],[7,79,12,79],[7,80,12,80],[7,81,12,81],[7,82,12,82],[7,83,12,83],[7,84,12,84],[22,3,22,42]]}
[{"$nulls":52},1,{"$f":"BA1+1","v":2},{"$f":"BB1+1","v":3},4,5,6,7,8,9,10,11,12,13,14,15,16,17,18,19,20,21,22,23,24,25,26,27,28,29,30,31,32,33]
[{"$nulls":6},{"$f":"Période!AU1","v":"A"},{"$f":"Période!AU2","v":"B"},{"$f":"Période!AU3","v":"C"},null,{"v":1,"d":"1 "},null,{"v":1,"d":"1 "},{"v":3,"d":"3 "},{"$f":"INDEX(NOMS,nomenfant,1)","v":"Marc  Aurèle"},{"$nulls":4},{"v":5,"d":"5 "},{"$nulls":8},{"v":2,"d":"2 "},{"$nulls":6},{"v":1,"d":"1 "}]
[]
[]
[{"$nulls":52},1,{"$f":"BA5+1","v":2},{"$f":"BB5+1","v":3},4,5,6,7,8,9,10,11,12,13,14,15,16,17,18,19,20,21,22,23,24,25,26,27,28,29,30,31,32,33]
[{"$nulls":3},{"$f":"CONCATENATE(\"Ecole  \"&ecole)","v":"Ecole  Léonard de Vinci"},{"$nulls":41}," VALIDER LE SOCLE\n\nQuand vous cliquez sur le bouton ci dessus, les compétences du socle sont calculées, ou mise à jour sur les résultats de l'année. \n\n"]
[{"$nulls":3},{"$f":"CONCATENATE(\"Année scolaire: \"&annee)","v":"Année scolaire: 2016   2017"}]
[{"$nulls":3},"Attestation de maîtrise des connaissances et compétences et de culture\nCYCLE 2",{"$nulls":48},{"$f":"IF(ISBLANK(INDEX(nom,lignenom,1)),\"\",(INDEX(nom,lignenom,1))&\" \" &(INDEX(prénom,lignenom,1)))","v":"Aurèle Prénom"},"Lenoir Marc","Léglise Jérôme","Samarahoui Fabien","Maha Aicha","","","","","","","","","","","","","","","","","","","","","","","","","","","",""]
[]
[{"$nulls":3},{"$f":"O2","v":"Marc  Aurèle"}]
[]
[{"$nulls":4},1,2,3,4,5,6,7,8,9,10,11,12,13,14,15,16,17,{"$nulls":7},18]
[{"$nulls":39},"D","C","B","A"]
[{"$nulls":3},"Langue française à l'oral et à l'écrit",{"$f":"IF(INDEX(synt,5,nomenfant)=\"\",\"\",INDEX(synt,5,nomenfant))","v":{"v":1,"d":"1.00"}},{"$f":"IF(INDEX(synt,10,nomenfant)=\"\",\"\",INDEX(synt,10,nomenfant))","v":{"v":1,"d":"1.00"}},{"$f":"IF(INDEX(synt,15,nomenfant)=\"\",\"\",INDEX(synt,15,nomenfant))","v":{"v":1,"d":"1.00"}},{"$f":"IF(INDEX(synt,22,nomenfant)=\"\",\"\",INDEX(synt,22,nomenfant))","v":{"v":0,"d":"0.00"}},{"$f":"IF(INDEX(synt,130,nomenfant)=\"\",\"\",INDEX(synt,130,nomenfant))","v":{"v":0,"d":"0.00"}},{"$f":"IF(INDEX(synt,134,nomenfant)=\"\",\"\",INDEX(synt,134,nomenfant))","v":{"v":0,"d":"0.00"}},{"$f":"IF(INDEX(synt,139,nomenfant)=\"\",\"\",INDEX(synt,139,nomenfant))","v":{"v":0,"d":"0.00"}},{"$f":"IF(INDEX(synt,143,nomenfant)=\"\",\"\",INDEX(synt,143,nomenfant))","v":{"v":0.5,"d":"0.50"}},{"$f":"IF(INDEX(synt,146,nomenfant)=\"\",\"\",INDEX(synt,146,nomenfant))","v":{"v":1,"d":"1.00"}},{"$f":"IF(INDEX(synt,150,nomenfant)=\"\",\"\",INDEX(synt,150,nomenfant))","v":{"v":0,"d":"0.00"}},{"$f":"IF(INDEX(synt,153,nomenfant)=\"\",\"\",INDEX(synt,153,nomenfant))","v":{"v":0,"d":"0.00"}},{"$f":"IF(INDEX(synt,163,nomenfant)=\"\",\"\",INDEX(synt,163,nomenfant))","v":{"v":0,"d":"0.00"}},{"$f":"IF(INDEX(synt,167,nomenfant)=\"\",\"\",INDEX(synt,167,nomenfant))","v":{"v":0,"d":"0.00"}},{"$f":"IF(INDEX(synt,171,nomenfant)=\"\",\"\",INDEX(synt,171,nomenfant))","v":{"v":0,"d":"0.00"}},{"$f":"IF(INDEX(synt,174,nomenfant)=\"\",\"\",INDEX(synt,174,nomenfant))","v":{"v":0,"d":"0.00"}},{"$f":"IF(INDEX(synt,178,nomenfant)=\"\",\"\",INDEX(synt,178,nomenfant))","v":{"v":0,"d":"0.00"}},{"$f":"IF(INDEX(synt,181,nomenfant)=\"\",\"\",INDEX(synt,181,nomenfant))","v":{"v":0,"d":"0.00"}},{"$f":"IF(INDEX(synt,185,nomenfant)=\"\",\"\",INDEX(synt,185,nomenfant))","v":""},{"$f":"IF(INDEX(synt,186,nomenfant)=\"\",\"\",INDEX(synt,186,nomenfant))","v":""},{"$f":"IF(INDEX(synt,181,nomenfant)=\"\",\"\",INDEX(synt,181,nomenfant))","v":{"v":0,"d":"0.00"}},{"$f":"IF(INDEX(synt,187,nomenfant)=\"\",\"\",INDEX(synt,187,nomenfant))","v":""},{"$f":"IF(INDEX(synt,189,nomenfant)=\"\",\"\",INDEX(synt,189,nomenfant))","v":{"v":0,"d":"0.00"}},{"$f":"IF(INDEX(synt,55,nomenfant)=\"\",\"\",INDEX(synt,55,nomenfant))","v":{"v":0,"d":"0.00"}},{"$f":"IF(INDEX(synt,68,nomenfant)=\"\",\"\",INDEX(synt,68,nomenfant))","v":{"v":0,"d":"0.00"}},{"$f":"IF(INDEX(synt,73,nomenfant)=\"\",\"\",INDEX(synt,73,nomenfant))","v":{"v":0,"d":"0.00"}},{"$f":"IF(INDEX(synt,77,nomenfant)=\"\",\"\",INDEX(synt,77,nomenfant))","v":{"v":0,"d":"0.00"}},{"$f":"IF(INDEX(synt,82,nomenfant)=\"\",\"\",INDEX(synt,82,nomenfant))","v":{"v":0,"d":"0.00"}},{"$f":"IF(INDEX(synt,113,nomenfant)=\"\",\"\",INDEX(synt,113,nomenfant))","v":{"v":0,"d":"0.00"}},{"$f":"IF(INDEX(synt,32,nomenfant)=\"\",\"\",INDEX(synt,32,nomenfant))","v":{"v":0,"d":"0.00"}},{"$f":"IF(INDEX(synt,41,nomenfant)=\"\",\"\",INDEX(synt,41,nomenfant))","v":{"v":0,"d":"0.00"}},{"$f":"IF(INDEX(synt,52,nomenfant)=\"\",\"\",INDEX(synt,52,nomenfant))","v":{"v":0,"d":"0.00"}},null,{"v":19,"d":"19 "},{"$f":"SUM(E14:AI14)/AK14","v":{"v":0.23684210526315788,"d":"0.24"}},null,{"$f":"IF(AL14<0.3,\"x\",\"\")","v":"x"},{"$f":"IF(AND($AL14>0.3, $AL14 <0.5),\"x\",\"\")","v":""},{"$f":"IF(AND($AL14>0.5, $AL14 <0.8),\"x\",\"\")","v":""},{"$f":"IF($AL14>0.8,\"x\",\"\")","v":""},null,0,null,0,0,0,0,0]
[{"$nulls":3},"Langage mathématiques, scientifique et informatiques",{"$f":"IF(INDEX(synt,28,nomenfant)=\"\",\"\",INDEX(synt,28,nomenfant))","v":{"v":0,"d":"0.00"}},{"$f":"IF(INDEX(synt,32,nomenfant)=\"\",\"\",INDEX(synt,32,nomenfant))","v":{"v":0,"d":"0.00"}},{"$f":"IF(INDEX(synt,41,nomenfant)=\"\",\"\",INDEX(synt,41,nomenfant))","v":{"v":0,"d":"0.00"}},{"$f":"IF(INDEX(synt,47,nomenfant)=\"\",\"\",INDEX(synt,47,nomenfant))","v":{"v":0,"d":"0.00"}},{"$f":"IF(INDEX(synt,28,nomenfant)=\"\",\"\",INDEX(synt,28,nomenfant))","v":{"v":0,"d":"0.00"}},{"$f":"IF(INDEX(synt,52,nomenfant)=\"\",\"\",INDEX(synt,52,nomenfant))","v":{"v":0,"d":"0.00"}},{"$nulls":26},{"v":6,"d":"6 "},{"v":0,"d":"0.00"},null,{"$f":"IF(AL15<0.3,\"x\",\"\")","v":"x"},{"$f":"IF(AND($AL15>0.3, $AL15 <0.5),\"x\",\"\")","v":""},{"$f":"IF(AND($AL15>0.5, $AL15 <0.8),\"x\",\"\")","v":""},{"$f":"IF($AL15>0.8,\"x\",\"\")","v":""}]
[{"$nulls":3},"Représentation du monde et activité humaine ",{"$f":"IF(INDEX(synt,10,nomenfant)=\"\",\"\",INDEX(synt,10,nomenfant))","v":{"v":1,"d":"1.00"}},{"$f":"IF(INDEX(synt,150,nomenfant)=\"\",\"\",INDEX(synt,150,nomenfant))","v":{"v":0,"d":"0.00"}},{"$f":"IF(INDEX(synt,153,nomenfant)=\"\",\"\",INDEX(synt,153,nomenfant))","v":{"v":0,"d":"0.00"}},{"$f":"IF(INDEX(synt,158,nomenfant)=\"\",\"\",INDEX(synt,158,nomenfant))","v":{"v":0,"d":"0.00"}},{"$f":"IF(INDEX(synt,167,nomenfant)=\"\",\"\",INDEX(synt,167,nomenfant))","v":{"v":0,"d":"0.00"}},{"$f":"IF(INDEX(synt,171,nomenfant)=\"\",\"\",INDEX(synt,171,nomenfant))","v":{"v":0,"d":"0.00"}},{"$f":"IF(INDEX(synt,174,nomenfant)=\"\",\"\",INDEX(synt,174,nomenfant))","v":{"v":0,"d":"0.00"}},{"$f":"IF(INDEX(synt,185,nomenfant)=\"\",\"\",INDEX(synt,185,nomenfant))","v":""},{"$f":"IF(INDEX(synt,186,nomenfant)=\"\",\"\",INDEX(synt,186,nomenfant))","v":""},{"$f":"IF(INDEX(synt,187,nomenfant)=\"\",\"\",INDEX(synt,187,nomenfant))","v":""},{"$f":"IF(INDEX(synt,188,nomenfant)=\"\",\"\",INDEX(synt,188,nomenfant))","v":""},{"$f":"IF(INDEX(synt,206,nomenfant)=\"\",\"\",INDEX(synt,206,nomenfant))","v":{"v":0,"d":"0.00"}},{"$f":"IF(INDEX(synt,55,nomenfant)=\"\",\"\",INDEX(synt,55,nomenfant))","v":{"v":0,"d":"0.00"}},{"$f":"IF(INDEX(synt,82,nomenfant)=\"\",\"\",INDEX(synt,82,nomenfant))","v":{"v":0,"d":"0.00"}},{"$f":"IF(INDEX(synt,100,nomenfant)=\"\",\"\",INDEX(synt,100,nomenfant))","v":{"v":0,"d":"0.00"}},{"$f":"IF(INDEX(synt,124,nomenfant)=\"\",\"\",INDEX(synt,124,nomenfant))","v":{"v":0,"d":"0.00"}},{"$f":"IF(INDEX(synt,127,nomenfant)=\"\",\"\",INDEX(synt,127,nomenfant))","v":{"v":0,"d":"0.00"}},{"$nulls":15},{"v":13,"d":"13 "},{"v":0.07692307692307693,"d":"0.08"},null,"x","","",""]
[{"$nulls":3},"Langue étrangère et régionale",{"$f":"IF(INDEX(synt,130,nomenfant)=\"\",\"\",INDEX(synt,130,nomenfant))","v":{"v":0,"d":"0.00"}},{"$f":"IF(INDEX(synt,134,nomenfant)=\"\",\"\",INDEX(synt,134,nomenfant))","v":{"v":0,"d":"0.00"}},{"$f":"IF(INDEX(synt,139,nomenfant)=\"\",\"\",INDEX(synt,139,nomenfant))","v":{"v":0,"d":"0.00"}},{"$f":"IF(INDEX(synt,143,nomenfant)=\"\",\"\",INDEX(synt,143,nomenfant))","v":{"v":0.5,"d":"0.50"}},{"$f":"IF(INDEX(synt,146,nomenfant)=\"\",\"\",INDEX(synt,146,nomenfant))","v":{"v":1,"d":"1.00"}},{"$f":"IF(INDEX(synt,150,nomenfant)=\"\",\"\",INDEX(synt,150,nomenfant))","v":{"v":0,"d":"0.00"}},{"$nulls":26},{"v":4,"d":"4 "},{"v":0.375,"d":"0.38"},null,"","x","",""]
[{"$nulls":3},"Les systèmes naturels et les systèmes techniques ",{"$f":"IF(INDEX(synt,153,nomenfant)=\"\",\"\",INDEX(synt,153,nomenfant))","v":{"v":0,"d":"0.00"}},{"$f":"IF(INDEX(synt,202,nomenfant)=\"\",\"\",INDEX(synt,202,nomenfant))","v":{"v":0,"d":"0.00"}},{"$f":"IF(INDEX(synt,93,nomenfant)=\"\",\"\",INDEX(synt,93,nomenfant))","v":{"v":0,"d":"0.00"}},{"$f":"IF(INDEX(synt,100,nomenfant)=\"\",\"\",INDEX(synt,100,nomenfant))","v":{"v":0,"d":"0.00"}},{"$f":"IF(INDEX(synt,28,nomenfant)=\"\",\"\",INDEX(synt,28,nomenfant))","v":{"v":0,"d":"0.00"}},{"$f":"IF(INDEX(synt,32,nomenfant)=\"\",\"\",INDEX(synt,32,nomenfant))","v":{"v":0,"d":"0.00"}},{"$f":"IF(INDEX(synt,47,nomenfant)=\"\",\"\",INDEX(synt,47,nomenfant))","v":{"v":0,"d":"0.00"}},{"$f":"IF(INDEX(synt,28,nomenfant)=\"\",\"\",INDEX(synt,28,nomenfant))","v":{"v":0,"d":"0.00"}},{"$nulls":24},{"v":10,"d":"10 "},{"v":0,"d":"0.00"},null,"x","","",""]
[{"$nulls":3},"Langage des arts et du corps ",{"$f":"IF(INDEX(synt,153,nomenfant)=\"\",\"\",INDEX(synt,153,nomenfant))","v":{"v":0,"d":"0.00"}},{"$f":"IF(INDEX(synt,202,nomenfant)=\"\",\"\",INDEX(synt,202,nomenfant))","v":{"v":0,"d":"0.00"}},{"$f":"IF(INDEX(synt,93,nomenfant)=\"\",\"\",INDEX(synt,93,nomenfant))","v":{"v":0,"d":"0.00"}},{"$f":"IF(INDEX(synt,100,nomenfant)=\"\",\"\",INDEX(synt,100,nomenfant))","v":{"v":0,"d":"0.00"}},{"$f":"IF(INDEX(synt,28,nomenfant)=\"\",\"\",INDEX(synt,28,nomenfant))","v":{"v":0,"d":"0.00"}},{"$f":"IF(INDEX(synt,32,nomenfant)=\"\",\"\",INDEX(synt,32,nomenfant))","v":{"v":0,"d":"0.00"}},{"$f":"IF(INDEX(synt,47,nomenfant)=\"\",\"\",INDEX(synt,47,nomenfant))","v":{"v":0,"d":"0.00"}},{"$f":"IF(INDEX(synt,28,nomenfant)=\"\",\"\",INDEX(synt,28,nomenfant))","v":{"v":0,"d":"0.00"}},{"$nulls":24},{"v":8,"d":"8 "},{"v":0,"d":"0.00"},null,"x","","",""]
[{"$nulls":3},"Formation de la personne et du citoyen ",{"$f":"IF(INDEX(synt,5,nomenfant)=\"\",\"\",INDEX(synt,5,nomenfant))","v":{"v":1,"d":"1.00"}},{"$f":"IF(INDEX(synt,134,nomenfant)=\"\",\"\",INDEX(synt,134,nomenfant))","v":{"v":0,"d":"0.00"}},{"$f":"IF(INDEX(synt,150,nomenfant)=\"\",\"\",INDEX(synt,150,nomenfant))","v":{"v":0,"d":"0.00"}},{"$f":"IF(INDEX(synt,158,nomenfant)=\"\",\"\",INDEX(synt,158,nomenfant))","v":{"v":0,"d":"0.00"}},{"$f":"IF(INDEX(synt,174,nomenfant)=\"\",\"\",INDEX(synt,174,nomenfant))","v":{"v":0,"d":"0.00"}},{"$f":"IF(INDEX(synt,181,nomenfant)=\"\",\"\",INDEX(synt,181,nomenfant))","v":{"v":0,"d":"0.00"}},{"$f":"IF(INDEX(synt,185,nomenfant)=\"\",\"\",INDEX(synt,185,nomenfant))","v":""},{"$f":"IF(INDEX(synt,186,nomenfant)=\"\",\"\",INDEX(synt,186,nomenfant))","v":""},{"$f":"IF(INDEX(synt,197,nomenfant)=\"\",\"\",INDEX(synt,197,nomenfant))","v":{"v":0,"d":"0.00"}},{"$f":"IF(INDEX(synt,89,nomenfant)=\"\",\"\",INDEX(synt,89,nomenfant))","v":{"v":0,"d":"0.00"}},{"$f":"IF(INDEX(synt,124,nomenfant)=\"\",\"\",INDEX(synt,124,nomenfant))","v":{"v":0,"d":"0.00"}},{"$f":"IF(INDEX(synt,47,nomenfant)=\"\",\"\",INDEX(synt,47,nomenfant))","v":{"v":0,"d":"0.00"}},{"$f":"IF(INDEX(synt,52,nomenfant)=\"\",\"\",INDEX(synt,52,nomenfant))","v":{"v":0,"d":"0.00"}},{"$nulls":19},{"v":13,"d":"13 "},{"v":0.07692307692307693,"d":"0.08"},null,"x","","",""]
[{"$nulls":3},"Méthodes et outils pour apprendre ",{"$f":"IF(INDEX(synt,5,nomenfant)=\"\",\"\",INDEX(synt,5,nomenfant))","v":{"v":1,"d":"1.00"}},{"$f":"IF(INDEX(synt,22,nomenfant)=\"\",\"\",INDEX(synt,22,nomenfant))","v":{"v":0,"d":"0.00"}},{"$f":"IF(INDEX(synt,130,nomenfant)=\"\",\"\",INDEX(synt,130,nomenfant))","v":{"v":0,"d":"0.00"}},{"$f":"IF(INDEX(synt,134,nomenfant)=\"\",\"\",INDEX(synt,134,nomenfant))","v":{"v":0,"d":"0.00"}},{"$f":"IF(INDEX(synt,139,nomenfant)=\"\",\"\",INDEX(synt,139,nomenfant))","v":{"v":0,"d":"0.00"}},{"$f":"IF(INDEX(synt,143,nomenfant)=\"\",\"\",INDEX(synt,143,nomenfant))","v":{"v":0.5,"d":"0.50"}},{"$f":"IF(INDEX(synt,146,nomenfant)=\"\",\"\",INDEX(synt,146,nomenfant))","v":{"v":1,"d":"1.00"}},{"$f":"IF(INDEX(synt,150,nomenfant)=\"\",\"\",INDEX(synt,150,nomenfant))","v":{"v":0,"d":"0.00"}},{"$f":"IF(INDEX(synt,153,nomenfant)=\"\",\"\",INDEX(synt,153,nomenfant))","v":{"v":0,"d":"0.00"}},{"$f":"IF(INDEX(synt,158,nomenfant)=\"\",\"\",INDEX(synt,158,nomenfant))","v":{"v":0,"d":"0.00"}},{"$f":"IF(INDEX(synt,186,nomenfant)=\"\",\"\",INDEX(synt,186,nomenfant))","v":""},{"$f":"IF(INDEX(synt,188,nomenfant)=\"\",\"\",INDEX(synt,188,nomenfant))","v":""},{"$f":"IF(INDEX(synt,193,nomenfant)=\"\",\"\",INDEX(synt,193,nomenfant))","v":{"v":0,"d":"0.00"}},{"$f":"IF(INDEX(synt,55,nomenfant)=\"\",\"\",INDEX(synt,55,nomenfant))","v":{"v":0,"d":"0.00"}},{"$f":"IF(INDEX(synt,61,nomenfant)=\"\",\"\",INDEX(synt,61,nomenfant))","v":{"v":0,"d":"0.00"}},{"$f":"IF(INDEX(synt,68,nomenfant)=\"\",\"\",INDEX(synt,68,nomenfant))","v":{"v":0,"d":"0.00"}},{"$f":"IF(INDEX(synt,73,nomenfant)=\"\",\"\",INDEX(synt,73,nomenfant))","v":{"v":0,"d":"0.00"}},{"$f":"IF(INDEX(synt,77,nomenfant)=\"\",\"\",INDEX(synt,77,nomenfant))","v":{"v":0,"d":"0.00"}},{"$f":"IF(INDEX(synt,82,nomenfant)=\"\",\"\",INDEX(synt,82,nomenfant))","v":{"v":0,"d":"0.00"}},{"$f":"IF(INDEX(synt,89,nomenfant)=\"\",\"\",INDEX(synt,89,nomenfant))","v":{"v":0,"d":"0.00"}},{"$f":"IF(INDEX(synt,106,nomenfant)=\"\",\"\",INDEX(synt,106,nomenfant))","v":{"v":0,"d":"0.00"}},{"$f":"IF(INDEX(synt,118,nomenfant)=\"\",\"\",INDEX(synt,118,nomenfant))","v":{"v":0,"d":"0.00"}},{"$f":"IF(INDEX(synt,32,nomenfant)=\"\",\"\",INDEX(synt,32,nomenfant))","v":{"v":0,"d":"0.00"}},{"$f":"IF(INDEX(synt,47,nomenfant)=\"\",\"\",INDEX(synt,47,nomenfant))","v":{"v":0,"d":"0.00"}},{"$nulls":8},{"v":13,"d":"13 "},{"v":0.19230769230769232,"d":"0.19"},null,"x","","","",null,0,null,0,0,0,0,0]
[]
[{"$nulls":3},"A :  Très bonne maîtrise\nB: Maîtrise satisfaisante\nC:            Maîtrise fragile\nD:  Maîtrise insuffisante"]
[]
[{"$nulls":3},"Signature:",{"$nulls":40},3]
[{"$nulls":44},3]

{"sheet":"Bulletin","index":9,"n_rows":242,"n_cols":12,"rows_kept":242,"hidden":true,"merged":[[7,3,7,4],[8,3,8,4],[9,3,9,4],[9,6,12,6],[9,7,12,7],[9,8,12,8],[9,9,12,9],[10,3,10,5],[11,3,11,5],[13,2,35,2],[36,2,60,2],[63,2,100,2],[70,13,90,13],[91,13,98,13],[99,13,116,13],[101,2,137,2],[117,13,128,13],[129,13,145,13],[138,2,160,2],[146,13,152,13],[161,2,178,2],[179,2,191,2],[192,2,196,2],[197,2,216,2],[217,2,223,2]]}
[{"$nulls":10},2,2]
[]
[]
[]
[]
[{"$nulls":3},{"$f":"CONCATENATE(\"Classe \"&classe)","v":"Classe CM2"},{"$f":"CONCATENATE(\"Circonscription  \"&IEN)","v":"Circonscription  Firenza "}]
[{"$nulls":3},{"$f":"CONCATENATE(\"Ecole \"&ecole&\" \"  &\"- \" &adresse &\" -   \" &ville)","v":"Ecole Léonard de Vinci -  -   Sienna"},{"$f":"CONCATENATE(\"Enseignant : \"&enseignant)","v":"Enseignant : M. DURANT"}]
[{"$nulls":3},{"$f":"IF(INDEX(NOMS,Nenfant,1)=\"\",0,INDEX(NOMS,Nenfant,1))","v":"Jérôme  Lenoir"}]
[{"$nulls":3},{"$f":"IF(J9=\"\",\"\",\"né(e)  le  \" & TEXT(J9,\"jj/mm/aaa\"))","v":"né(e)  le  04/07/1998"},{"$nulls":5},{"$f":"IF(INDEX(date,Nenfant,1)=\"\",0,INDEX(date,Nenfant,1))","v":35980}]
[{"$nulls":3},"SUIVI DES ACQUIS SCOLAIRES  PERIODE 1 ",null,null,"Non atteint","Partiellement atteint","Atteint","Dépassé"]
[]
[{"$nulls":3},{"$f":"CONCATENATE(\"Année scolaire: \"&annee)","v":"Année scolaire: 2016   2017"}]
[{"$nulls":3},"COMPETENCES EVALUEES","DETAIL DE LA COMPETENCE"]
[5,null,"FRANCAIS","LANGAGE ORAL",{"$nulls":6},{"$f":"IF(COUNTIF(G14:J14,\">0\"),\"X\",\"\")","v":""}]
[{"$f":"A14+1","v":6},null,null,"Écouter pour comprendre un message oral, un propos, un discours, un texte lu.",{"$nulls":6},{"$f":"IF(COUNTIF(G15:J15,\"X\"),\"X\",\"\")","v":""}]
[{"$f":"A15+1","v":7},null,null,"Parler en prenant en compte son auditoire.",{"$nulls":6},""]
[8,null,null,"Participer à des échanges dans des situations diversifiées.",{"$nulls":6},""]
[9,null,null,"Adopter une attitude critique par rapport au langage produit.",{"$nulls":6},""]
[10,null,null,"LIRE",{"$nulls":6},{"$f":"IF(COUNTIF(G19:J19,\">0\"),\"X\",\"\")","v":""}]
[11,null,null,"Lire avec fluidité.",{"$nulls":6},""]
[12,null,null,"Comprendre un texte littéraire et l’interpréter.",{"$nulls":6},""]
[13,null,null,"Comprendre des textes, des documents et des images et les interpréter. ",{"$nulls":6},""]
[14,null,null,"Contrôler sa compréhension, être un lecteur autonome.",{"$nulls":6},""]
[15,null,null,"ECRIRE",{"$nulls":6},""]
[16,null,null,"Écrire à la main de manière fluide et efficace.",{"$nulls":6},{"$f":"IF(COUNTIF(G25:J25,\">0\"),\"X\",\"\")","v":""}]
[17,null,null,"Écrire avec un clavier rapidement et efficacement. ",{"$nulls":6},""]
[18,null,null,"Recourir à l’écriture pour réfléchir et pour apprendre. ",{"$nulls":6},""]
[19,null,null,"Produire des écrits variés.",{"$nulls":6},""]
[20,null,null,"Réécrire à partir de nouvelles consignes ou faire évoluer son texte.",{"$nulls":6},{"$f":"IF(COUNTIF(G29:J29,\">0\"),\"X\",\"\")","v":""}]
[21,null,null,"Prendre en compte les normes de l’écrit pour formuler, transcrire et réviser.",{"$nulls":6},""]
[22,null,null,"ETUDE DE LA LANGUE",{"$nulls":6},""]
[23,null,null,"Maitriser les relations entre l’oral et l’écrit.",{"$nulls":6},""]
[24,null,null,"Acquérir la structure, le sens et l’orthographe des mots.",{"$nulls":6},""]
[25,null,null,"Maitriser la forme des mots en lien avec la syntaxe.",{"$nulls":6},""]
[26,null,null,"Observer le fonctionnement du verbe et l’orthographier.",{"$nulls":6},""]
[27,null,null,"Identifier les constituants d’une phrase simple en relation avec son sens ; distinguer phrase simple et phrase complexe.",{"$nulls":6},""]
[28,null,"MATHEMATIQUES","NOMBRES ET CALCUL",{"$nulls":6},""]
[29,null,null,"Calculer avec des nombres décimaux.",{"$nulls":6},{"$f":"IF(COUNTIF(G38:J38,\">0\"),\"X\",\"\")","v":""}]
[30,null,null,"Contrôler la vraisemblance de ses résultats. ",{"$nulls":6},""]
[31,null,null,"Utiliser une calculatrice pour trouver ou vérifier un résultat.",{"$nulls":6},""]
[32,null,null,"CHERCHER",{"$nulls":6},""]
[33,null,null,"Prélever et organiser les informations nécessaires à la résolution de problèmes.",{"$nulls":6},""]
[34,null,null,"S’engager dans une démarche, observer, questionner, manipuler, expérimenter, émettre des hypothèses.",{"$nulls":6},{"$f":"IF(COUNTIF(G43:J43,\">0\"),\"X\",\"\")","v":""}]
[35,null,null,"Tester, essayer plusieurs pistes de résolution.",{"$nulls":6},""]
[{"$nulls":3},"REPRESENTER"]
[{"$nulls":3},"Utiliser des outils pour représenter un problème : dessins, schémas, diagrammes, graphiques, écritures avec parenthésages, …"]
[{"$nulls":3},"Produire et utiliser diverses représentations des fractions simples et des nombres décimaux."]
[{"$nulls":3},"Analyser une figure plane sous différents aspects (surface, contour de celle-ci, lignes et points)."]
[{"$nulls":3},"Reconnaitre et utiliser des premiers éléments de codages d’une figure plane ou d’un solide."]
[{"$nulls":3},"Utiliser et produire des représentations de solides et de situations spatiales."]
[{"$f":"A44+1","v":36},null,null,"MODELISER",{"$nulls":6},""]
[37,null,null,"Résoudre quelques problèmes issus de situations de la vie quotidienne. ",{"$nulls":6},""]
[38,null,null,"Reconnaitre et distinguer des problèmes relevant de situations additives, multiplicatives, de proportionnalité. ",{"$nulls":6},{"$f":"IF(COUNTIF(G53:J53,\">0\"),\"X\",\"\")","v":""}]
[39,null,null,"Reconnaitre des situations réelles pouvant être modélisées par des relations géométriques (alignement, parallélisme, perpendicularité, symétrie).",{"$nulls":6},""]
[40,null,null,"Utiliser des propriétés géométriques pour reconnaitre des objets.",{"$nulls":6},""]
[41,null,null,"RAISONNER",{"$nulls":6},""]
[42,null,null,"Résoudre des problèmes complexes",{"$nulls":6},{"$f":"IF(COUNTIF(G57:J57,\">0\"),\"X\",\"\")","v":""}]
[43,null,null,"En géométrie, passer progressivement de la perception au contrôle par les instruments pour amorcer des raisonnements s’appuyant uniquement sur des propriétés des figures et sur des relations entre objets.",{"$nulls":6},""]
[44,null,null,"Progresser collectivement dans une investigation en sachant prendre en compte le point de vue d’autrui.",{"$nulls":6},""]
[45,null,null,"Justifier ses affirmations et rechercher la validité des informations dont on dispose.",{"$nulls":6},{"$f":"IF(COUNTIF(G60:J60,\">0\"),\"X\",\"\")","v":""}]
[46,null,null,"COMMUNIQUER",{"$nulls":6},""]
[47,null,null,"Utiliser un vocabulaire adéquat et/ou des notations adaptées pour décrire une situation, exposer une argumentation.",{"$nulls":6},""]
[48,null,null,"Expliquer sa démarche ou son raisonnement, comprendre les explications d’un autre et argumenter dans l’échange.",{"$nulls":6},""]
[49,null,"HISTOIRE ET GEOGRAPHIE","SE REPERER DANS LE TEMPS, CONSTRUIRE DES REPERES HISTORIQUES",{"$nulls":6},{"$f":"IF(COUNTIF(G64:J64,\">0\"),\"X\",\"\")","v":""}]
[50,null,null,"Situer chronologiquement des grandes périodes historiques. ",{"$nulls":6},""]
[51,null,null,"Ordonner des faits les uns par rapport aux autres et les situer dans une époque ou une période donnée.",{"$nulls":6},""]
[52,null,null,"Manipuler et réinvestir le repère historique dans différents contextes.",{"$nulls":6},""]
[53,null,null,"Utiliser des documents donnant à voir une représentation du temps.",{"$nulls":6},""]
[54,null,null,"Mémoriser les repères historiques liés au programme",{"$nulls":6},{"$f":"IF(COUNTIF(G69:J69,\">0\"),\"X\",\"\")","v":""}]
[55,null,null,"SE REPERER DANS L'ESPACE, CONSTRUIRE DES REPERES GEOGRAPHIQUES",{"$nulls":6},""]
[56,null,null,"Nommer et localiser les grands repères géographiques.",{"$nulls":6},{"$f":"IF(COUNTIF(G71:J71,\">0\"),\"X\",\"\")","v":""}]
[57,null,null,"Nommer et localiser un lieu dans un espace géographique.",{"$nulls":6},""]
[58,null,null,"Nommer, localiser et caractériser des espaces.",{"$nulls":6},{"$f":"IF(COUNTIF(G73:J73,\">0\"),\"X\",\"\")","v":""}]
[59,null,null,"Situer des lieux et des espaces les uns par rapport aux autres.",{"$nulls":6},""]
[60,null,null,"Appréhender la notion d’échelle géographique.",{"$nulls":6},""]
[61,null,null,"Mémoriser les repères géographiques liés au programme.",{"$nulls":6},{"$f":"IF(COUNTIF(G76:J76,\">0\"),\"X\",\"\")","v":""}]
[62,null,null,"RAISONNER, JUSTIFIER UNE DEMARCHE ET LES CHOIX EFFECTUES",{"$nulls":6},""]
[63,null,null,"Poser des questions, se poser des questions.",{"$nulls":6},""]
[64,null,null,"Formuler des hypothèses.",{"$nulls":6},{"$f":"IF(COUNTIF(G79:J79,\">0\"),\"X\",\"\")","v":""}]
[65,null,null,"Vérifier.",{"$nulls":6},""]
[66,null,null,"Justifier.",{"$nulls":6},""]
[67,null,null,"S'INFORMER DANS LE MONDE NUMERIQUE",{"$nulls":6},""]
[68,null,null,"Connaitre différents systèmes d’information, les utiliser.",{"$nulls":6},""]
[69,null,null,"Trouver, sélectionner et exploiter des informations dans une ressource numérique.",{"$nulls":6},{"$f":"IF(COUNTIF(G84:J84,\">0\"),\"X\",\"\")","v":""}]
[70,null,null," Identifier la ressource numérique utilisée",{"$nulls":6},{"$f":"IF(COUNTIF(G85:J85,\"X\"),\"X\",\"\")","v":""}]
[{"$f":"A85+1","v":71},null,null,"COMPRENDRE UN DOCUMENT",{"$nulls":6},""]
[72,null,null,"Comprendre le sens général d’un document.",{"$nulls":6},{"$f":"IF(COUNTIF(G87:J87,\">0\"),\"X\",\"\")","v":""}]
[73,null,null,"Identifier le document et savoir pourquoi il doit être identifié.",{"$nulls":6},""]
[74,null,null,"Extraire des informations pertinentes pour répondre à une question.",{"$nulls":6},""]
[75,null,null,"Savoir que le document exprime un point de vue, identifier et questionner le sens implicite d’un document.",{"$nulls":6},""]
[76,null,null,"PRATIQUER DIFFERENTS LANGAGES EN HISTOIRE ET EN GEOGRAPHIE",{"$nulls":6},""]
[77,null,null,"Écrire pour structurer sa pensée et son savoir, pour argumenter et écrire pour communiquer et échanger.",{"$nulls":6},{"$f":"IF(COUNTIF(G92:J92,\">0\"),\"X\",\"\")","v":""}]
[78,null,null,"Reconnaitre un récit historique.",{"$nulls":6},""]
[79,null,null,"S’exprimer à l’oral pour penser, communiquer et échanger.",{"$nulls":6},{"$f":"IF(COUNTIF(G94:J94,\">0\"),\"X\",\"\")","v":""}]
[80,null,null,"S’approprier et utiliser un lexique historique et géographique approprié.",{"$nulls":6},""]
[81,null,null,"Réaliser ou compléter des productions graphiques.",{"$nulls":6},{"$f":"IF(COUNTIF(G96:J96,\">0\"),\"X\",\"\")","v":""}]
[82,null,null,"Utiliser des cartes analogiques et numériques à différentes échelles, des photographies de paysages ou de lieux.",{"$nulls":6},""]
[83,null,null,"COOPERER ET MUTUALISER",{"$nulls":6},{"$f":"IF(COUNTIF(G98:J98,\">0\"),\"X\",\"\")","v":""}]
[84,null,null,"Organiser son travail dans le cadre d’un groupe pour élaborer une tâche commune.",{"$nulls":6},""]
[85,null,null,"Travailler en commun pour faciliter les apprentissages individuels. ",{"$nulls":6},{"$f":"IF(COUNTIF(G100:J100,\">0\"),\"X\",\"\")","v":""}]
[86,null,null,"Apprendre à utiliser les outils numériques qui peuvent conduire à des réalisations collectives.",{"$nulls":6},""]
[87,null,"SCIENCES ET TECHNOLOGIE","PRATIQUE LA DEMARCHE SCIENTIFIQUE",{"$nulls":6},""]
[88,null,null,"Proposer, avec l’aide du professeur, une démarche pour résoudre un problème ou répondre à une question de nature scientifique ou technologique :",{"$nulls":6},""]
[89,null,null,"Formuler une question ou une problématique scientifique ou technologique simple ;",{"$nulls":6},""]
[90,null,null,"Proposer une ou des hypothèses pour répondre à une question ou un problème ",{"$nulls":6},{"$f":"IF(COUNTIF(G105:J105,\">0\"),\"X\",\"\")","v":""}]
[91,null,null,"Pproposer des expériences simples pour tester une hypothèse ;",{"$nulls":6},""]
[92,null,null,"Interpréter un résultat, en tirer une conclusion ;",{"$nulls":6},""]
[93,null,null,"Formaliser une partie de sa recherche sous une forme écrite ou orale.",{"$nulls":6},""]
[94,null,null,"PERCEVOIR, CREER , REALISER",{"$nulls":6},{"$f":"IF(COUNTIF(G109:J109,\">0\"),\"X\",\"\")","v":""}]
[95,null,null,"Identifier les évolutions des besoins et des objets techniques dans leur contexte.",{"$nulls":6},""]
[96,null,null,"Identifier les principales familles de matériaux.",{"$nulls":6},""]
[97,null,null,"Décrire le fonctionnement d’objets techniques, leurs fonctions et leurs composants.",{"$nulls":6},""]
[98,null,null,"Réaliser en équipe tout ou une partie d’un objet technique répondant à un besoin.",{"$nulls":6},{"$f":"IF(COUNTIF(G113:J113,\">0\"),\"X\",\"\")","v":""}]
[99,null,null,"Repérer et comprendre la communication et la gestion de l’information.",{"$nulls":6},""]
[100,null,null,"S'APPROPRIER DES OUTILS ET DES METHODES",{"$nulls":6},""]
[101,null,null,"Choisir ou utiliser le matériel adapté pour mener une observation, effectuer une mesure, réaliser une expérience ou une production. ",{"$nulls":6},""]
[102,null,null,"Faire le lien entre la mesure réalisée, les unités et l’outil utilisés.",{"$nulls":6},""]
[103,null,null,"Garder une trace écrite ou numérique des recherches, des observations et des expériences réalisées.",{"$nulls":6},{"$f":"IF(COUNTIF(G118:J118,\">0\"),\"X\",\"\")","v":""}]
[104,null,null,"Organiser seul ou en groupe un espace de réalisation expérimentale.",{"$nulls":6},""]
[105,null,null,"Effectuer des recherches bibliographiques simples et ciblées. Extraire les informations pertinentes d’un document et les mettre en relation pour répondre à une question.",{"$nulls":6},""]
[106,null,null,"Utiliser les outils mathématiques adaptés.",{"$nulls":6},{"$f":"IF(COUNTIF(G121:J121,\">0\"),\"X\",\"\")","v":""}]
[107,null,null,"PRATIQUER DES LANGAGES",{"$nulls":6},""]
[108,null,null,"Rendre compte des observations, expériences, hypothèses, conclusions en utilisant un vocabulaire précis.",{"$nulls":6},""]
[109,null,null,"Exploiter un document constitué de divers supports (texte, schéma, graphique, tableau, algorithme simple).",{"$nulls":6},{"$f":"IF(COUNTIF(G124:J124,\">0\"),\"X\",\"\")","v":""}]
[110,null,null,"Utiliser différents modes de représentation formalisés (schéma, dessin, croquis, tableau, graphique, texte). ",{"$nulls":6},""]
[111,null,null,"Expliquer un phénomène à l’oral et à l’écrit.",{"$nulls":6},""]
[112,null,null,"MOBILISER LES OUTILS NUMERIQUES",{"$nulls":6},{"$f":"IF(COUNTIF(G127:J127,\">0\"),\"X\",\"\")","v":""}]
[113,null,null,"Communiquer des résultats ;",{"$nulls":6},""]
[114,null,null,"Traiter des données ;",{"$nulls":6},""]
[115,null,null,"Simuler des phénomènes ;",{"$nulls":6},{"$f":"IF(COUNTIF(G130:J130,\">0\"),\"X\",\"\")","v":""}]
[116,null,null,"RIeprésenter des objets techniques.",{"$nulls":6},""]
[117,null,null,"Identifier des sources d’informations fiables.",{"$nulls":6},""]
[118,null,null,"ADOPTER UN COMPORTEMENT ETHIQUE ET RESPONSABLE",{"$nulls":6},""]
[119,null,null,"Relier des connaissances acquises en sciences et technologie à des questions de santé, de sécurité et d’environnement.",{"$nulls":6},{"$f":"IF(COUNTIF(G134:J134,\">0\"),\"X\",\"\")","v":""}]
[120,null,null,"Mettre en œuvre une action responsable et citoyenne, ",{"$nulls":6},""]
[121,null,null,"SE SITUER DANS L'ESPACE ET DANS LE TEMPS",{"$nulls":6},""]
[122,null,null,"Replacer des évolutions scientifiques et technologiques dans un contexte historique, géographique, économique et culturel.",{"$nulls":6},{"$f":"IF(COUNTIF(G137:J137,\">0\"),\"X\",\"\")","v":""}]
[123,null,null,"Se situer dans l’environnement et maitriser les notions d’échelle.",{"$nulls":6},""]
[124,null,"LVE","ECOUTER ET COMPRENDRE",{"$nulls":6},""]
[125,null,null,"Écouter et comprendre des messages oraux simples relevant de la vie quotidienne, des histoires simples. ",{"$nulls":6},""]
[126,null,null,"Exercer sa mémoire auditive à court et à long terme pour mémoriser des mots, des expressions courantes.",{"$nulls":6},{"$f":"IF(COUNTIF(G141:J141,\">0\"),\"X\",\"\")","v":""}]
[127,null,null,"Utiliser des indices sonores et visuels pour déduire le sens de mots inconnus, d’un message.",{"$nulls":6},""]
[128,null,null,"LIRE ET COMPRENDRE",{"$nulls":6},""]
[129,null,null,"Utiliser le contexte, les illustrations et les connaissances pour comprendre un texte.",{"$nulls":6},{"$f":"IF(COUNTIF(G144:J144,\">0\"),\"X\",\"\")","v":""}]
[130,null,null,"Reconnaitre des mots isolés dans un énoncé, un court texte.",{"$nulls":6},""]
[131,null,null,"S’appuyer sur des mots outils, des structures simples, des expressions rituelles.",{"$nulls":6},""]
[132,null,null,"Percevoir la relation entre certains graphèmes et phonèmes spécifiques à la langue.",{"$nulls":6},{"$f":"IF(COUNTIF(G147:J147,\">0\"),\"X\",\"\")","v":""}]
[133,null,null,"PARLER EN CONTINUE",{"$nulls":6},""]
[134,null,null,"Mémoriser et reproduire des énoncés.",{"$nulls":6},{"$f":"IF(COUNTIF(G149:J149,\"X\"),\"X\",\"\")","v":""}]
[{"$f":"A149+1","v":135},null,null,"S’exprimer de manière audible, en modulant débit et voix.",{"$nulls":6},{"$f":"IF(COUNTIF(G150:J150,\"X\"),\"X\",\"\")","v":""}]
[136,null,null,"Participer à des échanges simples ,pour être entendu et compris dans quelques situations diversifiées de la vie quotidienne.",{"$nulls":6},{"$f":"IF(COUNTIF(G151:J151,\"X\"),\"X\",\"\")","v":""}]
[137,null,null,"ECRIRE",{"$nulls":6},{"$f":"IF(COUNTIF(G152:J152,\"X\"),\"X\",\"\")","v":""}]
[138,null,null,"Écrire des mots et des expressions dont l’orthographe et la syntaxe ont été mémorisées. ",{"$nulls":6},{"$f":"IF(COUNTIF(G153:J153,\"X\"),\"X\",\"\")","v":""}]
[139,null,null,"Mobiliser des structures simples pour écrire des phrases en s’appuyant sur une trame connue.",{"$nulls":6},"x"]
[140,null,null,"REAGIR ET DIALOGUER",{"$nulls":6},{"$f":"K156","v":""}]
[141,null,null,"Poser des questions simples.",{"$nulls":6},{"$f":"IF(COUNTIF(D227,\"*\"),\"X\",\"\")","v":""}]
[142,null,null,"Mobiliser des énoncés adéquats au contexte dans une succession d’échanges ritualisés.",{"$nulls":6},{"$f":"K158","v":""}]
[143,null,null,"Utiliser des procédés très simples pour commencer, poursuivre et terminer une conversation brève.",{"$nulls":6},{"$f":"IF(COUNTIF(D229,\"*\"),\"X\",\"\")","v":""}]
[144,null,null,"ASPECTS CULTURELS",{"$nulls":6},"x"]
[145,null,null,"Identifier quelques grands repères culturels de l’environnement quotidien des élèves du même âge dans les pays ou régions étudiés.",{"$nulls":6},{"$f":"K161","v":""}]
[146,null,null,"Mobiliser ses connaissances culturelles pour décrire ou raconter des personnages réels ou imaginaires.",{"$nulls":6},{"$f":"IF(COUNTIF(D232,\"*\"),\"X\",\"\")","v":""}]
[147,null,"ARTS PLASTIQUES","EXPERIMENTER, PRODUIRE, CRÉER",{"$nulls":6},{"$f":"K163","v":""}]
[148,null,null,"Choisir, organiser et mobiliser des gestes, des outils et des matériaux en fonction des effets qu’ils produisent.",{"$nulls":6},{"$f":"IF(COUNTIF(D234,\"*\"),\"X\",\"\")","v":""}]
[149,null,null,"Représenter le monde environnant ou donner forme à son imaginaire en explorant divers domaines.",{"$nulls":6},"x"]
[150,null,null,"Rechercher une expression personnelle en s’éloignant des stéréotypes.",{"$nulls":6},"x"]
[151,null,null,"Intégrer l’usage des outils informatiques de travail de l’image et de recherche d’information, au service de la pratique plastique.",{"$nulls":6},"x"]
[152,null,null,"METTRE EN OEUVRE UN PROJET ARTISTIQUE"]
[153,null,null,"Identifier les principaux outils et compétences nécessaires à la réalisation d’un projet artistique."]
[154,null,null,"Se repérer dans les étapes de la réalisation d’une production plastique individuelle ou collective, anticiper les difficultés éventuelles."]
[155,null,null,"Identifier et assumer sa part de responsabilité dans un processus coopératif de création."]
[156,null,null,"Adapter son projet en fonction des contraintes de réalisation et de la prise en compte du spectateur."]
[157,null,null,"S'EXPRIMER, ANALYSER SA PRATIQUE, CELLE DE SES PAIRS"]
[158,null,null,"Décrire et interroger à l’aide d’un vocabulaire spécifique ses productions plastiques, celles de ses pairs et des œuvres d’art étudiées en classe."]
[159,null,null,"Justifier des choix pour rendre compte du cheminement qui conduit de l’intention à la réalisation."]
[160,null,null,"Formuler une expression juste de ses émotions, en prenant appui sur ses propres réalisations plastiques, celles des autres élèves et des œuvres d’art."]
[161,null,null,"SE REPERER DANS LES DOMAINES LIES AUX ARTS PLASTIQUES"]
[162,null,null,"Repérer, pour les dépasser, certains a priori et stéréotypes culturels et artistiques."]
[163,null,null,"Identifier quelques caractéristiques qui inscrivent une œuvre d’art dans une aire géographique ou culturelle et dans un temps historique, contemporain, proche ou lointain."]
[164,null,null,"Décrire des œuvres d’art, en proposer une compréhension personnelle argumentée."]
[165,null,"EDUCATION MUSICALE","CHANTER ET INTERPRETER"]
[166,null,null,"Reproduire et interpréter un modèle mélodique et rythmique."]
[167,null,null,"Interpréter un répertoire varié avec expressivité."]
[168,null,null,"ECOUTER, COMPARER ET COMMENTER"]
[169,null,null,"Décrire et comparer des éléments sonores issus de contextes musicaux différents."]
[170,null,null,"Identifier et nommer ressemblances et différences dans deux extraits musicaux."]
[171,null,null,"Identifier quelques caractéristiques qui inscrivent une œuvre musicale dans une aire géographique ou culturelle et dans un temps historique contemporain, proche ou lointain."]
[172,null,null,"EXPLORER, IMAGINER"]
[173,null,null,"Imaginer l’organisation de différents éléments sonores."]
[174,null,null,"Faire des propositions personnelles lors de moments de création, d’invention et d’interprétation."]
[175,null,null,"ECHANGER, PARTAGER"]
[176,null,null,"Argumenter un jugement sur une musique."]
[177,null,null,"Écouter et respecter le point de vue des autres et l’expression de leur sensibilité."]
[178,null,null,"HISTOIRE DES ARTS"]
[179,null,null,"Identifier : donner un avis argumenté sur ce que représente ou exprime une œuvre d’art. "]
[180,null,null,"Analyser : dégager d’une œuvre d’art, par l’observation ou l’écoute, ses principales caractéristiques techniques et formelles."]
[181,null,null,"Situer : relier des caractéristiques d’une œuvre d’art à des usages ainsi qu’au contexte historique et culturel de sa création."]
[182,null,null,"Se repérer dans un musée, un lieu d’art, un site patrimonial."]
[183,null,"EPS","DEVELOPPER SA MOTRICITE, LE LANGAGE DU CORPS "]
[184,null,null,"Adapter sa motricité à des situations variées."]
[185,null,null,"Acquérir des techniques spécifiques pour améliorer son efficacité."]
[186,null,null,"Mobiliser différentes ressources (physiologique, biomécanique, psychologique, émotionnelle) pour agir de manière efficiente."]
[187,null,null,"S’APPROPRIER LES MÉTHODES ET OUTILS POUR APPRENDRE"]
[188,null,null,"Apprendre par l’action, l’observation, l’analyse de son activité et de celle des autres. "]
[189,null,null,"Répéter un geste pour le stabiliser et le rendre plus efficace."]
[190,null,null,"Utiliser des outils numériques pour observer, évaluer et modifier ses actions."]
[191,null,null,"PARTAGER DES RÈGLES, ASSUMER DES RÔLES "]
[192,null,null,"Assumer les rôles sociaux  (joueur, arbitre,…)."]
[193,null,null,"Comprendre, respecter et faire respecter règles et règlements."]
[194,null,null,"Assurer sa sécurité et celle d’autrui dans des situations variées."]
[195,null,null,"S’engager dans les activités sportives et artistiques collectives."]
[196,null,null,"ENTRETENIR SA SANTÉ "]
[197,null,null,"Évaluer la quantité et la qualité de son activité physique quotidienne dans et hors l’école."]
[198,null,null,"Connaitre et appliquer des principes d’une bonne hygiène de vie."]
[{"$f":"A213+1","v":199},null,null,"Adapter l’intensité de son engagement physique à ses possibilités pour ne pas se mettre en danger."]
[200,null,null,"S’APPROPRIER UNE CULTURE PHYSIQUE SPORTIVE ET ARTISTIQUE "]
[201,null,null,"Savoir situer des performances à l’échelle de la performance humaine."]
[202,null,null,"Comprendre et respecter l’environnement des pratiques physiques et sportives."]
[203,null,"EMC","ENSEIGNEMENT CIVIQUE ET MORAL"]
[204,null,null," Identifier et partager des émotions, des sentiments dans des situations et à propos d'objets diversifiés."]
[205,null,null,"Se situer et s'exprimer en respectant les codes de la communication orale, les règles de l'échange et le statut de l'interlocuteur."]
[206,null,null,"Prendre soin de soi et des autres."]
[207,null,null,"Accepter les différences. "]
[208,null,null,"Identifier les symboles de la République présents dans l'école. "]
[209,null,null,"Apprendre à coopérer. "]
[210]
[211,null,null,"PARCOURS CITOYENS"]
[212]
[213,null,null,"PARCOURS ARTISTIQUE ET CULTUREL"]
[214]
[215]
[216,null,null,"Appréciations"]
[217]
[218,null,null,"Décision du conseil de cycle"]
[219]
[220]
[221,null,null,"Signatures"]
[222]
[222]
[223]
[224]
[225]
[226]

{"sheet":"Parcours","index":10,"n_rows":5,"n_cols":8,"rows_kept":5,"hidden":true}
[]
[{"$nulls":3},"PERIODE 1","PERIODE 2","PERIODE 3","PERIODE 4","PERIODE 5"]
[]
[null,"Parcours citoyen",null,"blabla"]
[null,"Parcours Artistique et culturel",null,"blablablabla"]